axis-java-dev mailing list archives

Site index · List index
Message view « Date » · « Thread »
Top « Date » · « Thread »
From Apache Jenkins Server <jenk...@builds.apache.org>
Subject Build failed in Jenkins: Axis2 #2442
Date Tue, 20 Aug 2013 00:40:35 GMT
See <https://builds.apache.org/job/Axis2/2442/>

------------------------------------------
[...truncated 3637 lines...]
Generating <https://builds.apache.org/job/Axis2/ws/axis2/modules/transport/testkit/target/apidocs/org/apache/axis2/transport/testkit/doclet//class-use/Dependency.html...>
Generating <https://builds.apache.org/job/Axis2/ws/axis2/modules/transport/testkit/target/apidocs/org/apache/axis2/transport/testkit/doclet//class-use/Resource.html...>
Generating <https://builds.apache.org/job/Axis2/ws/axis2/modules/transport/testkit/target/apidocs/org/apache/axis2/transport/testkit/doclet//class-use/ResourceInfoDoclet.html...>
Generating <https://builds.apache.org/job/Axis2/ws/axis2/modules/transport/testkit/target/apidocs/org/apache/axis2/transport/testkit/doclet//class-use/ResourceInfo.html...>
Generating <https://builds.apache.org/job/Axis2/ws/axis2/modules/transport/testkit/target/apidocs/org/apache/axis2/transport/testkit/tests//class-use/ManagedTestCase.html...>
Generating <https://builds.apache.org/job/Axis2/ws/axis2/modules/transport/testkit/target/apidocs/org/apache/axis2/transport/testkit/tests//class-use/MessageTestCase.html...>
Generating <https://builds.apache.org/job/Axis2/ws/axis2/modules/transport/testkit/target/apidocs/org/apache/axis2/transport/testkit/tests//class-use/Transient.html...>
Generating <https://builds.apache.org/job/Axis2/ws/axis2/modules/transport/testkit/target/apidocs/org/apache/axis2/transport/testkit/tests//class-use/TearDown.html...>
Generating <https://builds.apache.org/job/Axis2/ws/axis2/modules/transport/testkit/target/apidocs/org/apache/axis2/transport/testkit/tests//class-use/TestResourceSet.html...>
Generating <https://builds.apache.org/job/Axis2/ws/axis2/modules/transport/testkit/target/apidocs/org/apache/axis2/transport/testkit/tests//class-use/TestResourceSetTransition.html...>
Generating <https://builds.apache.org/job/Axis2/ws/axis2/modules/transport/testkit/target/apidocs/org/apache/axis2/transport/testkit/tests//class-use/Setup.html...>
Generating <https://builds.apache.org/job/Axis2/ws/axis2/modules/transport/testkit/target/apidocs/org/apache/axis2/transport/testkit/tests//class-use/TestResource.html...>
Generating <https://builds.apache.org/job/Axis2/ws/axis2/modules/transport/testkit/target/apidocs/org/apache/axis2/transport/testkit/tests/async//class-use/SwATestCase.html...>
Generating <https://builds.apache.org/job/Axis2/ws/axis2/modules/transport/testkit/target/apidocs/org/apache/axis2/transport/testkit/tests/async//class-use/XMLAsyncMessageTestCase.html...>
Generating <https://builds.apache.org/job/Axis2/ws/axis2/modules/transport/testkit/target/apidocs/org/apache/axis2/transport/testkit/tests/async//class-use/TextPlainTestCase.html...>
Generating <https://builds.apache.org/job/Axis2/ws/axis2/modules/transport/testkit/target/apidocs/org/apache/axis2/transport/testkit/tests/async//class-use/AsyncMessageTestCase.html...>
Generating <https://builds.apache.org/job/Axis2/ws/axis2/modules/transport/testkit/target/apidocs/org/apache/axis2/transport/testkit/tests/async//class-use/RESTTestCase.html...>
Generating <https://builds.apache.org/job/Axis2/ws/axis2/modules/transport/testkit/target/apidocs/org/apache/axis2/transport/testkit/tests/async//class-use/LargeSOAPAsyncMessageTestCase.html...>
Generating <https://builds.apache.org/job/Axis2/ws/axis2/modules/transport/testkit/target/apidocs/org/apache/axis2/transport/testkit/tests/async//class-use/BinaryTestCase.html...>
Generating <https://builds.apache.org/job/Axis2/ws/axis2/modules/transport/testkit/target/apidocs/org/apache/axis2/transport/testkit/tests/misc//class-use/MinConcurrencyTest.html...>
Generating <https://builds.apache.org/job/Axis2/ws/axis2/modules/transport/testkit/target/apidocs/org/apache/axis2/transport/testkit/tests/echo//class-use/XMLRequestResponseMessageTestCase.html...>
Generating <https://builds.apache.org/job/Axis2/ws/axis2/modules/transport/testkit/target/apidocs/org/apache/axis2/transport/testkit/tests/echo//class-use/InterruptingEndpointErrorListener.html...>
Generating <https://builds.apache.org/job/Axis2/ws/axis2/modules/transport/testkit/target/apidocs/org/apache/axis2/transport/testkit/tests/echo//class-use/RequestResponseMessageTestCase.html...>
Generating <https://builds.apache.org/job/Axis2/ws/axis2/modules/transport/testkit/target/apidocs/org/apache/axis2/transport//package-use.html...>
Generating <https://builds.apache.org/job/Axis2/ws/axis2/modules/transport/testkit/target/apidocs/org/apache/axis2/transport/testkit//package-use.html...>
Generating <https://builds.apache.org/job/Axis2/ws/axis2/modules/transport/testkit/target/apidocs/org/apache/axis2/transport/testkit/axis2//package-use.html...>
Generating <https://builds.apache.org/job/Axis2/ws/axis2/modules/transport/testkit/target/apidocs/org/apache/axis2/transport/testkit/axis2/client//package-use.html...>
Generating <https://builds.apache.org/job/Axis2/ws/axis2/modules/transport/testkit/target/apidocs/org/apache/axis2/transport/testkit/axis2/endpoint//package-use.html...>
Generating <https://builds.apache.org/job/Axis2/ws/axis2/modules/transport/testkit/target/apidocs/org/apache/axis2/transport/testkit/axis2/util//package-use.html...>
Generating <https://builds.apache.org/job/Axis2/ws/axis2/modules/transport/testkit/target/apidocs/org/apache/axis2/transport/testkit/channel//package-use.html...>
Generating <https://builds.apache.org/job/Axis2/ws/axis2/modules/transport/testkit/target/apidocs/org/apache/axis2/transport/testkit/client//package-use.html...>
Generating <https://builds.apache.org/job/Axis2/ws/axis2/modules/transport/testkit/target/apidocs/org/apache/axis2/transport/testkit/doclet//package-use.html...>
Generating <https://builds.apache.org/job/Axis2/ws/axis2/modules/transport/testkit/target/apidocs/org/apache/axis2/transport/testkit/endpoint//package-use.html...>
Generating <https://builds.apache.org/job/Axis2/ws/axis2/modules/transport/testkit/target/apidocs/org/apache/axis2/transport/testkit/filter//package-use.html...>
Generating <https://builds.apache.org/job/Axis2/ws/axis2/modules/transport/testkit/target/apidocs/org/apache/axis2/transport/testkit/http//package-use.html...>
Generating <https://builds.apache.org/job/Axis2/ws/axis2/modules/transport/testkit/target/apidocs/org/apache/axis2/transport/testkit/message//package-use.html...>
Generating <https://builds.apache.org/job/Axis2/ws/axis2/modules/transport/testkit/target/apidocs/org/apache/axis2/transport/testkit/name//package-use.html...>
Generating <https://builds.apache.org/job/Axis2/ws/axis2/modules/transport/testkit/target/apidocs/org/apache/axis2/transport/testkit/tests//package-use.html...>
Generating <https://builds.apache.org/job/Axis2/ws/axis2/modules/transport/testkit/target/apidocs/org/apache/axis2/transport/testkit/tests/async//package-use.html...>
Generating <https://builds.apache.org/job/Axis2/ws/axis2/modules/transport/testkit/target/apidocs/org/apache/axis2/transport/testkit/tests/echo//package-use.html...>
Generating <https://builds.apache.org/job/Axis2/ws/axis2/modules/transport/testkit/target/apidocs/org/apache/axis2/transport/testkit/tests/misc//package-use.html...>
Generating <https://builds.apache.org/job/Axis2/ws/axis2/modules/transport/testkit/target/apidocs/org/apache/axis2/transport/testkit/util//package-use.html...>
Generating <https://builds.apache.org/job/Axis2/ws/axis2/modules/transport/testkit/target/apidocs/org/apache/axis2/transport/testkit/util/tcpmon//package-use.html...>
Building index for all the packages and classes...
Generating <https://builds.apache.org/job/Axis2/ws/axis2/modules/transport/testkit/target/apidocs/overview-tree.html...>
Generating <https://builds.apache.org/job/Axis2/ws/axis2/modules/transport/testkit/target/apidocs/index-all.html...>
Generating <https://builds.apache.org/job/Axis2/ws/axis2/modules/transport/testkit/target/apidocs/deprecated-list.html...>
Building index for all classes...
Generating <https://builds.apache.org/job/Axis2/ws/axis2/modules/transport/testkit/target/apidocs/allclasses-frame.html...>
Generating <https://builds.apache.org/job/Axis2/ws/axis2/modules/transport/testkit/target/apidocs/allclasses-noframe.html...>
Generating <https://builds.apache.org/job/Axis2/ws/axis2/modules/transport/testkit/target/apidocs/index.html...>
Generating <https://builds.apache.org/job/Axis2/ws/axis2/modules/transport/testkit/target/apidocs/overview-summary.html...>
Generating <https://builds.apache.org/job/Axis2/ws/axis2/modules/transport/testkit/target/apidocs/help-doc.html...>
Generating <https://builds.apache.org/job/Axis2/ws/axis2/modules/transport/testkit/target/apidocs/stylesheet.css...>
4 warnings
[WARNING] Javadoc Warnings
[WARNING] <https://builds.apache.org/job/Axis2/ws/axis2/modules/transport/testkit/src/main/java/org/apache/axis2/transport/AbstractTransportTest.java>:62:
warning - @return tag has no arguments.
[WARNING] <https://builds.apache.org/job/Axis2/ws/axis2/modules/transport/testkit/src/main/java/org/apache/axis2/transport/AbstractTransportTest.java>:105:
warning - @return tag has no arguments.
[WARNING] <https://builds.apache.org/job/Axis2/ws/axis2/modules/transport/testkit/src/main/java/org/apache/axis2/transport/testkit/message/AxisMessage.java>:35:
warning - Tag @link: reference not found: MockMessageReceiver
[WARNING] <https://builds.apache.org/job/Axis2/ws/axis2/modules/transport/testkit/src/main/java/org/apache/axis2/transport/testkit/package-info.java>:293:
warning - Tag @link: reference not found: junit.framework.TestCase.TestCase
[INFO] Building jar: <https://builds.apache.org/job/Axis2/ws/axis2/modules/transport/testkit/target/axis2-transport-testkit-1.7.0-SNAPSHOT-javadoc.jar>
Aug 20, 2013 12:31:12 AM org.apache.maven.cli.event.ExecutionEventLogger mojoStarted
INFO: 
Aug 20, 2013 12:31:12 AM org.apache.maven.cli.event.ExecutionEventLogger mojoStarted
INFO: --- maven-gpg-plugin:1.1:sign (default) @ axis2-transport-testkit ---
Aug 20, 2013 12:31:12 AM org.apache.maven.cli.event.ExecutionEventLogger mojoStarted
INFO: 
Aug 20, 2013 12:31:12 AM org.apache.maven.cli.event.ExecutionEventLogger mojoStarted
INFO: --- maven-install-plugin:2.2:install (default-install) @ axis2-transport-testkit ---
[INFO] Installing <https://builds.apache.org/job/Axis2/ws/axis2/modules/transport/testkit/target/axis2-transport-testkit-1.7.0-SNAPSHOT.jar>
to <https://builds.apache.org/job/Axis2/ws/.repository/org/apache/axis2/axis2-transport-testkit/1.7.0-SNAPSHOT/axis2-transport-testkit-1.7.0-SNAPSHOT.jar>
[INFO] Installing <https://builds.apache.org/job/Axis2/ws/axis2/modules/transport/testkit/pom.xml>
to <https://builds.apache.org/job/Axis2/ws/.repository/org/apache/axis2/axis2-transport-testkit/1.7.0-SNAPSHOT/axis2-transport-testkit-1.7.0-SNAPSHOT.pom>
[INFO] Installing <https://builds.apache.org/job/Axis2/ws/axis2/modules/transport/testkit/target/axis2-transport-testkit-1.7.0-SNAPSHOT-sources.jar>
to <https://builds.apache.org/job/Axis2/ws/.repository/org/apache/axis2/axis2-transport-testkit/1.7.0-SNAPSHOT/axis2-transport-testkit-1.7.0-SNAPSHOT-sources.jar>
[INFO] Installing <https://builds.apache.org/job/Axis2/ws/axis2/modules/transport/testkit/target/axis2-transport-testkit-1.7.0-SNAPSHOT-javadoc.jar>
to <https://builds.apache.org/job/Axis2/ws/.repository/org/apache/axis2/axis2-transport-testkit/1.7.0-SNAPSHOT/axis2-transport-testkit-1.7.0-SNAPSHOT-javadoc.jar>
Aug 20, 2013 12:31:12 AM org.apache.maven.cli.event.ExecutionEventLogger mojoStarted
INFO: 
Aug 20, 2013 12:31:12 AM org.apache.maven.cli.event.ExecutionEventLogger mojoStarted
INFO: --- maven-deploy-plugin:2.5:deploy (default-deploy) @ axis2-transport-testkit ---
Downloading: https://repository.apache.org/content/repositories/snapshots/org/apache/axis2/axis2-transport-testkit/1.7.0-SNAPSHOT/maven-metadata.xml
Downloaded: https://repository.apache.org/content/repositories/snapshots/org/apache/axis2/axis2-transport-testkit/1.7.0-SNAPSHOT/maven-metadata.xml
(2 KB at 2.9 KB/sec)
Uploading: https://repository.apache.org/content/repositories/snapshots/org/apache/axis2/axis2-transport-testkit/1.7.0-SNAPSHOT/axis2-transport-testkit-1.7.0-20130820.003112-1139.jar
Uploaded: https://repository.apache.org/content/repositories/snapshots/org/apache/axis2/axis2-transport-testkit/1.7.0-SNAPSHOT/axis2-transport-testkit-1.7.0-20130820.003112-1139.jar
(204 KB at 360.2 KB/sec)
Uploading: https://repository.apache.org/content/repositories/snapshots/org/apache/axis2/axis2-transport-testkit/1.7.0-SNAPSHOT/axis2-transport-testkit-1.7.0-20130820.003112-1139.pom
Uploaded: https://repository.apache.org/content/repositories/snapshots/org/apache/axis2/axis2-transport-testkit/1.7.0-SNAPSHOT/axis2-transport-testkit-1.7.0-20130820.003112-1139.pom
(10 KB at 24.1 KB/sec)
Downloading: https://repository.apache.org/content/repositories/snapshots/org/apache/axis2/axis2-transport-testkit/maven-metadata.xml
Downloaded: https://repository.apache.org/content/repositories/snapshots/org/apache/axis2/axis2-transport-testkit/maven-metadata.xml
(479 B at 1.8 KB/sec)
Uploading: https://repository.apache.org/content/repositories/snapshots/org/apache/axis2/axis2-transport-testkit/1.7.0-SNAPSHOT/maven-metadata.xml
Uploaded: https://repository.apache.org/content/repositories/snapshots/org/apache/axis2/axis2-transport-testkit/1.7.0-SNAPSHOT/maven-metadata.xml
(2 KB at 3.7 KB/sec)
Uploading: https://repository.apache.org/content/repositories/snapshots/org/apache/axis2/axis2-transport-testkit/maven-metadata.xml
Uploaded: https://repository.apache.org/content/repositories/snapshots/org/apache/axis2/axis2-transport-testkit/maven-metadata.xml
(479 B at 1.2 KB/sec)
Uploading: https://repository.apache.org/content/repositories/snapshots/org/apache/axis2/axis2-transport-testkit/1.7.0-SNAPSHOT/axis2-transport-testkit-1.7.0-20130820.003112-1139-sources.jar
Uploaded: https://repository.apache.org/content/repositories/snapshots/org/apache/axis2/axis2-transport-testkit/1.7.0-SNAPSHOT/axis2-transport-testkit-1.7.0-20130820.003112-1139-sources.jar
(172 KB at 324.9 KB/sec)
Uploading: https://repository.apache.org/content/repositories/snapshots/org/apache/axis2/axis2-transport-testkit/1.7.0-SNAPSHOT/maven-metadata.xml
Uploaded: https://repository.apache.org/content/repositories/snapshots/org/apache/axis2/axis2-transport-testkit/1.7.0-SNAPSHOT/maven-metadata.xml
(2 KB at 3.3 KB/sec)
Uploading: https://repository.apache.org/content/repositories/snapshots/org/apache/axis2/axis2-transport-testkit/1.7.0-SNAPSHOT/axis2-transport-testkit-1.7.0-20130820.003112-1139-javadoc.jar
Uploaded: https://repository.apache.org/content/repositories/snapshots/org/apache/axis2/axis2-transport-testkit/1.7.0-SNAPSHOT/axis2-transport-testkit-1.7.0-20130820.003112-1139-javadoc.jar
(639 KB at 849.0 KB/sec)
Uploading: https://repository.apache.org/content/repositories/snapshots/org/apache/axis2/axis2-transport-testkit/1.7.0-SNAPSHOT/maven-metadata.xml
Uploaded: https://repository.apache.org/content/repositories/snapshots/org/apache/axis2/axis2-transport-testkit/1.7.0-SNAPSHOT/maven-metadata.xml
(2 KB at 3.4 KB/sec)
Aug 20, 2013 12:31:17 AM org.apache.maven.cli.event.ExecutionEventLogger projectStarted
INFO:                                                                         
Aug 20, 2013 12:31:17 AM org.apache.maven.cli.event.ExecutionEventLogger projectStarted
INFO: ------------------------------------------------------------------------
Aug 20, 2013 12:31:17 AM org.apache.maven.cli.event.ExecutionEventLogger projectStarted
INFO: Building Apache Axis2 - Transport - HTTP 1.7.0-SNAPSHOT
Aug 20, 2013 12:31:17 AM org.apache.maven.cli.event.ExecutionEventLogger projectStarted
INFO: ------------------------------------------------------------------------
Aug 20, 2013 12:31:17 AM org.apache.maven.cli.event.ExecutionEventLogger mojoStarted
INFO: 
Aug 20, 2013 12:31:17 AM org.apache.maven.cli.event.ExecutionEventLogger mojoStarted
INFO: --- maven-clean-plugin:2.2:clean (default-clean) @ axis2-transport-http ---
[INFO] Deleting directory <https://builds.apache.org/job/Axis2/ws/axis2/modules/transport/http/target>
Aug 20, 2013 12:31:18 AM org.apache.maven.cli.event.ExecutionEventLogger mojoStarted
INFO: 
Aug 20, 2013 12:31:18 AM org.apache.maven.cli.event.ExecutionEventLogger mojoStarted
INFO: --- maven-enforcer-plugin:1.1:enforce (default) @ axis2-transport-http ---
Aug 20, 2013 12:31:18 AM org.apache.maven.cli.event.ExecutionEventLogger mojoStarted
INFO: 
Aug 20, 2013 12:31:18 AM org.apache.maven.cli.event.ExecutionEventLogger mojoStarted
INFO: --- maven-remote-resources-plugin:1.1:process (default) @ axis2-transport-http ---
Aug 20, 2013 12:31:18 AM org.apache.maven.cli.event.ExecutionEventLogger mojoStarted
INFO: 
Aug 20, 2013 12:31:18 AM org.apache.maven.cli.event.ExecutionEventLogger mojoStarted
INFO: --- maven-resources-plugin:2.4.2:resources (default-resources) @ axis2-transport-http
---
[INFO] Using 'UTF-8' encoding to copy filtered resources.
[INFO] skip non existing resourceDirectory <https://builds.apache.org/job/Axis2/ws/axis2/modules/transport/http/conf>
[INFO] Copying 0 resource
[INFO] Copying 2 resources
Aug 20, 2013 12:31:19 AM org.apache.maven.cli.event.ExecutionEventLogger mojoStarted
INFO: 
Aug 20, 2013 12:31:19 AM org.apache.maven.cli.event.ExecutionEventLogger mojoStarted
INFO: --- maven-compiler-plugin:2.3.1:compile (default-compile) @ axis2-transport-http ---
[INFO] Compiling 67 source files to <https://builds.apache.org/job/Axis2/ws/axis2/modules/transport/http/target/classes>
Aug 20, 2013 12:31:20 AM org.apache.maven.cli.event.ExecutionEventLogger mojoStarted
INFO: 
Aug 20, 2013 12:31:20 AM org.apache.maven.cli.event.ExecutionEventLogger mojoStarted
INFO: --- maven-resources-plugin:2.4.2:testResources (default-testResources) @ axis2-transport-http
---
[INFO] Using 'UTF-8' encoding to copy filtered resources.
[INFO] Copying 3 resources
[INFO] Copying 2 resources
Aug 20, 2013 12:31:21 AM org.apache.maven.cli.event.ExecutionEventLogger mojoStarted
INFO: 
Aug 20, 2013 12:31:21 AM org.apache.maven.cli.event.ExecutionEventLogger mojoStarted
INFO: --- maven-compiler-plugin:2.3.1:testCompile (default-testCompile) @ axis2-transport-http
---
[INFO] Compiling 18 source files to <https://builds.apache.org/job/Axis2/ws/axis2/modules/transport/http/target/test-classes>
Aug 20, 2013 12:31:22 AM org.apache.maven.cli.event.ExecutionEventLogger mojoStarted
INFO: 
Aug 20, 2013 12:31:22 AM org.apache.maven.cli.event.ExecutionEventLogger mojoStarted
INFO: --- maven-surefire-plugin:2.13:test (default-test) @ axis2-transport-http ---
[INFO] Surefire report directory: <https://builds.apache.org/job/Axis2/ws/axis2/modules/transport/http/target/surefire-reports>

-------------------------------------------------------
 T E S T S
-------------------------------------------------------
Running org.apache.axis2.transport.server.SessionManagerTest
Tests run: 1, Failures: 0, Errors: 0, Skipped: 0, Time elapsed: 0.073 sec
Running org.apache.axis2.transport.http.HTTPClient4TransportSenderTest
Tests run: 4, Failures: 0, Errors: 0, Skipped: 0, Time elapsed: 0.257 sec
Running org.apache.axis2.transport.http.HTTPWorkerTest
Tests run: 1, Failures: 0, Errors: 0, Skipped: 0, Time elapsed: 0.139 sec
Running org.apache.axis2.transport.http.HTTPClient3SenderTest
Tests run: 11, Failures: 0, Errors: 0, Skipped: 0, Time elapsed: 0.253 sec
Running org.apache.axis2.transport.http.HTTPClient3TransportSenderTest
Tests run: 4, Failures: 0, Errors: 0, Skipped: 0, Time elapsed: 0.003 sec
Running org.apache.axis2.transport.http.SimpleHTTPServerTest
Tests run: 65, Failures: 0, Errors: 0, Skipped: 0, Time elapsed: 18.129 sec
Running org.apache.axis2.transport.http.HTTPClient4SenderTest
Tests run: 11, Failures: 0, Errors: 0, Skipped: 0, Time elapsed: 0.219 sec
Running org.apache.axis2.transport.http.CommonsHTTPTransportSenderClientSideTest
Tests run: 2, Failures: 0, Errors: 0, Skipped: 0, Time elapsed: 0.324 sec

Results :

Tests run: 99, Failures: 0, Errors: 0, Skipped: 0

[locks-and-latches] Releasing all the locks
[locks-and-latches] All the locks released
ERROR: Processing failed due to a bug in the code. Please report this to jenkinsci-users@googlegroups.com
hudson.remoting.RequestAbortedException: hudson.remoting.RequestAbortedException: hudson.remoting.DiagnosedStreamCorruptionException
Read ahead: 00000000aa01fd0600000058000000430da4e0310000008254afe0ec6c2f75557f
	at hudson.remoting.RequestAbortedException.wrapForRethrow(RequestAbortedException.java:41)
	at hudson.remoting.RequestAbortedException.wrapForRethrow(RequestAbortedException.java:34)
	at hudson.remoting.Request.call(Request.java:174)
	at hudson.remoting.Channel.call(Channel.java:714)
	at hudson.maven.ProcessCache$MavenProcess.call(ProcessCache.java:160)
	at hudson.maven.MavenModuleSetBuild$MavenModuleSetBuildExecution.doRun(MavenModuleSetBuild.java:813)
	at hudson.model.AbstractBuild$AbstractBuildExecution.run(AbstractBuild.java:586)
	at hudson.model.Run.execute(Run.java:1597)
	at hudson.maven.MavenModuleSetBuild.run(MavenModuleSetBuild.java:506)
	at hudson.model.ResourceController.execute(ResourceController.java:88)
	at hudson.model.Executor.run(Executor.java:247)
Caused by: hudson.remoting.RequestAbortedException: hudson.remoting.DiagnosedStreamCorruptionException
Read ahead: 00000000aa01fd0600000058000000430da4e0310000008254afe0ec6c2f75557f
	at hudson.remoting.Request.abort(Request.java:299)
	at hudson.remoting.Channel.terminate(Channel.java:774)
	at hudson.slaves.Channels$1.terminate(Channels.java:77)
	at hudson.remoting.SynchronousCommandTransport$ReaderThread.run(SynchronousCommandTransport.java:69)
Caused by: hudson.remoting.DiagnosedStreamCorruptionException
Read ahead: 00000000aa01fd0600000058000000430da4e0310000008254afe0ec6c2f75557f
	at hudson.remoting.ClassicCommandTransport.diagnoseStreamCorruption(ClassicCommandTransport.java:118)
	at hudson.remoting.ClassicCommandTransport.read(ClassicCommandTransport.java:74)
	at hudson.remoting.SynchronousCommandTransport$ReaderThread.run(SynchronousCommandTransport.java:48)
Caused by: java.io.StreamCorruptedException: invalid type code: 07
	at java.io.ObjectInputStream.readObject0(ObjectInputStream.java:1375)
	at java.io.ObjectInputStream.defaultReadFields(ObjectInputStream.java:1989)
	at java.io.ObjectInputStream.readSerialData(ObjectInputStream.java:1913)
	at java.io.ObjectInputStream.readOrdinaryObject(ObjectInputStream.java:1796)
	at java.io.ObjectInputStream.readObject0(ObjectInputStream.java:1348)
	at java.io.ObjectInputStream.readObject(ObjectInputStream.java:370)
	at hudson.remoting.Command.readFrom(Command.java:92)
	at hudson.remoting.ClassicCommandTransport.read(ClassicCommandTransport.java:72)
	... 1 more
project=hudson.maven.MavenModuleSet@2650ceaf[Axis2]
project.getModules()=[hudson.maven.MavenModule@3f9fb3d[Axis2/org.apache.axis2:addressing][Axis2/org.apache.axis2:addressing][relativePath:modules/addressing],
hudson.maven.MavenModule@561e6ae7[Axis2/org.apache.axis2:axis2][Axis2/org.apache.axis2:axis2][relativePath:],
hudson.maven.MavenModule@1bbd10ee[Axis2/org.apache.axis2:axis2-aar-maven-plugin][Axis2/org.apache.axis2:axis2-aar-maven-plugin][relativePath:modules/tool/axis2-aar-maven-plugin],
hudson.maven.MavenModule@1378dde4[Axis2/org.apache.axis2:axis2-adb][Axis2/org.apache.axis2:axis2-adb][relativePath:modules/adb],
hudson.maven.MavenModule@b690f4f[Axis2/org.apache.axis2:axis2-adb-codegen][Axis2/org.apache.axis2:axis2-adb-codegen][relativePath:modules/adb-codegen],
hudson.maven.MavenModule@7d90a9bf[Axis2/org.apache.axis2:axis2-all][Axis2/org.apache.axis2:axis2-all][relativePath:modules/all],
hudson.maven.MavenModule@4a978910[Axis2/org.apache.axis2:axis2-ant-plugin][Axis2/org.apache.axis2:axis2-ant-plugin][relativePath:modules/tool/axis2-ant-plugin],
hudson.maven.MavenModule@367c932a[Axis2/org.apache.axis2:axis2-clustering][Axis2/org.apache.axis2:axis2-clustering][relativePath:modules/clustering],
hudson.maven.MavenModule@7830a8cc[Axis2/org.apache.axis2:axis2-codegen][Axis2/org.apache.axis2:axis2-codegen][relativePath:modules/codegen],
hudson.maven.MavenModule@617b1940[Axis2/org.apache.axis2:axis2-corba][Axis2/org.apache.axis2:axis2-corba][relativePath:modules/corba],
hudson.maven.MavenModule@19596f71[Axis2/org.apache.axis2:axis2-fastinfoset][Axis2/org.apache.axis2:axis2-fastinfoset][relativePath:modules/fastinfoset],
hudson.maven.MavenModule@1360003f[Axis2/org.apache.axis2:axis2-idea-plugin][Axis2/org.apache.axis2:axis2-idea-plugin][relativePath:modules/tool/axis2-idea-plugin],
hudson.maven.MavenModule@62738171[Axis2/org.apache.axis2:axis2-integration][Axis2/org.apache.axis2:axis2-integration][relativePath:modules/integration],
hudson.maven.MavenModule@64f0f507[Axis2/org.apache.axis2:axis2-java2wsdl][Axis2/org.apache.axis2:axis2-java2wsdl][relativePath:modules/java2wsdl],
hudson.maven.MavenModule@299032c[Axis2/org.apache.axis2:axis2-java2wsdl-maven-plugin][Axis2/org.apache.axis2:axis2-java2wsdl-maven-plugin][relativePath:modules/tool/axis2-java2wsdl-maven-plugin],
hudson.maven.MavenModule@3a905060[Axis2/org.apache.axis2:axis2-jaxbri][Axis2/org.apache.axis2:axis2-jaxbri][relativePath:modules/jaxbri],
hudson.maven.MavenModule@16146ab3[Axis2/org.apache.axis2:axis2-jaxws][Axis2/org.apache.axis2:axis2-jaxws][relativePath:modules/jaxws],
hudson.maven.MavenModule@22e1f839[Axis2/org.apache.axis2:axis2-jaxws-integration][Axis2/org.apache.axis2:axis2-jaxws-integration][relativePath:modules/jaxws-integration],
hudson.maven.MavenModule@478ede8d[Axis2/org.apache.axis2:axis2-jaxws-mar][Axis2/org.apache.axis2:axis2-jaxws-mar][relativePath:modules/jaxws-mar],
hudson.maven.MavenModule@55dcef2c[Axis2/org.apache.axis2:axis2-jibx][Axis2/org.apache.axis2:axis2-jibx][relativePath:modules/jibx],
hudson.maven.MavenModule@10c12304[Axis2/org.apache.axis2:axis2-json][Axis2/org.apache.axis2:axis2-json][relativePath:modules/json],
hudson.maven.MavenModule@1c79352e[Axis2/org.apache.axis2:axis2-kernel][Axis2/org.apache.axis2:axis2-kernel][relativePath:modules/kernel],
hudson.maven.MavenModule@7a5affef[Axis2/org.apache.axis2:axis2-mar-maven-plugin][Axis2/org.apache.axis2:axis2-mar-maven-plugin][relativePath:modules/tool/axis2-mar-maven-plugin],
hudson.maven.MavenModule@22f99011[Axis2/org.apache.axis2:axis2-metadata][Axis2/org.apache.axis2:axis2-metadata][relativePath:modules/metadata],
hudson.maven.MavenModule@32ab3291[Axis2/org.apache.axis2:axis2-mtompolicy][Axis2/org.apache.axis2:axis2-mtompolicy][relativePath:modules/mtompolicy],
hudson.maven.MavenModule@6bf14c87[Axis2/org.apache.axis2:axis2-parent][Axis2/org.apache.axis2:axis2-parent][relativePath:modules/parent],
hudson.maven.MavenModule@816f189[Axis2/org.apache.axis2:axis2-repo-maven-plugin][Axis2/org.apache.axis2:axis2-repo-maven-plugin][relativePath:modules/tool/axis2-repo-maven-plugin],
hudson.maven.MavenModule@7d47aab5[Axis2/org.apache.axis2:axis2-resource-bundle][Axis2/org.apache.axis2:axis2-resource-bundle][relativePath:modules/resource-bundle],
hudson.maven.MavenModule@268c1aff[Axis2/org.apache.axis2:axis2-saaj][Axis2/org.apache.axis2:axis2-saaj][relativePath:modules/saaj],
hudson.maven.MavenModule@7d15936c[Axis2/org.apache.axis2:axis2-samples][Axis2/org.apache.axis2:axis2-samples][relativePath:modules/samples],
hudson.maven.MavenModule@4b56fba3[Axis2/org.apache.axis2:axis2-scripting][Axis2/org.apache.axis2:axis2-scripting][relativePath:modules/scripting],
hudson.maven.MavenModule@232898ed[Axis2/org.apache.axis2:axis2-soapmonitor-servlet][Axis2/org.apache.axis2:axis2-soapmonitor-servlet][relativePath:modules/soapmonitor/servlet],
hudson.maven.MavenModule@519386b1[Axis2/org.apache.axis2:axis2-spring][Axis2/org.apache.axis2:axis2-spring][relativePath:modules/spring],
hudson.maven.MavenModule@4416025d[Axis2/org.apache.axis2:axis2-testutils][Axis2/org.apache.axis2:axis2-testutils][relativePath:modules/testutils],
hudson.maven.MavenModule@3e2be06d[Axis2/org.apache.axis2:axis2-transport-base][Axis2/org.apache.axis2:axis2-transport-base][relativePath:modules/transport/base],
hudson.maven.MavenModule@3ef1c34b[Axis2/org.apache.axis2:axis2-transport-http][Axis2/org.apache.axis2:axis2-transport-http][relativePath:modules/transport/http],
hudson.maven.MavenModule@6602ad6c[Axis2/org.apache.axis2:axis2-transport-jms][Axis2/org.apache.axis2:axis2-transport-jms][relativePath:modules/transport/jms],
hudson.maven.MavenModule@174d2b86[Axis2/org.apache.axis2:axis2-transport-local][Axis2/org.apache.axis2:axis2-transport-local][relativePath:modules/transport/local],
hudson.maven.MavenModule@568bddd7[Axis2/org.apache.axis2:axis2-transport-mail][Axis2/org.apache.axis2:axis2-transport-mail][relativePath:modules/transport/mail],
hudson.maven.MavenModule@776498ff[Axis2/org.apache.axis2:axis2-transport-tcp][Axis2/org.apache.axis2:axis2-transport-tcp][relativePath:modules/transport/tcp],
hudson.maven.MavenModule@e3a39bc[Axis2/org.apache.axis2:axis2-transport-testkit][Axis2/org.apache.axis2:axis2-transport-testkit][relativePath:modules/transport/testkit],
hudson.maven.MavenModule@3a863bfb[Axis2/org.apache.axis2:axis2-transport-udp][Axis2/org.apache.axis2:axis2-transport-udp][relativePath:modules/transport/udp],
hudson.maven.MavenModule@4e9aa70a[Axis2/org.apache.axis2:axis2-transport-xmpp][Axis2/org.apache.axis2:axis2-transport-xmpp][relativePath:modules/transport/xmpp],
hudson.maven.MavenModule@6103da3f[Axis2/org.apache.axis2:axis2-webapp][Axis2/org.apache.axis2:axis2-webapp][relativePath:modules/webapp],
hudson.maven.MavenModule@22db2bde[Axis2/org.apache.axis2:axis2-wsdl2code-maven-plugin][Axis2/org.apache.axis2:axis2-wsdl2code-maven-plugin][relativePath:modules/tool/axis2-wsdl2code-maven-plugin],
hudson.maven.MavenModule@6d3f2bef[Axis2/org.apache.axis2:axis2-xmlbeans][Axis2/org.apache.axis2:axis2-xmlbeans][relativePath:modules/xmlbeans],
hudson.maven.MavenModule@6d405c3f[Axis2/org.apache.axis2:axis2.eclipse.codegen.plugin][Axis2/org.apache.axis2:axis2.eclipse.codegen.plugin][relativePath:modules/tool/axis2-eclipse-codegen-plugin],
hudson.maven.MavenModule@6c371bc8[Axis2/org.apache.axis2:axis2.eclipse.service.plugin][Axis2/org.apache.axis2:axis2.eclipse.service.plugin][relativePath:modules/tool/axis2-eclipse-service-plugin],
hudson.maven.MavenModule@2b830e49[Axis2/org.apache.axis2:distribution][Axis2/org.apache.axis2:distribution][relativePath:modules/distribution],
hudson.maven.MavenModule@1c92cc2f[Axis2/org.apache.axis2:documentation][Axis2/org.apache.axis2:documentation][relativePath:modules/documentation],
hudson.maven.MavenModule@58d8620f[Axis2/org.apache.axis2:mex][Axis2/org.apache.axis2:mex][relativePath:modules/mex],
hudson.maven.MavenModule@3433c641[Axis2/org.apache.axis2:mtompolicy][Axis2/org.apache.axis2:mtompolicy][relativePath:modules/mtompolicy-mar],
hudson.maven.MavenModule@466dd42c[Axis2/org.apache.axis2:org.apache.axis2.osgi][Axis2/org.apache.axis2:org.apache.axis2.osgi][relativePath:modules/osgi],
hudson.maven.MavenModule@4a202bf6[Axis2/org.apache.axis2:ping][Axis2/org.apache.axis2:ping][relativePath:modules/ping],
hudson.maven.MavenModule@35bf0cd2[Axis2/org.apache.axis2:scripting][Axis2/org.apache.axis2:scripting][relativePath:modules/scripting],
hudson.maven.MavenModule@43a79bdc[Axis2/org.apache.axis2:simple-server-maven-plugin][Axis2/org.apache.axis2:simple-server-maven-plugin][relativePath:modules/tool/simple-server-maven-plugin],
hudson.maven.MavenModule@2a6bccf7[Axis2/org.apache.axis2:soapmonitor][Axis2/org.apache.axis2:soapmonitor][relativePath:modules/soapmonitor/module],
hudson.maven.MavenModule@74b86a7d[Axis2/org.apache.axis2:soapmonitor-servlet][Axis2/org.apache.axis2:soapmonitor-servlet][relativePath:modules/soapmonitor/servlet],
hudson.maven.MavenModule@ddca34[Axis2/org.apache.axis2:version][Axis2/org.apache.axis2:version][relativePath:modules/samples/version],
hudson.maven.MavenModule@6b218a17[Axis2/org.apache.axis2.archetype:quickstart][Axis2/org.apache.axis2.archetype:quickstart][relativePath:modules/tool/archetype/quickstart],
hudson.maven.MavenModule@1a702c6[Axis2/org.apache.axis2.archetype:quickstart-webapp][Axis2/org.apache.axis2.archetype:quickstart-webapp][relativePath:modules/tool/archetype/quickstart-webapp]]
project.getRootModule()=hudson.maven.MavenModule@561e6ae7[Axis2/org.apache.axis2:axis2][Axis2/org.apache.axis2:axis2][relativePath:]
FATAL: hudson.remoting.RequestAbortedException: hudson.remoting.DiagnosedStreamCorruptionException
Read ahead: 00000000aa01fd0600000058000000430da4e0310000008254afe0ec6c2f75557f
hudson.remoting.RequestAbortedException: hudson.remoting.RequestAbortedException: hudson.remoting.DiagnosedStreamCorruptionException
Read ahead: 00000000aa01fd0600000058000000430da4e0310000008254afe0ec6c2f75557f
	at hudson.remoting.RequestAbortedException.wrapForRethrow(RequestAbortedException.java:41)
	at hudson.remoting.RequestAbortedException.wrapForRethrow(RequestAbortedException.java:34)
	at hudson.remoting.Request.call(Request.java:174)
	at hudson.remoting.Channel.call(Channel.java:714)
	at hudson.maven.ProcessCache$MavenProcess.call(ProcessCache.java:160)
	at hudson.maven.MavenModuleSetBuild$MavenModuleSetBuildExecution.doRun(MavenModuleSetBuild.java:813)
	at hudson.model.AbstractBuild$AbstractBuildExecution.run(AbstractBuild.java:586)
	at hudson.model.Run.execute(Run.java:1597)
	at hudson.maven.MavenModuleSetBuild.run(MavenModuleSetBuild.java:506)
	at hudson.model.ResourceController.execute(ResourceController.java:88)
	at hudson.model.Executor.run(Executor.java:247)
Caused by: hudson.remoting.RequestAbortedException: hudson.remoting.DiagnosedStreamCorruptionException
Read ahead: 00000000aa01fd0600000058000000430da4e0310000008254afe0ec6c2f75557f
	at hudson.remoting.Request.abort(Request.java:299)
	at hudson.remoting.Channel.terminate(Channel.java:774)
	at hudson.slaves.Channels$1.terminate(Channels.java:77)
	at hudson.remoting.SynchronousCommandTransport$ReaderThread.run(SynchronousCommandTransport.java:69)
Caused by: hudson.remoting.DiagnosedStreamCorruptionException
Read ahead: 00000000aa01fd0600000058000000430da4e0310000008254afe0ec6c2f75557f
	at hudson.remoting.ClassicCommandTransport.diagnoseStreamCorruption(ClassicCommandTransport.java:118)
	at hudson.remoting.ClassicCommandTransport.read(ClassicCommandTransport.java:74)
	at hudson.remoting.SynchronousCommandTransport$ReaderThread.run(SynchronousCommandTransport.java:48)
Caused by: java.io.StreamCorruptedException: invalid type code: 07
	at java.io.ObjectInputStream.readObject0(ObjectInputStream.java:1375)
	at java.io.ObjectInputStream.defaultReadFields(ObjectInputStream.java:1989)
	at java.io.ObjectInputStream.readSerialData(ObjectInputStream.java:1913)
	at java.io.ObjectInputStream.readOrdinaryObject(ObjectInputStream.java:1796)
	at java.io.ObjectInputStream.readObject0(ObjectInputStream.java:1348)
	at java.io.ObjectInputStream.readObject(ObjectInputStream.java:370)
	at hudson.remoting.Command.readFrom(Command.java:92)
	at hudson.remoting.ClassicCommandTransport.read(ClassicCommandTransport.java:72)
	... 1 more

---------------------------------------------------------------------
To unsubscribe, e-mail: java-dev-unsubscribe@axis.apache.org
For additional commands, e-mail: java-dev-help@axis.apache.org


Mime
View raw message