axis-java-dev mailing list archives

Site index · List index
Message view « Date » · « Thread »
Top « Date » · « Thread »
From Apache Jenkins Server <jenk...@builds.apache.org>
Subject Build failed in Jenkins: Rampart #1488
Date Mon, 10 Jun 2013 09:09:42 GMT
See <https://builds.apache.org/job/Rampart/1488/>

------------------------------------------
[...truncated 1387 lines...]
Downloading: http://repo1.maven.org/maven2/org/apache/maven/doxia/doxia-module-xhtml/1.2/doxia-module-xhtml-1.2.pom
Downloaded: http://repo1.maven.org/maven2/org/apache/maven/doxia/doxia-module-xhtml/1.2/doxia-module-xhtml-1.2.pom
(2 KB at 63.7 KB/sec)
Downloading: http://repo1.maven.org/maven2/org/apache/maven/doxia/doxia-modules/1.2/doxia-modules-1.2.pom
Downloaded: http://repo1.maven.org/maven2/org/apache/maven/doxia/doxia-modules/1.2/doxia-modules-1.2.pom
(3 KB at 81.4 KB/sec)
Downloading: http://repo1.maven.org/maven2/org/apache/maven/doxia/doxia-site-renderer/1.2/doxia-site-renderer-1.2.pom
Downloaded: http://repo1.maven.org/maven2/org/apache/maven/doxia/doxia-site-renderer/1.2/doxia-site-renderer-1.2.pom
(7 KB at 62.2 KB/sec)
Downloading: http://repo1.maven.org/maven2/org/apache/maven/doxia/doxia-module-fml/1.2/doxia-module-fml-1.2.pom
Downloaded: http://repo1.maven.org/maven2/org/apache/maven/doxia/doxia-module-fml/1.2/doxia-module-fml-1.2.pom
(6 KB at 289.2 KB/sec)
Downloading: http://repo1.maven.org/maven2/org/codehaus/plexus/plexus-interpolation/1.9/plexus-interpolation-1.9.pom
Downloaded: http://repo1.maven.org/maven2/org/codehaus/plexus/plexus-interpolation/1.9/plexus-interpolation-1.9.pom
(832 B at 36.9 KB/sec)
Downloading: http://repo1.maven.org/maven2/commons-validator/commons-validator/1.4.0/commons-validator-1.4.0.pom
Downloaded: http://repo1.maven.org/maven2/commons-validator/commons-validator/1.4.0/commons-validator-1.4.0.pom
(10 KB at 205.9 KB/sec)
Downloading: http://repo1.maven.org/maven2/org/apache/commons/commons-parent/23/commons-parent-23.pom
Downloaded: http://repo1.maven.org/maven2/org/apache/commons/commons-parent/23/commons-parent-23.pom
(44 KB at 3942.5 KB/sec)
Downloading: http://repo1.maven.org/maven2/commons-beanutils/commons-beanutils/1.8.3/commons-beanutils-1.8.3.pom
Downloaded: http://repo1.maven.org/maven2/commons-beanutils/commons-beanutils/1.8.3/commons-beanutils-1.8.3.pom
(11 KB at 1562.2 KB/sec)
Downloading: http://repo1.maven.org/maven2/org/apache/commons/commons-parent/14/commons-parent-14.pom
Downloaded: http://repo1.maven.org/maven2/org/apache/commons/commons-parent/14/commons-parent-14.pom
(31 KB at 4379.0 KB/sec)
Downloading: http://repo1.maven.org/maven2/joda-time/joda-time/1.6.2/joda-time-1.6.2.pom
Downloaded: http://repo1.maven.org/maven2/joda-time/joda-time/1.6.2/joda-time-1.6.2.pom (14
KB at 216.9 KB/sec)
Downloading: http://repo1.maven.org/maven2/org/apache/maven/shared/maven-dependency-tree/2.0/maven-dependency-tree-2.0.jar
Downloading: http://repo1.maven.org/maven2/org/apache/maven/shared/maven-doxia-tools/1.4/maven-doxia-tools-1.4.jar
Downloading: http://repo1.maven.org/maven2/org/apache/maven/shared/maven-shared-jar/1.1/maven-shared-jar-1.1.jar
Downloading: http://repo1.maven.org/maven2/org/codehaus/plexus/plexus-digest/1.0/plexus-digest-1.0.jar
Downloading: http://repo1.maven.org/maven2/org/apache/bcel/bcel/5.2/bcel-5.2.jar
Downloaded: http://repo1.maven.org/maven2/org/codehaus/plexus/plexus-digest/1.0/plexus-digest-1.0.jar
(12 KB at 1447.5 KB/sec)
Downloading: http://repo1.maven.org/maven2/jakarta-regexp/jakarta-regexp/1.4/jakarta-regexp-1.4.jar
Downloaded: http://repo1.maven.org/maven2/org/apache/maven/shared/maven-dependency-tree/2.0/maven-dependency-tree-2.0.jar
(55 KB at 2188.8 KB/sec)
Downloading: http://repo1.maven.org/maven2/org/apache/maven/wagon/wagon-ssh/1.0/wagon-ssh-1.0.jar
Downloaded: http://repo1.maven.org/maven2/org/apache/maven/wagon/wagon-ssh/1.0/wagon-ssh-1.0.jar
(28 KB at 1626.4 KB/sec)
Downloading: http://repo1.maven.org/maven2/com/jcraft/jsch/0.1.44-1/jsch-0.1.44-1.jar
Downloaded: http://repo1.maven.org/maven2/org/apache/maven/shared/maven-doxia-tools/1.4/maven-doxia-tools-1.4.jar
(45 KB at 1075.9 KB/sec)
Downloading: http://repo1.maven.org/maven2/org/apache/maven/wagon/wagon-ssh-common/1.0/wagon-ssh-common-1.0.jar
Downloaded: http://repo1.maven.org/maven2/org/apache/bcel/bcel/5.2/bcel-5.2.jar (521 KB at
12703.4 KB/sec)
Downloading: http://repo1.maven.org/maven2/org/codehaus/plexus/plexus-interactivity-api/1.0-alpha-6/plexus-interactivity-api-1.0-alpha-6.jar
Downloaded: http://repo1.maven.org/maven2/com/jcraft/jsch/0.1.44-1/jsch-0.1.44-1.jar (209
KB at 9077.0 KB/sec)
Downloading: http://repo1.maven.org/maven2/org/apache/maven/wagon/wagon-file/1.0/wagon-file-1.0.jar
Downloaded: http://repo1.maven.org/maven2/org/apache/maven/wagon/wagon-ssh-common/1.0/wagon-ssh-common-1.0.jar
(26 KB at 618.0 KB/sec)
Downloading: http://repo1.maven.org/maven2/org/apache/maven/wagon/wagon-http-lightweight/1.0/wagon-http-lightweight-1.0.jar
Downloaded: http://repo1.maven.org/maven2/org/apache/maven/wagon/wagon-http-lightweight/1.0/wagon-http-lightweight-1.0.jar
(15 KB at 521.2 KB/sec)
Downloading: http://repo1.maven.org/maven2/org/apache/maven/wagon/wagon-http-shared/1.0/wagon-http-shared-1.0.jar
Downloaded: http://repo1.maven.org/maven2/org/codehaus/plexus/plexus-interactivity-api/1.0-alpha-6/plexus-interactivity-api-1.0-alpha-6.jar
(12 KB at 171.9 KB/sec)
Downloading: http://repo1.maven.org/maven2/org/jsoup/jsoup/1.6.1/jsoup-1.6.1.jar
Downloaded: http://repo1.maven.org/maven2/org/apache/maven/shared/maven-shared-jar/1.1/maven-shared-jar-1.1.jar
(37 KB at 271.7 KB/sec)
Downloading: http://repo1.maven.org/maven2/org/apache/maven/scm/maven-scm-api/1.8/maven-scm-api-1.8.jar
Downloaded: http://repo1.maven.org/maven2/org/apache/maven/wagon/wagon-http-shared/1.0/wagon-http-shared-1.0.jar
(25 KB at 649.3 KB/sec)
Downloading: http://repo1.maven.org/maven2/org/apache/maven/scm/maven-scm-manager-plexus/1.8/maven-scm-manager-plexus-1.8.jar
Downloaded: http://repo1.maven.org/maven2/jakarta-regexp/jakarta-regexp/1.4/jakarta-regexp-1.4.jar
(28 KB at 200.8 KB/sec)
Downloading: http://repo1.maven.org/maven2/org/apache/maven/scm/maven-scm-provider-hg/1.8/maven-scm-provider-hg-1.8.jar
Downloaded: http://repo1.maven.org/maven2/org/apache/maven/scm/maven-scm-manager-plexus/1.8/maven-scm-manager-plexus-1.8.jar
(11 KB at 491.8 KB/sec)
Downloading: http://repo1.maven.org/maven2/regexp/regexp/1.3/regexp-1.3.jar
Downloaded: http://repo1.maven.org/maven2/org/apache/maven/scm/maven-scm-provider-hg/1.8/maven-scm-provider-hg-1.8.jar
(65 KB at 2806.7 KB/sec)
Downloading: http://repo1.maven.org/maven2/org/apache/maven/scm/maven-scm-provider-perforce/1.8/maven-scm-provider-perforce-1.8.jar
Downloaded: http://repo1.maven.org/maven2/org/jsoup/jsoup/1.6.1/jsoup-1.6.1.jar (275 KB at
4364.8 KB/sec)
Downloading: http://repo1.maven.org/maven2/org/apache/maven/scm/maven-scm-provider-starteam/1.8/maven-scm-provider-starteam-1.8.jar
Downloaded: http://repo1.maven.org/maven2/org/apache/maven/scm/maven-scm-api/1.8/maven-scm-api-1.8.jar
(103 KB at 1940.9 KB/sec)
Downloading: http://repo1.maven.org/maven2/org/apache/maven/scm/maven-scm-provider-svn-commons/1.8/maven-scm-provider-svn-commons-1.8.jar
Downloaded: http://repo1.maven.org/maven2/org/apache/maven/scm/maven-scm-provider-starteam/1.8/maven-scm-provider-starteam-1.8.jar
(73 KB at 4840.3 KB/sec)
Downloading: http://repo1.maven.org/maven2/org/apache/maven/scm/maven-scm-provider-svnexe/1.8/maven-scm-provider-svnexe-1.8.jar
Downloaded: http://repo1.maven.org/maven2/org/apache/maven/scm/maven-scm-provider-perforce/1.8/maven-scm-provider-perforce-1.8.jar
(80 KB at 2158.7 KB/sec)
Downloading: http://repo1.maven.org/maven2/commons-lang/commons-lang/2.6/commons-lang-2.6.jar
Downloaded: http://repo1.maven.org/maven2/org/apache/maven/scm/maven-scm-provider-svnexe/1.8/maven-scm-provider-svnexe-1.8.jar
(75 KB at 3569.1 KB/sec)
Downloading: http://repo1.maven.org/maven2/org/apache/maven/scm/maven-scm-provider-cvs-commons/1.8/maven-scm-provider-cvs-commons-1.8.jar
Downloaded: http://repo1.maven.org/maven2/commons-lang/commons-lang/2.6/commons-lang-2.6.jar
(278 KB at 21350.7 KB/sec)
Downloading: http://repo1.maven.org/maven2/org/apache/maven/scm/maven-scm-provider-cvsexe/1.8/maven-scm-provider-cvsexe-1.8.jar
Downloaded: http://repo1.maven.org/maven2/org/apache/maven/scm/maven-scm-provider-svn-commons/1.8/maven-scm-provider-svn-commons-1.8.jar
(40 KB at 790.0 KB/sec)
Downloading: http://repo1.maven.org/maven2/org/apache/maven/scm/maven-scm-provider-cvsjava/1.8/maven-scm-provider-cvsjava-1.8.jar
Downloaded: http://repo1.maven.org/maven2/org/apache/maven/scm/maven-scm-provider-cvs-commons/1.8/maven-scm-provider-cvs-commons-1.8.jar
(79 KB at 2689.9 KB/sec)
Downloading: http://repo1.maven.org/maven2/org/netbeans/lib/cvsclient/20060125/cvsclient-20060125.jar
Downloaded: http://repo1.maven.org/maven2/org/apache/maven/scm/maven-scm-provider-cvsexe/1.8/maven-scm-provider-cvsexe-1.8.jar
(30 KB at 1040.6 KB/sec)
Downloading: http://repo1.maven.org/maven2/ch/ethz/ganymed/ganymed-ssh2/build210/ganymed-ssh2-build210.jar
Downloaded: http://repo1.maven.org/maven2/org/apache/maven/scm/maven-scm-provider-cvsjava/1.8/maven-scm-provider-cvsjava-1.8.jar
(43 KB at 848.4 KB/sec)
Downloading: http://repo1.maven.org/maven2/org/apache/maven/scm/maven-scm-provider-gitexe/1.8/maven-scm-provider-gitexe-1.8.jar
Downloaded: http://repo1.maven.org/maven2/ch/ethz/ganymed/ganymed-ssh2/build210/ganymed-ssh2-build210.jar
(240 KB at 5087.1 KB/sec)
Downloading: http://repo1.maven.org/maven2/org/apache/maven/scm/maven-scm-provider-git-commons/1.8/maven-scm-provider-git-commons-1.8.jar
Downloaded: http://repo1.maven.org/maven2/org/netbeans/lib/cvsclient/20060125/cvsclient-20060125.jar
(605 KB at 9744.0 KB/sec)
Downloading: http://repo1.maven.org/maven2/org/apache/maven/doxia/doxia-logging-api/1.2/doxia-logging-api-1.2.jar
Downloaded: http://repo1.maven.org/maven2/org/apache/maven/scm/maven-scm-provider-git-commons/1.8/maven-scm-provider-git-commons-1.8.jar
(37 KB at 5277.5 KB/sec)
Downloading: http://repo1.maven.org/maven2/org/apache/maven/doxia/doxia-core/1.2/doxia-core-1.2.jar
Downloaded: http://repo1.maven.org/maven2/org/apache/maven/scm/maven-scm-provider-gitexe/1.8/maven-scm-provider-gitexe-1.8.jar
(62 KB at 2777.7 KB/sec)
Downloading: http://repo1.maven.org/maven2/org/apache/maven/doxia/doxia-module-xhtml/1.2/doxia-module-xhtml-1.2.jar
Downloaded: http://repo1.maven.org/maven2/org/apache/maven/doxia/doxia-core/1.2/doxia-core-1.2.jar
(151 KB at 7921.5 KB/sec)
Downloading: http://repo1.maven.org/maven2/org/apache/maven/doxia/doxia-decoration-model/1.2/doxia-decoration-model-1.2.jar
Downloaded: http://repo1.maven.org/maven2/org/apache/maven/doxia/doxia-module-xhtml/1.2/doxia-module-xhtml-1.2.jar
(15 KB at 921.4 KB/sec)
Downloading: http://repo1.maven.org/maven2/org/apache/maven/doxia/doxia-module-fml/1.2/doxia-module-fml-1.2.jar
Downloaded: http://repo1.maven.org/maven2/org/apache/maven/doxia/doxia-logging-api/1.2/doxia-logging-api-1.2.jar
(12 KB at 235.8 KB/sec)
Downloading: http://repo1.maven.org/maven2/org/codehaus/plexus/plexus-interpolation/1.9/plexus-interpolation-1.9.jar
Downloaded: http://repo1.maven.org/maven2/org/apache/maven/doxia/doxia-module-fml/1.2/doxia-module-fml-1.2.jar
(37 KB at 1192.6 KB/sec)
Downloading: http://repo1.maven.org/maven2/commons-validator/commons-validator/1.4.0/commons-validator-1.4.0.jar
Downloaded: http://repo1.maven.org/maven2/org/apache/maven/doxia/doxia-decoration-model/1.2/doxia-decoration-model-1.2.jar
(59 KB at 1620.4 KB/sec)
Downloading: http://repo1.maven.org/maven2/commons-beanutils/commons-beanutils/1.8.3/commons-beanutils-1.8.3.jar
Downloaded: http://repo1.maven.org/maven2/commons-beanutils/commons-beanutils/1.8.3/commons-beanutils-1.8.3.jar
(227 KB at 20598.3 KB/sec)
Downloading: http://repo1.maven.org/maven2/joda-time/joda-time/1.6.2/joda-time-1.6.2.jar
Downloaded: http://repo1.maven.org/maven2/commons-validator/commons-validator/1.4.0/commons-validator-1.4.0.jar
(173 KB at 5758.4 KB/sec)
Downloaded: http://repo1.maven.org/maven2/joda-time/joda-time/1.6.2/joda-time-1.6.2.jar (531
KB at 17677.2 KB/sec)
Downloaded: http://repo1.maven.org/maven2/org/codehaus/plexus/plexus-interpolation/1.9/plexus-interpolation-1.9.jar
(50 KB at 571.6 KB/sec)
Downloaded: http://repo1.maven.org/maven2/regexp/regexp/1.3/regexp-1.3.jar (25 KB at 13.6
KB/sec)
Downloaded: http://repo1.maven.org/maven2/org/apache/maven/wagon/wagon-file/1.0/wagon-file-1.0.jar
(11 KB at 5.5 KB/sec)
[INFO] Parent project loaded from repository: org.apache:apache:pom:13
Downloading: http://repo1.maven.org/maven2/org/apache/apache/13/apache-13-site_en.xml
Downloading: http://repo1.maven.org/maven2/org/apache/apache/13/apache-13-site.xml
[INFO] Relativizing decoration links with respect to project URL: http://axis.apache.org/axis2/java/rampart
Downloading: http://repo1.maven.org/maven2/org/apache/maven/skins/maven-default-skin/1.0/maven-default-skin-1.0.jar
Downloaded: http://repo1.maven.org/maven2/org/apache/maven/skins/maven-default-skin/1.0/maven-default-skin-1.0.jar
(8 KB at 77.4 KB/sec)
[INFO] Rendering site with org.apache.maven.skins:maven-default-skin:jar:1.0 skin.
[INFO] Generating "Project Team" report    --- maven-project-info-reports-plugin:2.6
[INFO] Generating "Dependencies" report    --- maven-project-info-reports-plugin:2.6
[INFO] Generating "Mailing Lists" report    --- maven-project-info-reports-plugin:2.6
[JENKINS] Archiving site from <https://builds.apache.org/job/Rampart/ws/trunk/target/site>
to /home/hudson/hudson/jobs/Rampart/site
Successfully loaded native POSIX impl.
[INFO] Downloading: http://repo1.maven.org/maven2/org/codehaus/plexus/plexus-utils/2.0.5/plexus-utils-2.0.5.jar
Downloaded: http://repo1.maven.org/maven2/org/codehaus/plexus/plexus-utils/2.0.5/plexus-utils-2.0.5.jar
(218 KB at 12820.0 KB/sec)

[INFO] --- maven-install-plugin:2.3.1:install (default-install) @ rampart-project ---
[INFO] Installing <https://builds.apache.org/job/Rampart/ws/trunk/pom.xml> to <https://builds.apache.org/job/Rampart/ws/.repository/org/apache/rampart/rampart-project/1.7.0-SNAPSHOT/rampart-project-1.7.0-SNAPSHOT.pom>
[INFO] Installing <https://builds.apache.org/job/Rampart/ws/trunk/target/rampart-project-1.7.0-SNAPSHOT-site.xml>
to <https://builds.apache.org/job/Rampart/ws/.repository/org/apache/rampart/rampart-project/1.7.0-SNAPSHOT/rampart-project-1.7.0-SNAPSHOT-site.xml>
[INFO] Downloading: http://repo1.maven.org/maven2/org/apache/maven/plugins/maven-resources-plugin/2.6/maven-resources-plugin-2.6.pom
Downloaded: http://repo1.maven.org/maven2/org/apache/maven/plugins/maven-resources-plugin/2.6/maven-resources-plugin-2.6.pom
(8 KB at 440.3 KB/sec)
Downloading: http://repo1.maven.org/maven2/org/apache/maven/plugins/maven-resources-plugin/2.6/maven-resources-plugin-2.6.jar
                                                                        
[INFO] ------------------------------------------------------------------------
[INFO] Building Rampart - Policy 1.7.0-SNAPSHOT
[INFO] ------------------------------------------------------------------------
Downloaded: http://repo1.maven.org/maven2/org/apache/maven/plugins/maven-resources-plugin/2.6/maven-resources-plugin-2.6.jar
(29 KB at 1253.4 KB/sec)
Downloading: http://repo1.maven.org/maven2/org/apache/maven/plugins/maven-compiler-plugin/2.0/maven-compiler-plugin-2.0.pom
Downloaded: http://repo1.maven.org/maven2/org/apache/maven/plugins/maven-compiler-plugin/2.0/maven-compiler-plugin-2.0.pom
(2 KB at 4.2 KB/sec)
Downloading: http://repo1.maven.org/maven2/org/apache/maven/plugins/maven-plugin-parent/2.0/maven-plugin-parent-2.0.pom
[INFO] ------------------------------------------------------------------------
[INFO] Reactor Summary:
[INFO] 
[INFO] Apache Rampart .................................... SUCCESS [52.775s]
[INFO] Rampart - Policy .................................. FAILURE [12:01.262s]
[INFO] Rampart - Trust ................................... SKIPPED
[INFO] Rampart - Core .................................... SKIPPED
[INFO] Javadoc ........................................... SKIPPED
[INFO] Rampart - Test Suite .............................. SKIPPED
[INFO] Rampart - Mar ..................................... SKIPPED
[INFO] Rampart - Trust-Mar ............................... SKIPPED
[INFO] Rampart - Integration ............................. SKIPPED
[INFO] Rampart - Samples ................................. SKIPPED
[INFO] Rampart - Distribution ............................ SKIPPED
[INFO] ------------------------------------------------------------------------
[INFO] BUILD FAILURE
[INFO] ------------------------------------------------------------------------
[INFO] Total time: 12:57.502s
[INFO] Finished at: Mon Jun 10 09:09:08 UTC 2013
[INFO] Final Memory: 23M/97M
[INFO] ------------------------------------------------------------------------
[JENKINS] Archiving <https://builds.apache.org/job/Rampart/ws/trunk/modules/rampart-core/pom.xml>
to /home/hudson/hudson/jobs/Rampart/modules/org.apache.rampart$rampart-core/builds/2013-06-10_08-55-53/archive/org.apache.rampart/rampart-core/1.7.0-SNAPSHOT/rampart-core-1.7.0-SNAPSHOT.pom
[JENKINS] Archiving <https://builds.apache.org/job/Rampart/ws/trunk/modules/rampart-tests/pom.xml>
to /home/hudson/hudson/jobs/Rampart/modules/org.apache.rampart$rampart-tests/builds/2013-06-10_08-55-53/archive/org.apache.rampart/rampart-tests/1.7.0-SNAPSHOT/rampart-tests-1.7.0-SNAPSHOT.pom
[JENKINS] Archiving <https://builds.apache.org/job/Rampart/ws/trunk/apidocs/pom.xml>
to /home/hudson/hudson/jobs/Rampart/modules/org.apache.rampart$apidocs/builds/2013-06-10_08-55-53/archive/org.apache.rampart/apidocs/1.7.0-SNAPSHOT/apidocs-1.7.0-SNAPSHOT.pom
[JENKINS] Archiving <https://builds.apache.org/job/Rampart/ws/trunk/pom.xml> to /home/hudson/hudson/jobs/Rampart/modules/org.apache.rampart$rampart-project/builds/2013-06-10_08-55-52/archive/org.apache.rampart/rampart-project/1.7.0-SNAPSHOT/rampart-project-1.7.0-SNAPSHOT.pom
[JENKINS] Archiving <https://builds.apache.org/job/Rampart/ws/trunk/target/rampart-project-1.7.0-SNAPSHOT-site.xml>
to /home/hudson/hudson/jobs/Rampart/modules/org.apache.rampart$rampart-project/builds/2013-06-10_08-55-52/archive/org.apache.rampart/rampart-project/1.7.0-SNAPSHOT/rampart-project-1.7.0-SNAPSHOT-site.xml
[JENKINS] Archiving <https://builds.apache.org/job/Rampart/ws/trunk/modules/rampart-trust-mar/pom.xml>
to /home/hudson/hudson/jobs/Rampart/modules/org.apache.rampart$rahas/builds/2013-06-10_08-55-54/archive/org.apache.rampart/rahas/1.7.0-SNAPSHOT/rahas-1.7.0-SNAPSHOT.pom
[JENKINS] Archiving <https://builds.apache.org/job/Rampart/ws/trunk/modules/rampart-integration/pom.xml>
to /home/hudson/hudson/jobs/Rampart/modules/org.apache.rampart$rampart-integration/builds/2013-06-10_08-55-54/archive/org.apache.rampart/rampart-integration/1.7.0-SNAPSHOT/rampart-integration-1.7.0-SNAPSHOT.pom
[JENKINS] Archiving <https://builds.apache.org/job/Rampart/ws/trunk/modules/rampart-samples/pom.xml>
to /home/hudson/hudson/jobs/Rampart/modules/org.apache.rampart$rampart-sample/builds/2013-06-10_08-55-54/archive/org.apache.rampart/rampart-sample/1.7.0-SNAPSHOT/rampart-sample-1.7.0-SNAPSHOT.pom
[JENKINS] Archiving <https://builds.apache.org/job/Rampart/ws/trunk/modules/rampart-mar/pom.xml>
to /home/hudson/hudson/jobs/Rampart/modules/org.apache.rampart$rampart/builds/2013-06-10_08-55-53/archive/org.apache.rampart/rampart/1.7.0-SNAPSHOT/rampart-1.7.0-SNAPSHOT.pom
[JENKINS] Archiving <https://builds.apache.org/job/Rampart/ws/trunk/modules/rampart-policy/pom.xml>
to /home/hudson/hudson/jobs/Rampart/modules/org.apache.rampart$rampart-policy/builds/2013-06-10_08-55-53/archive/org.apache.rampart/rampart-policy/1.7.0-SNAPSHOT/rampart-policy-1.7.0-SNAPSHOT.pom
[JENKINS] Archiving <https://builds.apache.org/job/Rampart/ws/trunk/modules/rampart-trust/pom.xml>
to /home/hudson/hudson/jobs/Rampart/modules/org.apache.rampart$rampart-trust/builds/2013-06-10_08-55-53/archive/org.apache.rampart/rampart-trust/1.7.0-SNAPSHOT/rampart-trust-1.7.0-SNAPSHOT.pom
[JENKINS] Archiving <https://builds.apache.org/job/Rampart/ws/trunk/modules/distribution/pom.xml>
to /home/hudson/hudson/jobs/Rampart/modules/org.apache.rampart$rampart-dist/builds/2013-06-10_08-55-54/archive/org.apache.rampart/rampart-dist/1.7.0-SNAPSHOT/rampart-dist-1.7.0-SNAPSHOT.pom
Waiting for Jenkins to finish collecting data
mavenExecutionResult exceptions not empty
message : Plugin org.apache.maven.plugins:maven-compiler-plugin:2.0 or one of its dependencies
could not be resolved: Failed to read artifact descriptor for org.apache.maven.plugins:maven-compiler-plugin:jar:2.0
cause : Failed to read artifact descriptor for org.apache.maven.plugins:maven-compiler-plugin:jar:2.0
Stack trace : 
org.apache.maven.plugin.PluginResolutionException: Plugin org.apache.maven.plugins:maven-compiler-plugin:2.0
or one of its dependencies could not be resolved: Failed to read artifact descriptor for org.apache.maven.plugins:maven-compiler-plugin:jar:2.0
	at org.apache.maven.plugin.internal.DefaultPluginDependenciesResolver.resolve(DefaultPluginDependenciesResolver.java:129)
	at org.apache.maven.plugin.internal.DefaultMavenPluginManager.getPluginDescriptor(DefaultMavenPluginManager.java:142)
	at org.apache.maven.plugin.internal.DefaultMavenPluginManager.getMojoDescriptor(DefaultMavenPluginManager.java:261)
	at org.apache.maven.plugin.DefaultBuildPluginManager.getMojoDescriptor(DefaultBuildPluginManager.java:185)
	at org.apache.maven.lifecycle.internal.DefaultLifecycleExecutionPlanCalculator.setupMojoExecution(DefaultLifecycleExecutionPlanCalculator.java:152)
	at org.apache.maven.lifecycle.internal.DefaultLifecycleExecutionPlanCalculator.setupMojoExecutions(DefaultLifecycleExecutionPlanCalculator.java:139)
	at org.apache.maven.lifecycle.internal.DefaultLifecycleExecutionPlanCalculator.calculateExecutionPlan(DefaultLifecycleExecutionPlanCalculator.java:116)
	at org.apache.maven.lifecycle.internal.DefaultLifecycleExecutionPlanCalculator.calculateExecutionPlan(DefaultLifecycleExecutionPlanCalculator.java:129)
	at org.apache.maven.lifecycle.internal.BuilderCommon.resolveBuildPlan(BuilderCommon.java:92)
	at org.apache.maven.lifecycle.internal.LifecycleModuleBuilder.buildProject(LifecycleModuleBuilder.java:81)
	at org.apache.maven.lifecycle.internal.LifecycleModuleBuilder.buildProject(LifecycleModuleBuilder.java:59)
	at org.apache.maven.lifecycle.internal.LifecycleStarter.singleThreadedBuild(LifecycleStarter.java:183)
	at org.apache.maven.lifecycle.internal.LifecycleStarter.execute(LifecycleStarter.java:161)
	at org.apache.maven.DefaultMaven.doExecute(DefaultMaven.java:319)
	at org.apache.maven.DefaultMaven.execute(DefaultMaven.java:156)
	at org.jvnet.hudson.maven3.launcher.Maven3Launcher.main(Maven3Launcher.java:79)
	at sun.reflect.NativeMethodAccessorImpl.invoke0(Native Method)
	at sun.reflect.NativeMethodAccessorImpl.invoke(NativeMethodAccessorImpl.java:39)
	at sun.reflect.DelegatingMethodAccessorImpl.invoke(DelegatingMethodAccessorImpl.java:25)
	at java.lang.reflect.Method.invoke(Method.java:597)
	at org.codehaus.plexus.classworlds.launcher.Launcher.launchStandard(Launcher.java:329)
	at org.codehaus.plexus.classworlds.launcher.Launcher.launch(Launcher.java:239)
	at org.jvnet.hudson.maven3.agent.Maven3Main.launch(Maven3Main.java:158)
	at hudson.maven.Maven3Builder.call(Maven3Builder.java:100)
	at hudson.maven.Maven3Builder.call(Maven3Builder.java:66)
	at hudson.remoting.UserRequest.perform(UserRequest.java:118)
	at hudson.remoting.UserRequest.perform(UserRequest.java:48)
	at hudson.remoting.Request$2.run(Request.java:326)
	at hudson.remoting.InterceptingExecutorService$1.call(InterceptingExecutorService.java:72)
	at java.util.concurrent.FutureTask$Sync.innerRun(FutureTask.java:303)
	at java.util.concurrent.FutureTask.run(FutureTask.java:138)
	at java.util.concurrent.ThreadPoolExecutor$Worker.runTask(ThreadPoolExecutor.java:886)
	at java.util.concurrent.ThreadPoolExecutor$Worker.run(ThreadPoolExecutor.java:908)
	at java.lang.Thread.run(Thread.java:619)
Caused by: org.sonatype.aether.resolution.ArtifactDescriptorException: Failed to read artifact
descriptor for org.apache.maven.plugins:maven-compiler-plugin:jar:2.0
	at org.apache.maven.repository.internal.DefaultArtifactDescriptorReader.loadPom(DefaultArtifactDescriptorReader.java:317)
	at org.apache.maven.repository.internal.DefaultArtifactDescriptorReader.readArtifactDescriptor(DefaultArtifactDescriptorReader.java:172)
	at org.sonatype.aether.impl.internal.DefaultRepositorySystem.readArtifactDescriptor(DefaultRepositorySystem.java:316)
	at org.apache.maven.plugin.internal.DefaultPluginDependenciesResolver.resolve(DefaultPluginDependenciesResolver.java:115)
	... 33 more
Caused by: org.apache.maven.model.resolution.UnresolvableModelException: Could not transfer
artifact org.apache.maven.plugins:maven-plugin-parent:pom:2.0 from/to central (http://repo1.maven.org/maven2):
Error transferring file: Unexpected end of file from server
	at org.apache.maven.repository.internal.DefaultModelResolver.resolveModel(DefaultModelResolver.java:126)
	at org.apache.maven.model.building.DefaultModelBuilder.readParentExternally(DefaultModelBuilder.java:819)
	at org.apache.maven.model.building.DefaultModelBuilder.readParent(DefaultModelBuilder.java:670)
	at org.apache.maven.model.building.DefaultModelBuilder.build(DefaultModelBuilder.java:308)
	at org.apache.maven.model.building.DefaultModelBuilder.build(DefaultModelBuilder.java:232)
	at org.apache.maven.repository.internal.DefaultArtifactDescriptorReader.loadPom(DefaultArtifactDescriptorReader.java:308)
	... 36 more
Caused by: org.sonatype.aether.resolution.ArtifactResolutionException: Could not transfer
artifact org.apache.maven.plugins:maven-plugin-parent:pom:2.0 from/to central (http://repo1.maven.org/maven2):
Error transferring file: Unexpected end of file from server
	at org.sonatype.aether.impl.internal.DefaultArtifactResolver.resolve(DefaultArtifactResolver.java:541)
	at org.sonatype.aether.impl.internal.DefaultArtifactResolver.resolveArtifacts(DefaultArtifactResolver.java:220)
	at org.sonatype.aether.impl.internal.DefaultArtifactResolver.resolveArtifact(DefaultArtifactResolver.java:197)
	at org.apache.maven.repository.internal.DefaultModelResolver.resolveModel(DefaultModelResolver.java:122)
	... 41 more
Caused by: org.sonatype.aether.transfer.ArtifactTransferException: Could not transfer artifact
org.apache.maven.plugins:maven-plugin-parent:pom:2.0 from/to central (http://repo1.maven.org/maven2):
Error transferring file: Unexpected end of file from server
	at org.sonatype.aether.connector.wagon.WagonRepositoryConnector$4.wrap(WagonRepositoryConnector.java:949)
	at org.sonatype.aether.connector.wagon.WagonRepositoryConnector$4.wrap(WagonRepositoryConnector.java:940)
	at org.sonatype.aether.connector.wagon.WagonRepositoryConnector$GetTask.flush(WagonRepositoryConnector.java:695)
	at org.sonatype.aether.connector.wagon.WagonRepositoryConnector$GetTask.flush(WagonRepositoryConnector.java:689)
	at org.sonatype.aether.connector.wagon.WagonRepositoryConnector.get(WagonRepositoryConnector.java:445)
	at org.sonatype.aether.impl.internal.DefaultArtifactResolver.resolve(DefaultArtifactResolver.java:460)
	... 44 more
Caused by: org.apache.maven.wagon.TransferFailedException: Error transferring file: Unexpected
end of file from server
	at org.apache.maven.wagon.providers.http.LightweightHttpWagon.fillInputData(LightweightHttpWagon.java:143)
	at org.apache.maven.wagon.StreamWagon.getInputStream(StreamWagon.java:116)
	at org.apache.maven.wagon.StreamWagon.getIfNewer(StreamWagon.java:88)
	at org.apache.maven.wagon.StreamWagon.get(StreamWagon.java:61)
	at org.sonatype.aether.connector.wagon.WagonRepositoryConnector$GetTask.run(WagonRepositoryConnector.java:608)
	at org.sonatype.aether.util.concurrency.RunnableErrorForwarder$1.run(RunnableErrorForwarder.java:64)
	... 3 more
Caused by: java.net.SocketException: Unexpected end of file from server
	at sun.net.www.http.HttpClient.parseHTTPHeader(HttpClient.java:769)
	at sun.net.www.http.HttpClient.parseHTTP(HttpClient.java:632)
	at sun.net.www.http.HttpClient.parseHTTPHeader(HttpClient.java:766)
	at sun.net.www.http.HttpClient.parseHTTP(HttpClient.java:632)
	at sun.net.www.protocol.http.HttpURLConnection.getInputStream(HttpURLConnection.java:1072)
	at java.net.HttpURLConnection.getResponseCode(HttpURLConnection.java:373)
	at org.apache.maven.wagon.providers.http.LightweightHttpWagon.fillInputData(LightweightHttpWagon.java:115)
	... 8 more
Sending e-mails to: java-dev@axis.apache.org
channel stopped
[locks-and-latches] Releasing all the locks
[locks-and-latches] All the locks released

---------------------------------------------------------------------
To unsubscribe, e-mail: java-dev-unsubscribe@axis.apache.org
For additional commands, e-mail: java-dev-help@axis.apache.org


Mime
View raw message