axis-java-dev mailing list archives

Site index · List index
Message view « Date » · « Thread »
Top « Date » · « Thread »
From Apache Jenkins Server <jenk...@builds.apache.org>
Subject Build failed in Jenkins: Axis2 #2367
Date Fri, 28 Jun 2013 20:08:39 GMT
See <https://builds.apache.org/job/Axis2/2367/>

------------------------------------------
[...truncated 9305 lines...]
 T E S T S
-------------------------------------------------------

-------------------------------------------------------
 T E S T S
-------------------------------------------------------
Running org.apache.axis2.codegen.InvalidFaultWsdlTest
Tests run: 1, Failures: 0, Errors: 0, Skipped: 0, Time elapsed: 0.582 sec
Running org.apache.axis2.spring.SpringServiceTest
Tests run: 1, Failures: 0, Errors: 0, Skipped: 0, Time elapsed: 6.067 sec
Running org.apache.axis2.mtom.MessageSaveAndRestoreWithMTOMTest
Tests run: 1, Failures: 0, Errors: 0, Skipped: 0, Time elapsed: 6.156 sec
Running org.apache.axis2.mtom.EchoRawMTOMToBase64Test
Tests run: 2, Failures: 0, Errors: 0, Skipped: 0, Time elapsed: 6.905 sec
Running org.apache.axis2.mtom.EchoRawMTOMCommonsChunkingTest
Tests run: 1, Failures: 0, Errors: 0, Skipped: 0, Time elapsed: 5.931 sec
Running org.apache.axis2.mtom.EchoRawMTOMLoadTest
Tests run: 1, Failures: 0, Errors: 0, Skipped: 0, Time elapsed: 6.243 sec
Running org.apache.axis2.mtom.EchoRawMTOMFileCacheTest
Tests run: 3, Failures: 0, Errors: 0, Skipped: 0, Time elapsed: 6.942 sec
Running org.apache.axis2.mtom.EchoRawMTOMStreamingTest
Tests run: 1, Failures: 0, Errors: 0, Skipped: 0, Time elapsed: 5.922 sec
Running org.apache.axis2.mtom.EchoRawMTOMFileCacheLoadTest
Tests run: 1, Failures: 0, Errors: 0, Skipped: 0, Time elapsed: 6.273 sec
Running org.apache.axis2.mtom.EchoRawMTOMFaultReportTest
Tests run: 1, Failures: 0, Errors: 0, Skipped: 0, Time elapsed: 5.899 sec
Running org.apache.axis2.mtom.EchoRawMTOMTest
Tests run: 3, Failures: 0, Errors: 0, Skipped: 0, Time elapsed: 6.943 sec
Running org.apache.axis2.processingModel.SoapProcessingModelTest
Tests run: 1, Failures: 0, Errors: 0, Skipped: 0, Time elapsed: 0.686 sec
Running org.apache.axis2.builder.UnknownContentBuilderTest
Tests run: 2, Failures: 0, Errors: 0, Skipped: 0, Time elapsed: 0.467 sec
Running org.apache.axis2.engine.ServiceFaultTest
Tests run: 2, Failures: 0, Errors: 0, Skipped: 0, Time elapsed: 5.878 sec
Running org.apache.axis2.engine.map.MapServiceTest
Tests run: 2, Failures: 0, Errors: 0, Skipped: 0, Time elapsed: 6.881 sec
Running org.apache.axis2.engine.SOAPversionTest
Tests run: 2, Failures: 0, Errors: 0, Skipped: 0, Time elapsed: 0.701 sec
Running org.apache.axis2.engine.MessageContextSaveATest
Tests run: 4, Failures: 0, Errors: 0, Skipped: 0, Time elapsed: 0.565 sec
Running org.apache.axis2.engine.MessageSaveAndRestoreTest
Tests run: 1, Failures: 0, Errors: 0, Skipped: 0, Time elapsed: 10.954 sec
Running org.apache.axis2.engine.EchoRawXMLMultipleSyncTest
Tests run: 2, Failures: 0, Errors: 0, Skipped: 0, Time elapsed: 8.96 sec
Running org.apache.axis2.engine.HandlerFailureTest
Tests run: 1, Failures: 0, Errors: 0, Skipped: 0, Time elapsed: 0.679 sec
Running org.apache.axis2.engine.CommonsHTTPEchoRawXMLTest
Tests run: 2, Failures: 0, Errors: 0, Skipped: 0, Time elapsed: 6.683 sec
Running org.apache.axis2.engine.CallUnregisteredServiceTest
Tests run: 1, Failures: 0, Errors: 0, Skipped: 0, Time elapsed: 0.662 sec
Running org.apache.axis2.engine.ThirdPartyResponseRawXMLTest
Tests run: 1, Failures: 0, Errors: 0, Skipped: 0, Time elapsed: 9.882 sec
Running org.apache.axis2.engine.MessageContextSaveCTest
Tests run: 2, Failures: 0, Errors: 0, Skipped: 0, Time elapsed: 0.549 sec
Running org.apache.axis2.engine.MessageContextChangeTest
Tests run: 1, Failures: 0, Errors: 0, Skipped: 0, Time elapsed: 0.112 sec
Running org.apache.axis2.engine.UsingTransportTest
Tests run: 2, Failures: 0, Errors: 0, Skipped: 0, Time elapsed: 0.711 sec
Running org.apache.axis2.engine.EchoRawRuntimeProxyTest
Tests run: 1, Failures: 0, Errors: 0, Skipped: 0, Time elapsed: 5.854 sec
Running org.apache.axis2.engine.MessageContextSaveBTest
Tests run: 1, Failures: 0, Errors: 0, Skipped: 0, Time elapsed: 0.515 sec
Running org.apache.axis2.engine.FaultHandlingTest
Tests run: 4, Failures: 0, Errors: 0, Skipped: 0, Time elapsed: 5.976 sec
Running org.apache.axis2.engine.LongRunningServiceTest
Tests run: 1, Failures: 0, Errors: 0, Skipped: 0, Time elapsed: 68.692 sec
Running org.apache.axis2.engine.MessageContextTest
Tests run: 1, Failures: 0, Errors: 0, Skipped: 0, Time elapsed: 0.246 sec
Running org.apache.axis2.engine.EchoRawXMLTest
Tests run: 5, Failures: 0, Errors: 0, Skipped: 0, Time elapsed: 6.738 sec
Running org.apache.axis2.engine.CharactersetEncodingTest
Tests run: 11, Failures: 0, Errors: 0, Skipped: 0, Time elapsed: 5.986 sec
Running org.apache.axis2.engine.EngineWithoutPhaseResolvingTest
Tests run: 1, Failures: 0, Errors: 0, Skipped: 0, Time elapsed: 0.282 sec
Running org.apache.axis2.engine.EnginePausingTest
Tests run: 2, Failures: 0, Errors: 0, Skipped: 0, Time elapsed: 0.33 sec
Running org.apache.axis2.engine.ServiceClientTest
Tests run: 3, Failures: 0, Errors: 0, Skipped: 0, Time elapsed: 7.067 sec
Running org.apache.axis2.engine.EchoRawXMLOnTwoChannelsSyncTest
Tests run: 2, Failures: 0, Errors: 0, Skipped: 0, Time elapsed: 5.941 sec
Running org.apache.axis2.engine.EchoRawXMLOnTwoChannelsTest
Tests run: 1, Failures: 0, Errors: 0, Skipped: 0, Time elapsed: 6.679 sec
Running org.apache.axis2.engine.OperationContextSaveTest
Tests run: 1, Failures: 0, Errors: 0, Skipped: 0, Time elapsed: 0.47 sec
Running org.apache.axis2.engine.ServiceDispatchingTest
Tests run: 3, Failures: 0, Errors: 0, Skipped: 0, Time elapsed: 0.721 sec
Running org.apache.axis2.engine.ObjectSaveTest
Tests run: 5, Failures: 0, Errors: 0, Skipped: 0, Time elapsed: 0.109 sec
Running org.apache.axis2.engine.ServiceCreateTest
Tests run: 1, Failures: 0, Errors: 0, Skipped: 0, Time elapsed: 5.922 sec
Running org.apache.axis2.engine.OneWayRawXMLTest
Tests run: 1, Failures: 0, Errors: 0, Skipped: 0, Time elapsed: 5.838 sec
Running org.apache.axis2.engine.ModuleEnagementTest
Tests run: 1, Failures: 0, Errors: 0, Skipped: 0, Time elapsed: 0.534 sec
Running org.apache.axis2.engine.MessageWithServerTest
Tests run: 1, Failures: 0, Errors: 0, Skipped: 0, Time elapsed: 2.943 sec
Running org.apache.axis2.engine.ObjectSave2Test
Tests run: 5, Failures: 0, Errors: 0, Skipped: 0, Time elapsed: 0.107 sec
Running org.apache.axis2.engine.OptionsSaveTest
Tests run: 1, Failures: 0, Errors: 0, Skipped: 0, Time elapsed: 0.404 sec
Running org.apache.axis2.engine.MultipleInvocationTest
Tests run: 1, Failures: 0, Errors: 0, Skipped: 0, Time elapsed: 5.886 sec
Running org.apache.axis2.engine.WSDLClientTest
Tests run: 1, Failures: 0, Errors: 0, Skipped: 0, Time elapsed: 6.455 sec
Running org.apache.axis2.engine.MessageContextSelfManagedDataTest
Tests run: 10, Failures: 0, Errors: 0, Skipped: 0, Time elapsed: 0.647 sec
Running org.apache.axis2.engine.HandlerExecutionTest
Tests run: 9, Failures: 0, Errors: 0, Skipped: 0, Time elapsed: 0.942 sec
Running org.apache.axis2.engine.EnumTest
Tests run: 2, Failures: 0, Errors: 0, Skipped: 0, Time elapsed: 0.731 sec
Running org.apache.axis2.engine.ThreadingTest
Tests run: 1, Failures: 0, Errors: 0, Skipped: 0, Time elapsed: 6.003 sec
Running org.apache.axis2.engine.EchoRawXMLMultipleASyncTest
Tests run: 2, Failures: 0, Errors: 0, Skipped: 0, Time elapsed: 7.826 sec
Running org.apache.axis2.engine.EchoRawXMLChunkedTest
Tests run: 1, Failures: 0, Errors: 0, Skipped: 0, Time elapsed: 5.805 sec
Running org.apache.axis2.engine.PausingHandlerExecutionTest
Tests run: 1, Failures: 0, Errors: 0, Skipped: 0, Time elapsed: 17.952 sec
Running org.apache.axis2.async.AsyncServiceWithTransportFailureTest
Tests run: 1, Failures: 0, Errors: 0, Skipped: 0, Time elapsed: 3.685 sec
Running org.apache.axis2.async.AsyncServiceTest
Tests run: 1, Failures: 0, Errors: 0, Skipped: 0, Time elapsed: 47.673 sec
Running org.apache.axis2.async.AsyncService2Test
Tests run: 1, Failures: 0, Errors: 0, Skipped: 0, Time elapsed: 5.924 sec
Running org.apache.axis2.jaxrs.ArchiveDeploymentTest
Tests run: 10, Failures: 0, Errors: 0, Skipped: 0, Time elapsed: 6.121 sec
Running org.apache.axis2.jaxrs.PojoTest
Tests run: 8, Failures: 0, Errors: 0, Skipped: 0, Time elapsed: 6.108 sec
Running org.apache.axis2.rpc.MultirefTest
Tests run: 9, Failures: 0, Errors: 0, Skipped: 0, Time elapsed: 1.155 sec
Running org.apache.axis2.rpc.AddressServiceTest
Tests run: 4, Failures: 0, Errors: 0, Skipped: 0, Time elapsed: 0.814 sec
Running org.apache.axis2.rpc.complex.ComplexDataTypesComplexDataTypesSOAP11Test
Tests run: 37, Failures: 0, Errors: 0, Skipped: 0, Time elapsed: 79.664 sec
Running org.apache.axis2.rpc.complex.ComplexDataTypesDocLitBareTest
Tests run: 34, Failures: 0, Errors: 0, Skipped: 0, Time elapsed: 73.192 sec
Running org.apache.axis2.rpc.RPCCallTest
Tests run: 22, Failures: 0, Errors: 0, Skipped: 0, Time elapsed: 1.725 sec
Running org.apache.axis2.om.OMAttributeTest
Tests run: 1, Failures: 0, Errors: 0, Skipped: 0, Time elapsed: 0.457 sec
Running org.apache.axis2.faults.SendingResponseFaultTest
Tests run: 1, Failures: 0, Errors: 0, Skipped: 0, Time elapsed: 0.669 sec
Running org.apache.axis2.faults.FaultSerializationTest
Tests run: 2, Failures: 0, Errors: 0, Skipped: 0, Time elapsed: 0.53 sec
Running org.apache.axis2.deployment.TransportDeploymentTest
Tests run: 1, Failures: 0, Errors: 0, Skipped: 0, Time elapsed: 0.388 sec
Running org.apache.axis2.deployment.LifecycleTest
Tests run: 1, Failures: 0, Errors: 0, Skipped: 0, Time elapsed: 0.545 sec
Running org.apache.axis2.deployment.WSDL11ToAxisServiceBuilderTest
Tests run: 5, Failures: 0, Errors: 0, Skipped: 0, Time elapsed: 1.187 sec
Running org.apache.axis2.deployment.TargetResolverServiceTest
Tests run: 1, Failures: 0, Errors: 0, Skipped: 0, Time elapsed: 0.671 sec
Running org.apache.axis2.transport.http.NonProxyHostTest
Tests run: 1, Failures: 0, Errors: 0, Skipped: 0, Time elapsed: 0.075 sec
Running org.apache.axis2.transport.http.TransportHeadersTest
Tests run: 3, Failures: 0, Errors: 0, Skipped: 0, Time elapsed: 0.024 sec
Running org.apache.axis2.swa.EchoRawSwATest
Tests run: 1, Failures: 0, Errors: 0, Skipped: 0, Time elapsed: 5.944 sec
Running org.apache.axis2.swa.EchoRawSwAFileCacheTest
Tests run: 1, Failures: 0, Errors: 0, Skipped: 0, Time elapsed: 5.939 sec
Running org.apache.axis2.generics.GenericWSDLGenerationTest
Tests run: 1, Failures: 0, Errors: 0, Skipped: 0, Time elapsed: 1.344 sec
Running org.apache.axis2.generics.GenericServiceTest
Tests run: 3, Failures: 0, Errors: 0, Skipped: 0, Time elapsed: 0.747 sec
Running org.apache.axis2.rest.RESTfulServiceTest
Tests run: 2, Failures: 0, Errors: 0, Skipped: 0, Time elapsed: 5.899 sec
Running org.apache.axis2.addressing.AddressingSubmissionServiceTest
Tests run: 3, Failures: 0, Errors: 0, Skipped: 0, Time elapsed: 6.468 sec
Running org.apache.axis2.addressing.AddressingFinalServiceTest
Tests run: 4, Failures: 0, Errors: 0, Skipped: 0, Time elapsed: 8.11 sec
Running org.apache.axis2.addressing.MultiHopRedirectServiceTest
Tests run: 1, Failures: 0, Errors: 0, Skipped: 0, Time elapsed: 5.885 sec
Running org.tempuri.complex.ComplexDataTypesTest
Tests run: 1, Failures: 0, Errors: 0, Skipped: 0, Time elapsed: 2.097 sec
Running org.tempuri.BaseDataTypesTest
Tests run: 1, Failures: 0, Errors: 0, Skipped: 0, Time elapsed: 1.825 sec

Results :

Tests run: 283, Failures: 0, Errors: 0, Skipped: 0

[JENKINS] Recording test results
[INFO] [jar:jar {execution: default-jar}]
[INFO] Building jar: <https://builds.apache.org/job/Axis2/ws/axis2/modules/integration/target/axis2-integration-1.7.0-SNAPSHOT.jar>
[INFO] [assembly:single {execution: source-release-assembly}]
[INFO] Skipping the assembly in this project because it's not the Execution Root
[INFO] Preparing source:jar
[WARNING] Removing: jar from forked lifecycle, to prevent recursive invocation.
[JENKINS] Archiving <https://builds.apache.org/job/Axis2/ws/axis2/modules/integration/pom.xml>
to /home/hudson/hudson/jobs/Axis2/modules/org.apache.axis2$axis2-integration/builds/2013-06-28_19-24-06/archive/org.apache.axis2/axis2-integration/1.7.0-SNAPSHOT/axis2-integration-1.7.0-SNAPSHOT.pom
[JENKINS] Archiving <https://builds.apache.org/job/Axis2/ws/axis2/modules/integration/target/axis2-integration-1.7.0-SNAPSHOT.jar>
to /home/hudson/hudson/jobs/Axis2/modules/org.apache.axis2$axis2-integration/builds/2013-06-28_19-24-06/archive/org.apache.axis2/axis2-integration/1.7.0-SNAPSHOT/axis2-integration-1.7.0-SNAPSHOT.jar
[INFO] [enforcer:enforce {execution: default}]
[INFO] [source:jar {execution: attach-sources}]
[INFO] Building jar: <https://builds.apache.org/job/Axis2/ws/axis2/modules/integration/target/axis2-integration-1.7.0-SNAPSHOT-sources.jar>
[INFO] [javadoc:jar {execution: attach-javadocs}]
[INFO] [gpg:sign {execution: default}]
[INFO] [install:install {execution: default-install}]
[INFO] Installing <https://builds.apache.org/job/Axis2/ws/axis2/modules/integration/target/axis2-integration-1.7.0-SNAPSHOT.jar>
to <https://builds.apache.org/job/Axis2/ws/.repository/org/apache/axis2/axis2-integration/1.7.0-SNAPSHOT/axis2-integration-1.7.0-SNAPSHOT.jar>
[INFO] Installing <https://builds.apache.org/job/Axis2/ws/axis2/modules/integration/target/axis2-integration-1.7.0-SNAPSHOT-sources.jar>
to <https://builds.apache.org/job/Axis2/ws/.repository/org/apache/axis2/axis2-integration/1.7.0-SNAPSHOT/axis2-integration-1.7.0-SNAPSHOT-sources.jar>
[INFO] [deploy:deploy {execution: default-deploy}]
[INFO] Retrieving previous build number from apache.snapshots.https
[WARNING] *** CHECKSUM FAILED - Checksum failed on download: local = 'f96607531e7ec08efaebf2c555dd3b6d067bdbc1';
remote = 'bf2b599e6f893e1b49b8addacae5d2d4cad3d2d0' - RETRYING
[WARNING] *** CHECKSUM FAILED - Checksum failed on download: local = 'f96607531e7ec08efaebf2c555dd3b6d067bdbc1';
remote = 'bf2b599e6f893e1b49b8addacae5d2d4cad3d2d0' - IGNORING
Uploading: https://repository.apache.org/content/repositories/snapshots/org/apache/axis2/axis2-integration/1.7.0-SNAPSHOT/axis2-integration-1.7.0-20130628.192534-1524.jar
11K uploaded  (axis2-integration-1.7.0-20130628.192534-1524.jar)
[INFO] Retrieving previous metadata from apache.snapshots.https
[WARNING] *** CHECKSUM FAILED - Checksum failed on download: local = 'ddfb36c4ff54feddf6e4ce252bed7ae290c83544';
remote = '0445abb90077ce1e19c8c8afe2cb9d91bb1b8ef9' - RETRYING
[WARNING] *** CHECKSUM FAILED - Checksum failed on download: local = 'ddfb36c4ff54feddf6e4ce252bed7ae290c83544';
remote = '0445abb90077ce1e19c8c8afe2cb9d91bb1b8ef9' - IGNORING
[INFO] Uploading repository metadata for: 'artifact org.apache.axis2:axis2-integration'
[INFO] Retrieving previous metadata from apache.snapshots.https
[WARNING] *** CHECKSUM FAILED - Checksum failed on download: local = 'f96607531e7ec08efaebf2c555dd3b6d067bdbc1';
remote = 'bf2b599e6f893e1b49b8addacae5d2d4cad3d2d0' - RETRYING
[WARNING] *** CHECKSUM FAILED - Checksum failed on download: local = 'f96607531e7ec08efaebf2c555dd3b6d067bdbc1';
remote = 'bf2b599e6f893e1b49b8addacae5d2d4cad3d2d0' - IGNORING
[INFO] Uploading repository metadata for: 'snapshot org.apache.axis2:axis2-integration:1.7.0-SNAPSHOT'
[INFO] Uploading project information for axis2-integration 1.7.0-20130628.192534-1524
[INFO] Retrieving previous build number from apache.snapshots.https
Uploading: https://repository.apache.org/content/repositories/snapshots/org/apache/axis2/axis2-integration/1.7.0-SNAPSHOT/axis2-integration-1.7.0-20130628.192534-1524-sources.jar
6K uploaded  (axis2-integration-1.7.0-20130628.192534-1524-sources.jar)
[JENKINS] Archiving <https://builds.apache.org/job/Axis2/ws/axis2/modules/integration/target/axis2-integration-1.7.0-SNAPSHOT.jar>
to /home/hudson/hudson/jobs/Axis2/modules/org.apache.axis2$axis2-integration/builds/2013-06-28_19-24-06/archive/org.apache.axis2/axis2-integration/1.7.0-20130628.192534-1524/axis2-integration-1.7.0-20130628.192534-1524.jar
[JENKINS] Archiving <https://builds.apache.org/job/Axis2/ws/axis2/modules/integration/target/axis2-integration-1.7.0-SNAPSHOT-sources.jar>
to /home/hudson/hudson/jobs/Axis2/modules/org.apache.axis2$axis2-integration/builds/2013-06-28_19-24-06/archive/org.apache.axis2/axis2-integration/1.7.0-20130628.192534-1524/axis2-integration-1.7.0-20130628.192534-1524-sources.jar
[INFO] ------------------------------------------------------------------------
[INFO] Building Apache Axis2 - JiBX Data Binding
[INFO]    task-segment: [clean, deploy]
[INFO] ------------------------------------------------------------------------
[INFO] [clean:clean {execution: default-clean}]
[INFO] Deleting directory <https://builds.apache.org/job/Axis2/ws/axis2/modules/jibx/target>
[INFO] [enforcer:enforce {execution: default}]
[INFO] [remote-resources:process {execution: default}]
[INFO] [resources:resources {execution: default-resources}]
[INFO] Using 'UTF-8' encoding to copy filtered resources.
[INFO] Copying 1 resource
[INFO] Copying 2 resources
[INFO] [compiler:compile {execution: default-compile}]
[INFO] Compiling 3 source files to <https://builds.apache.org/job/Axis2/ws/axis2/modules/jibx/target/classes>
[INFO] [antrun:run {execution: wsdl2java}]
[INFO] Executing tasks
     [java] Retrieving document at 'src/test/wsdl/library.wsdl'.
Jun 28, 2013 8:04:44 PM hudson.remoting.SynchronousCommandTransport$ReaderThread run
SEVERE: I/O error in channel channel
java.io.StreamCorruptedException
	at java.io.ObjectInputStream.readObject0(ObjectInputStream.java:1332)
	at java.io.ObjectInputStream.readObject(ObjectInputStream.java:348)
	at hudson.remoting.Command.readFrom(Command.java:92)
	at hudson.remoting.ClassicCommandTransport.read(ClassicCommandTransport.java:59)
	at hudson.remoting.SynchronousCommandTransport$ReaderThread.run(SynchronousCommandTransport.java:48)
channel stopped
     [java] Java Result: 2147483647
[locks-and-latches] Releasing all the locks
[locks-and-latches] All the locks released
ERROR: Maven JVM terminated unexpectedly with exit code 0


---------------------------------------------------------------------
To unsubscribe, e-mail: java-dev-unsubscribe@axis.apache.org
For additional commands, e-mail: java-dev-help@axis.apache.org


Mime
View raw message