axis-java-dev mailing list archives

Site index · List index
Message view « Date » · « Thread »
Top « Date » · « Thread »
From Apache Jenkins Server <jenk...@builds.apache.org>
Subject Build failed in Jenkins: Rampart #1458
Date Sun, 21 Apr 2013 04:52:38 GMT
See <https://builds.apache.org/job/Rampart/1458/changes>

Changes:

[veithen] Use standard Maven project layout (with resources in src/main/resources).

[veithen] Committed a change that was missing in r1455697.

------------------------------------------
[...truncated 507 lines...]
[INFO] --- maven-remote-resources-plugin:1.1:process (default) @ rampart ---
[INFO] Setting property: classpath.resource.loader.class => 'org.codehaus.plexus.velocity.ContextClassLoaderResourceLoader'.
[INFO] Setting property: velocimacro.messages.on => 'false'.
[INFO] Setting property: resource.loader => 'classpath'.
[INFO] Setting property: resource.manager.logwhenfound => 'false'.
[WARNING] org.apache.velocity.runtime.exception.ReferenceException: reference : template =
META-INF/DEPENDENCIES.vm [line 40,column 14] : $license.name is not a valid reference.
[INFO] 
[INFO] [INFO] Using 'UTF-8' encoding to copy filtered resources.
--- maven-resources-plugin:2.4:resources (default-resources) @ rampart ---
[INFO] skip non existing resourceDirectory <https://builds.apache.org/job/Rampart/ws/trunk/modules/rampart-mar/src/main/resources>
[INFO] Copying 3 resources
[INFO] [INFO] No sources to compile

[INFO] --- maven-compiler-plugin:2.0:compile (default-compile) @ rampart ---
[INFO] [INFO] Using 'UTF-8' encoding to copy filtered resources.
[INFO] skip non existing resourceDirectory <https://builds.apache.org/job/Rampart/ws/trunk/modules/rampart-mar/src/test/resources>
[INFO] Copying 3 resources

[INFO] --- maven-resources-plugin:2.4:testResources (default-testResources) @ rampart ---
[INFO] [INFO] No sources to compile

[INFO] --- maven-compiler-plugin:2.0:testCompile (default-testCompile) @ rampart ---
[INFO] [INFO] Surefire report directory: <https://builds.apache.org/job/Rampart/ws/trunk/modules/rampart-mar/target/surefire-reports>

[INFO] --- maven-surefire-plugin:2.10:test (default-test) @ rampart ---

-------------------------------------------------------
 T E S T S
-------------------------------------------------------

Results :

Tests run: 0, Failures: 0, Errors: 0, Skipped: 0

[JENKINS] Recording test results
[INFO] 
[INFO] --- build-helper-maven-plugin:1.7:attach-artifact (attach-jacoco-exec) @ rampart ---
[INFO] 
[INFO] --- axis2-mar-maven-plugin:1.5.4:mar (default-mar) @ rampart ---
[INFO] Generating mar <https://builds.apache.org/job/Rampart/ws/trunk/modules/rampart-mar/target/rampart-1.7.0-SNAPSHOT.mar>
[INFO] Building jar: <https://builds.apache.org/job/Rampart/ws/trunk/modules/rampart-mar/target/rampart-1.7.0-SNAPSHOT.mar>
[INFO] 
[INFO] --- build-helper-maven-plugin:1.7:attach-artifact (aar) @ rampart ---
[INFO] 
[INFO] --- maven-enforcer-plugin:1.1:enforce (default) @ rampart ---
[INFO] 
[INFO] --- gmaven-plugin:1.2:execute (initialize) @ rampart ---
[INFO] [INFO] jacoco.surefireArgLine set to -javaagent:<https://builds.apache.org/job/Rampart/ws/.repository/org/jacoco/org.jacoco.agent/0.6.1.201212231917/org.jacoco.agent-0.6.1.201212231917-runtime.jar=destfile=/home/jenkins/jenkins-slave/workspace/Rampart/trunk/modules/rampart-mar/target/jacoco.exec,sessionid=mvn>:org.apache.rampart:rampart:1.7.0-SNAPSHOT:surefire
-javaagent:<https://builds.apache.org/job/Rampart/ws/.repository/org/jacoco/org.jacoco.agent/0.6.1.201212231917/org.jacoco.agent-0.6.1.201212231917-runtime.jar=destfile=/home/jenkins/jenkins-slave/workspace/Rampart/trunk/modules/rampart-mar/target/jacoco.exec,sessionid=mvn>:org.apache.rampart:rampart:1.7.0-SNAPSHOT:surefire

[INFO] --- jacoco-maven-plugin:0.6.1.201212231917:prepare-agent (prepare-agent-for-surefire)
@ rampart ---
Apr 21, 2013 4:51:57 AM hudson.maven.ExecutedMojo <init>
WARNING: Failed to getClass for org.apache.maven.plugin.source.SourceJarMojo
[INFO] [INFO] Building jar: <https://builds.apache.org/job/Rampart/ws/trunk/modules/rampart-mar/target/rampart-1.7.0-SNAPSHOT-sources.jar>

[INFO] --- maven-source-plugin:2.1.1:jar (attach-sources) @ rampart ---
[INFO] [INFO] Installing <https://builds.apache.org/job/Rampart/ws/trunk/modules/rampart-mar/target/rampart-1.7.0-SNAPSHOT.mar>
to <https://builds.apache.org/job/Rampart/ws/.repository/org/apache/rampart/rampart/1.7.0-SNAPSHOT/rampart-1.7.0-SNAPSHOT.mar>
[INFO] Installing <https://builds.apache.org/job/Rampart/ws/trunk/modules/rampart-mar/pom.xml>
to <https://builds.apache.org/job/Rampart/ws/.repository/org/apache/rampart/rampart/1.7.0-SNAPSHOT/rampart-1.7.0-SNAPSHOT.pom>
[INFO] Installing <https://builds.apache.org/job/Rampart/ws/trunk/modules/rampart-mar/target/jacoco.exec>
to <https://builds.apache.org/job/Rampart/ws/.repository/org/apache/rampart/rampart/1.7.0-SNAPSHOT/rampart-1.7.0-SNAPSHOT-jacoco.exec>
[INFO] Installing <https://builds.apache.org/job/Rampart/ws/trunk/modules/rampart-mar/target/rampart-1.7.0-SNAPSHOT.mar>
to <https://builds.apache.org/job/Rampart/ws/.repository/org/apache/rampart/rampart/1.7.0-SNAPSHOT/rampart-1.7.0-SNAPSHOT.jar>

[INFO] Installing <https://builds.apache.org/job/Rampart/ws/trunk/modules/rampart-mar/target/rampart-1.7.0-SNAPSHOT-sources.jar>
to <https://builds.apache.org/job/Rampart/ws/.repository/org/apache/rampart/rampart/1.7.0-SNAPSHOT/rampart-1.7.0-SNAPSHOT-sources.jar>
[INFO] --- maven-install-plugin:2.3:install (default-install) @ rampart ---
[INFO] [INFO] Deleting <https://builds.apache.org/job/Rampart/ws/trunk/modules/rampart-trust-mar/target>
                                                                        
[INFO] ------------------------------------------------------------------------
[INFO] Building Rampart - Trust-Mar 1.7.0-SNAPSHOT
[INFO] ------------------------------------------------------------------------
[INFO] 
[INFO] --- maven-clean-plugin:2.4.1:clean (default-clean) @ rahas ---
[INFO] 
[INFO] --- maven-enforcer-plugin:1.1:enforce (default) @ rahas ---
[INFO] 
[INFO] --- gmaven-plugin:1.2:execute (initialize) @ rahas ---
[INFO] [INFO] jacoco.surefireArgLine set to -javaagent:<https://builds.apache.org/job/Rampart/ws/.repository/org/jacoco/org.jacoco.agent/0.6.1.201212231917/org.jacoco.agent-0.6.1.201212231917-runtime.jar=destfile=/home/jenkins/jenkins-slave/workspace/Rampart/trunk/modules/rampart-trust-mar/target/jacoco.exec,sessionid=mvn>:org.apache.rampart:rahas:1.7.0-SNAPSHOT:surefire

[INFO] --- jacoco-maven-plugin:0.6.1.201212231917:prepare-agent (prepare-agent-for-surefire)
@ rahas ---
[INFO] 
[INFO] --- maven-remote-resources-plugin:1.1:process (default) @ rahas ---
[WARNING] org.apache.velocity.runtime.exception.ReferenceException: reference : template =
META-INF/DEPENDENCIES.vm [line 40,column 14] : $license.name is not a valid reference.
[INFO] [INFO] Using 'UTF-8' encoding to copy filtered resources.
[INFO] skip non existing resourceDirectory <https://builds.apache.org/job/Rampart/ws/trunk/modules/rampart-trust-mar/src/main/resources>
[INFO] Copying 3 resources

[INFO] --- maven-resources-plugin:2.4:resources (default-resources) @ rahas ---
[INFO] [INFO] No sources to compile

[INFO] --- maven-compiler-plugin:2.0:compile (default-compile) @ rahas ---
[INFO] [INFO] Using 'UTF-8' encoding to copy filtered resources.
[INFO] skip non existing resourceDirectory <https://builds.apache.org/job/Rampart/ws/trunk/modules/rampart-trust-mar/src/test/resources>
[INFO] Copying 3 resources

[INFO] --- maven-resources-plugin:2.4:testResources (default-testResources) @ rahas ---
[INFO] [INFO] No sources to compile

[INFO] --- maven-compiler-plugin:2.0:testCompile (default-testCompile) @ rahas ---
[INFO] [INFO] Surefire report directory: <https://builds.apache.org/job/Rampart/ws/trunk/modules/rampart-trust-mar/target/surefire-reports>

-------------------------------------------------------
 T E S T S
-------------------------------------------------------

[INFO] --- maven-surefire-plugin:2.10:test (default-test) @ rahas ---

Results :

Tests run: 0, Failures: 0, Errors: 0, Skipped: 0

[JENKINS] Recording test results
[INFO] 
[INFO] --- build-helper-maven-plugin:1.7:attach-artifact (attach-jacoco-exec) @ rahas ---
[INFO] [INFO] Generating mar <https://builds.apache.org/job/Rampart/ws/trunk/modules/rampart-trust-mar/target/rahas-1.7.0-SNAPSHOT.mar>
[INFO] Building jar: <https://builds.apache.org/job/Rampart/ws/trunk/modules/rampart-trust-mar/target/rahas-1.7.0-SNAPSHOT.mar>

[INFO] --- axis2-mar-maven-plugin:1.5.4:mar (default-mar) @ rahas ---
[INFO] 
[INFO] --- maven-enforcer-plugin:1.1:enforce (default) @ rahas ---
[INFO] 
[INFO] --- gmaven-plugin:1.2:execute (initialize) @ rahas ---
[INFO] [INFO] jacoco.surefireArgLine set to -javaagent:<https://builds.apache.org/job/Rampart/ws/.repository/org/jacoco/org.jacoco.agent/0.6.1.201212231917/org.jacoco.agent-0.6.1.201212231917-runtime.jar=destfile=/home/jenkins/jenkins-slave/workspace/Rampart/trunk/modules/rampart-trust-mar/target/jacoco.exec,sessionid=mvn>:org.apache.rampart:rahas:1.7.0-SNAPSHOT:surefire
-javaagent:<https://builds.apache.org/job/Rampart/ws/.repository/org/jacoco/org.jacoco.agent/0.6.1.201212231917/org.jacoco.agent-0.6.1.201212231917-runtime.jar=destfile=/home/jenkins/jenkins-slave/workspace/Rampart/trunk/modules/rampart-trust-mar/target/jacoco.exec,sessionid=mvn>:org.apache.rampart:rahas:1.7.0-SNAPSHOT:surefire

[INFO] --- jacoco-maven-plugin:0.6.1.201212231917:prepare-agent (prepare-agent-for-surefire)
@ rahas ---
Apr 21, 2013 4:52:01 AM hudson.maven.ExecutedMojo <init>
WARNING: Failed to getClass for org.apache.maven.plugin.source.SourceJarMojo
[INFO] Building jar: <https://builds.apache.org/job/Rampart/ws/trunk/modules/rampart-trust-mar/target/rahas-1.7.0-SNAPSHOT-sources.jar>
[INFO] 
[INFO] --- maven-source-plugin:2.1.1:jar (attach-sources) @ rahas ---
[INFO] [INFO] Installing <https://builds.apache.org/job/Rampart/ws/trunk/modules/rampart-trust-mar/target/rahas-1.7.0-SNAPSHOT.mar>
to <https://builds.apache.org/job/Rampart/ws/.repository/org/apache/rampart/rahas/1.7.0-SNAPSHOT/rahas-1.7.0-SNAPSHOT.mar>
[INFO] Installing <https://builds.apache.org/job/Rampart/ws/trunk/modules/rampart-trust-mar/pom.xml>
to <https://builds.apache.org/job/Rampart/ws/.repository/org/apache/rampart/rahas/1.7.0-SNAPSHOT/rahas-1.7.0-SNAPSHOT.pom>
[INFO] Installing <https://builds.apache.org/job/Rampart/ws/trunk/modules/rampart-trust-mar/target/jacoco.exec>
to <https://builds.apache.org/job/Rampart/ws/.repository/org/apache/rampart/rahas/1.7.0-SNAPSHOT/rahas-1.7.0-SNAPSHOT-jacoco.exec>
[INFO] Installing <https://builds.apache.org/job/Rampart/ws/trunk/modules/rampart-trust-mar/target/rahas-1.7.0-SNAPSHOT-sources.jar>
to <https://builds.apache.org/job/Rampart/ws/.repository/org/apache/rampart/rahas/1.7.0-SNAPSHOT/rahas-1.7.0-SNAPSHOT-sources.jar>

[INFO] --- maven-install-plugin:2.3:install (default-install) @ rahas ---
[INFO] [WARNING] The POM for org.apache.axis2:axis2-repo-maven-plugin:jar:1.7.0-SNAPSHOT is
missing, no dependency information available
                                                                        
[INFO] ------------------------------------------------------------------------
[INFO] Building Rampart - Integration 1.7.0-SNAPSHOT
[INFO] ------------------------------------------------------------------------
[INFO] ------------------------------------------------------------------------
[INFO] Reactor Summary:
[INFO] 
[INFO] Apache Rampart .................................... SUCCESS [31.446s]
[INFO] Rampart - Policy .................................. SUCCESS [14.391s]
[INFO] Rampart - Trust ................................... SUCCESS [30.942s]
[INFO] Rampart - Core .................................... SUCCESS [10.394s]
[INFO] Rampart - Test Suite .............................. SUCCESS [13.260s]
[INFO] Rampart - Mar ..................................... SUCCESS [6.327s]
[INFO] Rampart - Trust-Mar ............................... SUCCESS [3.704s]
[INFO] Rampart - Integration ............................. FAILURE [0.069s]
[INFO] Rampart - Samples ................................. SKIPPED
[INFO] Code Coverage Report .............................. SKIPPED
[INFO] Rampart - Documentation ........................... SKIPPED
[INFO] Rampart - Distribution ............................ SKIPPED
[INFO] ------------------------------------------------------------------------
[INFO] BUILD FAILURE
[INFO] ------------------------------------------------------------------------
[INFO] Total time: 1:54.338s
[INFO] Finished at: Sun Apr 21 04:52:01 UTC 2013
[INFO] Final Memory: 58M/164M
[INFO] ------------------------------------------------------------------------
[JENKINS] Archiving <https://builds.apache.org/job/Rampart/ws/trunk/modules/rampart-core/pom.xml>
to /home/hudson/hudson/jobs/Rampart/modules/org.apache.rampart$rampart-core/builds/2013-04-21_04-49-46/archive/org.apache.rampart/rampart-core/1.7.0-SNAPSHOT/rampart-core-1.7.0-SNAPSHOT.pom
[JENKINS] Archiving <https://builds.apache.org/job/Rampart/ws/trunk/modules/rampart-core/target/rampart-core-1.7.0-SNAPSHOT.jar>
to /home/hudson/hudson/jobs/Rampart/modules/org.apache.rampart$rampart-core/builds/2013-04-21_04-49-46/archive/org.apache.rampart/rampart-core/1.7.0-SNAPSHOT/rampart-core-1.7.0-SNAPSHOT.jar
[JENKINS] Archiving <https://builds.apache.org/job/Rampart/ws/trunk/modules/rampart-core/target/jacoco.exec>
to /home/hudson/hudson/jobs/Rampart/modules/org.apache.rampart$rampart-core/builds/2013-04-21_04-49-46/archive/org.apache.rampart/rampart-core/1.7.0-SNAPSHOT/rampart-core-1.7.0-SNAPSHOT-jacoco.exec
[JENKINS] Archiving <https://builds.apache.org/job/Rampart/ws/trunk/modules/rampart-core/target/rampart-core-1.7.0-SNAPSHOT-sources.jar>
to /home/hudson/hudson/jobs/Rampart/modules/org.apache.rampart$rampart-core/builds/2013-04-21_04-49-46/archive/org.apache.rampart/rampart-core/1.7.0-SNAPSHOT/rampart-core-1.7.0-SNAPSHOT-sources.jar
[JENKINS] Archiving <https://builds.apache.org/job/Rampart/ws/trunk/modules/rampart-tests/pom.xml>
to /home/hudson/hudson/jobs/Rampart/modules/org.apache.rampart$rampart-tests/builds/2013-04-21_04-49-46/archive/org.apache.rampart/rampart-tests/1.7.0-SNAPSHOT/rampart-tests-1.7.0-SNAPSHOT.pom
[JENKINS] Archiving <https://builds.apache.org/job/Rampart/ws/trunk/modules/rampart-tests/target/rampart-tests-1.7.0-SNAPSHOT.jar>
to /home/hudson/hudson/jobs/Rampart/modules/org.apache.rampart$rampart-tests/builds/2013-04-21_04-49-46/archive/org.apache.rampart/rampart-tests/1.7.0-SNAPSHOT/rampart-tests-1.7.0-SNAPSHOT.jar
[JENKINS] Archiving <https://builds.apache.org/job/Rampart/ws/trunk/modules/rampart-tests/target/jacoco.exec>
to /home/hudson/hudson/jobs/Rampart/modules/org.apache.rampart$rampart-tests/builds/2013-04-21_04-49-46/archive/org.apache.rampart/rampart-tests/1.7.0-SNAPSHOT/rampart-tests-1.7.0-SNAPSHOT-jacoco.exec
[JENKINS] Archiving <https://builds.apache.org/job/Rampart/ws/trunk/modules/rampart-tests/target/rampart-tests-1.7.0-SNAPSHOT-sources.jar>
to /home/hudson/hudson/jobs/Rampart/modules/org.apache.rampart$rampart-tests/builds/2013-04-21_04-49-46/archive/org.apache.rampart/rampart-tests/1.7.0-SNAPSHOT/rampart-tests-1.7.0-SNAPSHOT-sources.jar
[JENKINS] Archiving <https://builds.apache.org/job/Rampart/ws/trunk/modules/documentation/pom.xml>
to /home/hudson/hudson/jobs/Rampart/modules/org.apache.rampart$rampart-documentation/builds/2013-04-21_04-49-47/archive/org.apache.rampart/rampart-documentation/1.7.0-SNAPSHOT/rampart-documentation-1.7.0-SNAPSHOT.pom
[JENKINS] Archiving <https://builds.apache.org/job/Rampart/ws/trunk/pom.xml> to /home/hudson/hudson/jobs/Rampart/modules/org.apache.rampart$rampart-project/builds/2013-04-21_04-49-45/archive/org.apache.rampart/rampart-project/1.7.0-SNAPSHOT/rampart-project-1.7.0-SNAPSHOT.pom
[JENKINS] Archiving <https://builds.apache.org/job/Rampart/ws/trunk/code-coverage/pom.xml>
to /home/hudson/hudson/jobs/Rampart/modules/org.apache.rampart$code-coverage/builds/2013-04-21_04-49-47/archive/org.apache.rampart/code-coverage/1.7.0-SNAPSHOT/code-coverage-1.7.0-SNAPSHOT.pom
[JENKINS] Archiving <https://builds.apache.org/job/Rampart/ws/trunk/modules/rampart-trust-mar/pom.xml>
to /home/hudson/hudson/jobs/Rampart/modules/org.apache.rampart$rahas/builds/2013-04-21_04-49-46/archive/org.apache.rampart/rahas/1.7.0-SNAPSHOT/rahas-1.7.0-SNAPSHOT.pom
[JENKINS] Archiving <https://builds.apache.org/job/Rampart/ws/trunk/modules/rampart-trust-mar/target/rahas-1.7.0-SNAPSHOT.mar>
to /home/hudson/hudson/jobs/Rampart/modules/org.apache.rampart$rahas/builds/2013-04-21_04-49-46/archive/org.apache.rampart/rahas/1.7.0-SNAPSHOT/rahas-1.7.0-SNAPSHOT.mar
[JENKINS] Archiving <https://builds.apache.org/job/Rampart/ws/trunk/modules/rampart-trust-mar/target/jacoco.exec>
to /home/hudson/hudson/jobs/Rampart/modules/org.apache.rampart$rahas/builds/2013-04-21_04-49-46/archive/org.apache.rampart/rahas/1.7.0-SNAPSHOT/rahas-1.7.0-SNAPSHOT-jacoco.exec
[JENKINS] Archiving <https://builds.apache.org/job/Rampart/ws/trunk/modules/rampart-trust-mar/target/rahas-1.7.0-SNAPSHOT-sources.jar>
to /home/hudson/hudson/jobs/Rampart/modules/org.apache.rampart$rahas/builds/2013-04-21_04-49-46/archive/org.apache.rampart/rahas/1.7.0-SNAPSHOT/rahas-1.7.0-SNAPSHOT-sources.jar
[JENKINS] Archiving <https://builds.apache.org/job/Rampart/ws/trunk/modules/rampart-integration/pom.xml>
to /home/hudson/hudson/jobs/Rampart/modules/org.apache.rampart$rampart-integration/builds/2013-04-21_04-49-46/archive/org.apache.rampart/rampart-integration/1.7.0-SNAPSHOT/rampart-integration-1.7.0-SNAPSHOT.pom
[JENKINS] Archiving <https://builds.apache.org/job/Rampart/ws/trunk/modules/rampart-samples/pom.xml>
to /home/hudson/hudson/jobs/Rampart/modules/org.apache.rampart$rampart-sample/builds/2013-04-21_04-49-47/archive/org.apache.rampart/rampart-sample/1.7.0-SNAPSHOT/rampart-sample-1.7.0-SNAPSHOT.pom
[JENKINS] Archiving <https://builds.apache.org/job/Rampart/ws/trunk/modules/rampart-mar/pom.xml>
to /home/hudson/hudson/jobs/Rampart/modules/org.apache.rampart$rampart/builds/2013-04-21_04-49-46/archive/org.apache.rampart/rampart/1.7.0-SNAPSHOT/rampart-1.7.0-SNAPSHOT.pom
[JENKINS] Archiving <https://builds.apache.org/job/Rampart/ws/trunk/modules/rampart-mar/target/rampart-1.7.0-SNAPSHOT.mar>
to /home/hudson/hudson/jobs/Rampart/modules/org.apache.rampart$rampart/builds/2013-04-21_04-49-46/archive/org.apache.rampart/rampart/1.7.0-SNAPSHOT/rampart-1.7.0-SNAPSHOT.mar
[JENKINS] Archiving <https://builds.apache.org/job/Rampart/ws/trunk/modules/rampart-mar/target/jacoco.exec>
to /home/hudson/hudson/jobs/Rampart/modules/org.apache.rampart$rampart/builds/2013-04-21_04-49-46/archive/org.apache.rampart/rampart/1.7.0-SNAPSHOT/rampart-1.7.0-SNAPSHOT-jacoco.exec
[JENKINS] Archiving <https://builds.apache.org/job/Rampart/ws/trunk/modules/rampart-mar/target/rampart-1.7.0-SNAPSHOT.mar>
to /home/hudson/hudson/jobs/Rampart/modules/org.apache.rampart$rampart/builds/2013-04-21_04-49-46/archive/org.apache.rampart/rampart/1.7.0-SNAPSHOT/rampart-1.7.0-SNAPSHOT.jar
[JENKINS] Archiving <https://builds.apache.org/job/Rampart/ws/trunk/modules/rampart-mar/target/rampart-1.7.0-SNAPSHOT-sources.jar>
to /home/hudson/hudson/jobs/Rampart/modules/org.apache.rampart$rampart/builds/2013-04-21_04-49-46/archive/org.apache.rampart/rampart/1.7.0-SNAPSHOT/rampart-1.7.0-SNAPSHOT-sources.jar
[JENKINS] Archiving <https://builds.apache.org/job/Rampart/ws/trunk/modules/rampart-policy/pom.xml>
to /home/hudson/hudson/jobs/Rampart/modules/org.apache.rampart$rampart-policy/builds/2013-04-21_04-49-45/archive/org.apache.rampart/rampart-policy/1.7.0-SNAPSHOT/rampart-policy-1.7.0-SNAPSHOT.pom
[JENKINS] Archiving <https://builds.apache.org/job/Rampart/ws/trunk/modules/rampart-policy/target/rampart-policy-1.7.0-SNAPSHOT.jar>
to /home/hudson/hudson/jobs/Rampart/modules/org.apache.rampart$rampart-policy/builds/2013-04-21_04-49-45/archive/org.apache.rampart/rampart-policy/1.7.0-SNAPSHOT/rampart-policy-1.7.0-SNAPSHOT.jar
[JENKINS] Archiving <https://builds.apache.org/job/Rampart/ws/trunk/modules/rampart-policy/target/jacoco.exec>
to /home/hudson/hudson/jobs/Rampart/modules/org.apache.rampart$rampart-policy/builds/2013-04-21_04-49-45/archive/org.apache.rampart/rampart-policy/1.7.0-SNAPSHOT/rampart-policy-1.7.0-SNAPSHOT-jacoco.exec
[JENKINS] Archiving <https://builds.apache.org/job/Rampart/ws/trunk/modules/rampart-policy/target/rampart-policy-1.7.0-SNAPSHOT-sources.jar>
to /home/hudson/hudson/jobs/Rampart/modules/org.apache.rampart$rampart-policy/builds/2013-04-21_04-49-45/archive/org.apache.rampart/rampart-policy/1.7.0-SNAPSHOT/rampart-policy-1.7.0-SNAPSHOT-sources.jar
[JENKINS] Archiving <https://builds.apache.org/job/Rampart/ws/trunk/modules/rampart-trust/pom.xml>
to /home/hudson/hudson/jobs/Rampart/modules/org.apache.rampart$rampart-trust/builds/2013-04-21_04-49-45/archive/org.apache.rampart/rampart-trust/1.7.0-SNAPSHOT/rampart-trust-1.7.0-SNAPSHOT.pom
[JENKINS] Archiving <https://builds.apache.org/job/Rampart/ws/trunk/modules/rampart-trust/target/rampart-trust-1.7.0-SNAPSHOT.jar>
to /home/hudson/hudson/jobs/Rampart/modules/org.apache.rampart$rampart-trust/builds/2013-04-21_04-49-45/archive/org.apache.rampart/rampart-trust/1.7.0-SNAPSHOT/rampart-trust-1.7.0-SNAPSHOT.jar
[JENKINS] Archiving <https://builds.apache.org/job/Rampart/ws/trunk/modules/rampart-trust/target/jacoco.exec>
to /home/hudson/hudson/jobs/Rampart/modules/org.apache.rampart$rampart-trust/builds/2013-04-21_04-49-45/archive/org.apache.rampart/rampart-trust/1.7.0-SNAPSHOT/rampart-trust-1.7.0-SNAPSHOT-jacoco.exec
[JENKINS] Archiving <https://builds.apache.org/job/Rampart/ws/trunk/modules/rampart-trust/target/rampart-trust-1.7.0-SNAPSHOT-sources.jar>
to /home/hudson/hudson/jobs/Rampart/modules/org.apache.rampart$rampart-trust/builds/2013-04-21_04-49-45/archive/org.apache.rampart/rampart-trust/1.7.0-SNAPSHOT/rampart-trust-1.7.0-SNAPSHOT-sources.jar
[JENKINS] Archiving <https://builds.apache.org/job/Rampart/ws/trunk/modules/distribution/pom.xml>
to /home/hudson/hudson/jobs/Rampart/modules/org.apache.rampart$rampart-dist/builds/2013-04-21_04-49-47/archive/org.apache.rampart/rampart-dist/1.7.0-SNAPSHOT/rampart-dist-1.7.0-SNAPSHOT.pom
Waiting for Jenkins to finish collecting data
mavenExecutionResult exceptions not empty
message : Plugin org.apache.axis2:axis2-repo-maven-plugin:1.7.0-SNAPSHOT or one of its dependencies
could not be resolved: Failed to read artifact descriptor for org.apache.axis2:axis2-repo-maven-plugin:jar:1.7.0-SNAPSHOT
cause : Failed to read artifact descriptor for org.apache.axis2:axis2-repo-maven-plugin:jar:1.7.0-SNAPSHOT
Stack trace : 
org.apache.maven.plugin.PluginResolutionException: Plugin org.apache.axis2:axis2-repo-maven-plugin:1.7.0-SNAPSHOT
or one of its dependencies could not be resolved: Failed to read artifact descriptor for org.apache.axis2:axis2-repo-maven-plugin:jar:1.7.0-SNAPSHOT
	at org.apache.maven.plugin.internal.DefaultPluginDependenciesResolver.resolve(DefaultPluginDependenciesResolver.java:129)
	at org.apache.maven.plugin.internal.DefaultMavenPluginManager.getPluginDescriptor(DefaultMavenPluginManager.java:142)
	at org.apache.maven.plugin.internal.DefaultMavenPluginManager.getMojoDescriptor(DefaultMavenPluginManager.java:261)
	at org.apache.maven.plugin.DefaultBuildPluginManager.getMojoDescriptor(DefaultBuildPluginManager.java:185)
	at org.apache.maven.lifecycle.internal.DefaultLifecycleExecutionPlanCalculator.calculateLifecycleMappings(DefaultLifecycleExecutionPlanCalculator.java:280)
	at org.apache.maven.lifecycle.internal.DefaultLifecycleExecutionPlanCalculator.calculateMojoExecutions(DefaultLifecycleExecutionPlanCalculator.java:193)
	at org.apache.maven.lifecycle.internal.DefaultLifecycleExecutionPlanCalculator.calculateExecutionPlan(DefaultLifecycleExecutionPlanCalculator.java:112)
	at org.apache.maven.lifecycle.internal.DefaultLifecycleExecutionPlanCalculator.calculateExecutionPlan(DefaultLifecycleExecutionPlanCalculator.java:129)
	at org.apache.maven.lifecycle.internal.BuilderCommon.resolveBuildPlan(BuilderCommon.java:92)
	at org.apache.maven.lifecycle.internal.LifecycleModuleBuilder.buildProject(LifecycleModuleBuilder.java:81)
	at org.apache.maven.lifecycle.internal.LifecycleModuleBuilder.buildProject(LifecycleModuleBuilder.java:59)
	at org.apache.maven.lifecycle.internal.LifecycleStarter.singleThreadedBuild(LifecycleStarter.java:183)
	at org.apache.maven.lifecycle.internal.LifecycleStarter.execute(LifecycleStarter.java:161)
	at org.apache.maven.DefaultMaven.doExecute(DefaultMaven.java:319)
	at org.apache.maven.DefaultMaven.execute(DefaultMaven.java:156)
	at org.jvnet.hudson.maven3.launcher.Maven3Launcher.main(Maven3Launcher.java:79)
	at sun.reflect.NativeMethodAccessorImpl.invoke0(Native Method)
	at sun.reflect.NativeMethodAccessorImpl.invoke(NativeMethodAccessorImpl.java:39)
	at sun.reflect.DelegatingMethodAccessorImpl.invoke(DelegatingMethodAccessorImpl.java:25)
	at java.lang.reflect.Method.invoke(Method.java:597)
	at org.codehaus.plexus.classworlds.launcher.Launcher.launchStandard(Launcher.java:329)
	at org.codehaus.plexus.classworlds.launcher.Launcher.launch(Launcher.java:239)
	at org.jvnet.hudson.maven3.agent.Maven3Main.launch(Maven3Main.java:158)
	at hudson.maven.Maven3Builder.call(Maven3Builder.java:100)
	at hudson.maven.Maven3Builder.call(Maven3Builder.java:66)
	at hudson.remoting.UserRequest.perform(UserRequest.java:118)
	at hudson.remoting.UserRequest.perform(UserRequest.java:48)
	at hudson.remoting.Request$2.run(Request.java:326)
	at hudson.remoting.InterceptingExecutorService$1.call(InterceptingExecutorService.java:72)
	at java.util.concurrent.FutureTask$Sync.innerRun(FutureTask.java:303)
	at java.util.concurrent.FutureTask.run(FutureTask.java:138)
	at java.util.concurrent.ThreadPoolExecutor$Worker.runTask(ThreadPoolExecutor.java:886)
	at java.util.concurrent.ThreadPoolExecutor$Worker.run(ThreadPoolExecutor.java:908)
	at java.lang.Thread.run(Thread.java:619)
Caused by: org.sonatype.aether.resolution.ArtifactDescriptorException: Failed to read artifact
descriptor for org.apache.axis2:axis2-repo-maven-plugin:jar:1.7.0-SNAPSHOT
	at org.apache.maven.repository.internal.DefaultArtifactDescriptorReader.loadPom(DefaultArtifactDescriptorReader.java:282)
	at org.apache.maven.repository.internal.DefaultArtifactDescriptorReader.readArtifactDescriptor(DefaultArtifactDescriptorReader.java:172)
	at org.sonatype.aether.impl.internal.DefaultRepositorySystem.readArtifactDescriptor(DefaultRepositorySystem.java:316)
	at org.apache.maven.plugin.internal.DefaultPluginDependenciesResolver.resolve(DefaultPluginDependenciesResolver.java:115)
	... 33 more
Caused by: org.sonatype.aether.resolution.ArtifactResolutionException: Could not find artifact
org.apache.axis2:axis2-repo-maven-plugin:pom:1.7.0-SNAPSHOT
	at org.sonatype.aether.impl.internal.DefaultArtifactResolver.resolve(DefaultArtifactResolver.java:541)
	at org.sonatype.aether.impl.internal.DefaultArtifactResolver.resolveArtifacts(DefaultArtifactResolver.java:220)
	at org.sonatype.aether.impl.internal.DefaultArtifactResolver.resolveArtifact(DefaultArtifactResolver.java:197)
	at org.apache.maven.repository.internal.DefaultArtifactDescriptorReader.loadPom(DefaultArtifactDescriptorReader.java:267)
	... 36 more
Caused by: org.sonatype.aether.transfer.ArtifactNotFoundException: Could not find artifact
org.apache.axis2:axis2-repo-maven-plugin:pom:1.7.0-SNAPSHOT
	at org.sonatype.aether.impl.internal.DefaultArtifactResolver.resolve(DefaultArtifactResolver.java:531)
	... 39 more
Sending e-mails to: java-dev@axis.apache.org
channel stopped
[locks-and-latches] Releasing all the locks
[locks-and-latches] All the locks released

---------------------------------------------------------------------
To unsubscribe, e-mail: java-dev-unsubscribe@axis.apache.org
For additional commands, e-mail: java-dev-help@axis.apache.org


Mime
View raw message