axis-java-dev mailing list archives

Site index · List index
Message view « Date » · « Thread »
Top « Date » · « Thread »
From Apache Jenkins Server <jenk...@builds.apache.org>
Subject Build failed in Jenkins: Axis2 #2247
Date Mon, 11 Mar 2013 11:57:37 GMT
See <https://builds.apache.org/job/Axis2/2247/changes>

Changes:

[veithen] Eliminated usage of deprecated Axiom class.

------------------------------------------
[...truncated 7774 lines...]
[WARNING] *** CHECKSUM FAILED - Checksum failed on download: local = '5e3b5d1f82305c80d41e969d2b140c654eb383b1';
remote = 'f0615eef506a7b6f6f1236a1b763899e563c332f' - IGNORING
[INFO] Uploading repository metadata for: 'artifact org.apache.axis2:axis2-xmlbeans'
[INFO] Retrieving previous build number from apache.snapshots.https
Uploading: https://repository.apache.org/content/repositories/snapshots/org/apache/axis2/axis2-xmlbeans/1.7.0-SNAPSHOT/axis2-xmlbeans-1.7.0-20130311.114911-1445-sources.jar
19K uploaded  (axis2-xmlbeans-1.7.0-20130311.114911-1445-sources.jar)
[INFO] Retrieving previous build number from apache.snapshots.https
Uploading: https://repository.apache.org/content/repositories/snapshots/org/apache/axis2/axis2-xmlbeans/1.7.0-SNAPSHOT/axis2-xmlbeans-1.7.0-20130311.114911-1445-javadoc.jar
35K uploaded  (axis2-xmlbeans-1.7.0-20130311.114911-1445-javadoc.jar)
[JENKINS] Archiving <https://builds.apache.org/job/Axis2/ws/axis2/modules/xmlbeans/target/axis2-xmlbeans-1.7.0-SNAPSHOT.jar>
to /home/hudson/hudson/jobs/Axis2/modules/org.apache.axis2$axis2-xmlbeans/builds/2013-03-11_11-48-55/archive/org.apache.axis2/axis2-xmlbeans/1.7.0-20130311.114911-1445/axis2-xmlbeans-1.7.0-20130311.114911-1445.jar
[JENKINS] Archiving <https://builds.apache.org/job/Axis2/ws/axis2/modules/xmlbeans/target/axis2-xmlbeans-1.7.0-SNAPSHOT-sources.jar>
to /home/hudson/hudson/jobs/Axis2/modules/org.apache.axis2$axis2-xmlbeans/builds/2013-03-11_11-48-55/archive/org.apache.axis2/axis2-xmlbeans/1.7.0-20130311.114911-1445/axis2-xmlbeans-1.7.0-20130311.114911-1445-sources.jar
[JENKINS] Archiving <https://builds.apache.org/job/Axis2/ws/axis2/modules/xmlbeans/target/axis2-xmlbeans-1.7.0-SNAPSHOT-javadoc.jar>
to /home/hudson/hudson/jobs/Axis2/modules/org.apache.axis2$axis2-xmlbeans/builds/2013-03-11_11-48-55/archive/org.apache.axis2/axis2-xmlbeans/1.7.0-20130311.114911-1445/axis2-xmlbeans-1.7.0-20130311.114911-1445-javadoc.jar
[INFO] ------------------------------------------------------------------------
[INFO] Building Apache Axis2 - tool - WSDL2Code Maven Plugin
[INFO]    task-segment: [clean, deploy]
[INFO] ------------------------------------------------------------------------
[INFO] [clean:clean {execution: default-clean}]
[INFO] Deleting directory <https://builds.apache.org/job/Axis2/ws/axis2/modules/tool/axis2-wsdl2code-maven-plugin/target>
[INFO] Deleting file-set: src/test/test1/target (included: [], excluded: [])
[INFO] [enforcer:enforce {execution: default}]
[INFO] [plugin:descriptor {execution: default-descriptor}]
[WARNING] 

Goal prefix is specified as: 'axis2'. Maven currently expects it to be 'axis2-wsdl2code'.

[INFO] Using 'UTF-8' encoding to read mojo metadata.
[INFO] Applying mojo extractor for language: java
[INFO] Mojo extractor for language: java found 1 mojo descriptors.
[INFO] Applying mojo extractor for language: bsh
[INFO] Mojo extractor for language: bsh found 0 mojo descriptors.
[INFO] [remote-resources:process {execution: default}]
[INFO] [resources:resources {execution: default-resources}]
[INFO] Using 'UTF-8' encoding to copy filtered resources.
[INFO] skip non existing resourceDirectory <https://builds.apache.org/job/Axis2/ws/axis2/modules/tool/axis2-wsdl2code-maven-plugin/src/main/resources>
[INFO] Copying 2 resources
[INFO] [compiler:compile {execution: default-compile}]
[INFO] Compiling 2 source files to <https://builds.apache.org/job/Axis2/ws/axis2/modules/tool/axis2-wsdl2code-maven-plugin/target/classes>
[INFO] [resources:testResources {execution: default-testResources}]
[INFO] Using 'UTF-8' encoding to copy filtered resources.
[INFO] Copying 1 resource
[INFO] Copying 2 resources
[INFO] [compiler:testCompile {execution: default-testCompile}]
[INFO] Compiling 1 source file to <https://builds.apache.org/job/Axis2/ws/axis2/modules/tool/axis2-wsdl2code-maven-plugin/target/test-classes>
[INFO] [surefire:test {execution: default-test}]
[INFO] Surefire report directory: <https://builds.apache.org/job/Axis2/ws/axis2/modules/tool/axis2-wsdl2code-maven-plugin/target/surefire-reports>

-------------------------------------------------------
 T E S T S
-------------------------------------------------------
Running org.apache.axis2.maven2.wsdl2code.WSDL2CodeMojoTest
Tests run: 1, Failures: 0, Errors: 0, Skipped: 0, Time elapsed: 2.358 sec

Results :

Tests run: 1, Failures: 0, Errors: 0, Skipped: 0

[JENKINS] Recording test results
[INFO] [jar:jar {execution: default-jar}]
[INFO] Building jar: <https://builds.apache.org/job/Axis2/ws/axis2/modules/tool/axis2-wsdl2code-maven-plugin/target/axis2-wsdl2code-maven-plugin-1.7.0-SNAPSHOT.jar>
[INFO] [plugin:addPluginArtifactMetadata {execution: default-addPluginArtifactMetadata}]
[INFO] [assembly:single {execution: source-release-assembly}]
[INFO] Skipping the assembly in this project because it's not the Execution Root
[INFO] Preparing source:jar
[WARNING] Removing: jar from forked lifecycle, to prevent recursive invocation.
[JENKINS] Archiving <https://builds.apache.org/job/Axis2/ws/axis2/modules/tool/axis2-wsdl2code-maven-plugin/pom.xml>
to /home/hudson/hudson/jobs/Axis2/modules/org.apache.axis2$axis2-wsdl2code-maven-plugin/builds/2013-03-11_11-48-55/archive/org.apache.axis2/axis2-wsdl2code-maven-plugin/1.7.0-SNAPSHOT/axis2-wsdl2code-maven-plugin-1.7.0-SNAPSHOT.pom
[JENKINS] Archiving <https://builds.apache.org/job/Axis2/ws/axis2/modules/tool/axis2-wsdl2code-maven-plugin/target/axis2-wsdl2code-maven-plugin-1.7.0-SNAPSHOT.jar>
to /home/hudson/hudson/jobs/Axis2/modules/org.apache.axis2$axis2-wsdl2code-maven-plugin/builds/2013-03-11_11-48-55/archive/org.apache.axis2/axis2-wsdl2code-maven-plugin/1.7.0-SNAPSHOT/axis2-wsdl2code-maven-plugin-1.7.0-SNAPSHOT.jar
[INFO] [enforcer:enforce {execution: default}]
[INFO] [source:jar {execution: attach-sources}]
[INFO] Building jar: <https://builds.apache.org/job/Axis2/ws/axis2/modules/tool/axis2-wsdl2code-maven-plugin/target/axis2-wsdl2code-maven-plugin-1.7.0-SNAPSHOT-sources.jar>
[INFO] [javadoc:jar {execution: attach-javadocs}]
Loading source files for package org.apache.axis2.maven2.wsdl2code...
Constructing Javadoc information...
Standard Doclet version 1.5.0_22
Building tree for all the packages and classes...
Generating <https://builds.apache.org/job/Axis2/ws/axis2/modules/tool/axis2-wsdl2code-maven-plugin/target/apidocs/org/apache/axis2/maven2/wsdl2code//NamespaceURIMapping.html...>
Generating <https://builds.apache.org/job/Axis2/ws/axis2/modules/tool/axis2-wsdl2code-maven-plugin/target/apidocs/org/apache/axis2/maven2/wsdl2code//WSDL2CodeMojo.html...>
Generating <https://builds.apache.org/job/Axis2/ws/axis2/modules/tool/axis2-wsdl2code-maven-plugin/target/apidocs/org/apache/axis2/maven2/wsdl2code//package-frame.html...>
Generating <https://builds.apache.org/job/Axis2/ws/axis2/modules/tool/axis2-wsdl2code-maven-plugin/target/apidocs/org/apache/axis2/maven2/wsdl2code//package-summary.html...>
Generating <https://builds.apache.org/job/Axis2/ws/axis2/modules/tool/axis2-wsdl2code-maven-plugin/target/apidocs/org/apache/axis2/maven2/wsdl2code//package-tree.html...>
Generating <https://builds.apache.org/job/Axis2/ws/axis2/modules/tool/axis2-wsdl2code-maven-plugin/target/apidocs/constant-values.html...>
Generating <https://builds.apache.org/job/Axis2/ws/axis2/modules/tool/axis2-wsdl2code-maven-plugin/target/apidocs/org/apache/axis2/maven2/wsdl2code/class-use//WSDL2CodeMojo.html...>
Generating <https://builds.apache.org/job/Axis2/ws/axis2/modules/tool/axis2-wsdl2code-maven-plugin/target/apidocs/org/apache/axis2/maven2/wsdl2code/class-use//NamespaceURIMapping.html...>
Generating <https://builds.apache.org/job/Axis2/ws/axis2/modules/tool/axis2-wsdl2code-maven-plugin/target/apidocs/org/apache/axis2/maven2/wsdl2code//package-use.html...>
Building index for all the packages and classes...
Generating <https://builds.apache.org/job/Axis2/ws/axis2/modules/tool/axis2-wsdl2code-maven-plugin/target/apidocs/overview-tree.html...>
Generating <https://builds.apache.org/job/Axis2/ws/axis2/modules/tool/axis2-wsdl2code-maven-plugin/target/apidocs/index-all.html...>
Generating <https://builds.apache.org/job/Axis2/ws/axis2/modules/tool/axis2-wsdl2code-maven-plugin/target/apidocs/deprecated-list.html...>
Building index for all classes...
Generating <https://builds.apache.org/job/Axis2/ws/axis2/modules/tool/axis2-wsdl2code-maven-plugin/target/apidocs/allclasses-frame.html...>
Generating <https://builds.apache.org/job/Axis2/ws/axis2/modules/tool/axis2-wsdl2code-maven-plugin/target/apidocs/allclasses-noframe.html...>
Generating <https://builds.apache.org/job/Axis2/ws/axis2/modules/tool/axis2-wsdl2code-maven-plugin/target/apidocs/index.html...>
Generating <https://builds.apache.org/job/Axis2/ws/axis2/modules/tool/axis2-wsdl2code-maven-plugin/target/apidocs/help-doc.html...>
Generating <https://builds.apache.org/job/Axis2/ws/axis2/modules/tool/axis2-wsdl2code-maven-plugin/target/apidocs/stylesheet.css...>
4 warnings
[WARNING] Javadoc Warnings
[WARNING] <https://builds.apache.org/job/Axis2/ws/axis2/modules/tool/axis2-wsdl2code-maven-plugin/src/main/java/org/apache/axis2/maven2/wsdl2code/WSDL2CodeMojo.java>:47:
warning - @description is an unknown tag.
[WARNING] <https://builds.apache.org/job/Axis2/ws/axis2/modules/tool/axis2-wsdl2code-maven-plugin/src/main/java/org/apache/axis2/maven2/wsdl2code/WSDL2CodeMojo.java>:47:
warning - @goal is an unknown tag.
[WARNING] <https://builds.apache.org/job/Axis2/ws/axis2/modules/tool/axis2-wsdl2code-maven-plugin/src/main/java/org/apache/axis2/maven2/wsdl2code/WSDL2CodeMojo.java>:47:
warning - @phase is an unknown tag.
[WARNING] <https://builds.apache.org/job/Axis2/ws/axis2/modules/tool/axis2-wsdl2code-maven-plugin/src/main/java/org/apache/axis2/maven2/wsdl2code/WSDL2CodeMojo.java>:47:
warning - @requiresDependencyResolution is an unknown tag.
[INFO] Building jar: <https://builds.apache.org/job/Axis2/ws/axis2/modules/tool/axis2-wsdl2code-maven-plugin/target/axis2-wsdl2code-maven-plugin-1.7.0-SNAPSHOT-javadoc.jar>
[INFO] [gpg:sign {execution: default}]
[INFO] [install:install {execution: default-install}]
[INFO] Installing <https://builds.apache.org/job/Axis2/ws/axis2/modules/tool/axis2-wsdl2code-maven-plugin/target/axis2-wsdl2code-maven-plugin-1.7.0-SNAPSHOT.jar>
to <https://builds.apache.org/job/Axis2/ws/.repository/org/apache/axis2/axis2-wsdl2code-maven-plugin/1.7.0-SNAPSHOT/axis2-wsdl2code-maven-plugin-1.7.0-SNAPSHOT.jar>
[INFO] Installing <https://builds.apache.org/job/Axis2/ws/axis2/modules/tool/axis2-wsdl2code-maven-plugin/target/axis2-wsdl2code-maven-plugin-1.7.0-SNAPSHOT-sources.jar>
to <https://builds.apache.org/job/Axis2/ws/.repository/org/apache/axis2/axis2-wsdl2code-maven-plugin/1.7.0-SNAPSHOT/axis2-wsdl2code-maven-plugin-1.7.0-SNAPSHOT-sources.jar>
[INFO] Installing <https://builds.apache.org/job/Axis2/ws/axis2/modules/tool/axis2-wsdl2code-maven-plugin/target/axis2-wsdl2code-maven-plugin-1.7.0-SNAPSHOT-javadoc.jar>
to <https://builds.apache.org/job/Axis2/ws/.repository/org/apache/axis2/axis2-wsdl2code-maven-plugin/1.7.0-SNAPSHOT/axis2-wsdl2code-maven-plugin-1.7.0-SNAPSHOT-javadoc.jar>
[INFO] [deploy:deploy {execution: default-deploy}]
[INFO] Retrieving previous build number from apache.snapshots.https
[WARNING] *** CHECKSUM FAILED - Checksum failed on download: local = 'c0e4ac721229ce0f7b1cab2cc12e6a44cd50dce2';
remote = 'f1d6cb51da564995009b20bb614dd8c42089758b' - RETRYING
[WARNING] *** CHECKSUM FAILED - Checksum failed on download: local = 'c0e4ac721229ce0f7b1cab2cc12e6a44cd50dce2';
remote = 'f1d6cb51da564995009b20bb614dd8c42089758b' - IGNORING
Uploading: https://repository.apache.org/content/repositories/snapshots/org/apache/axis2/axis2-wsdl2code-maven-plugin/1.7.0-SNAPSHOT/axis2-wsdl2code-maven-plugin-1.7.0-20130311.114911-1446.jar
16K uploaded  (axis2-wsdl2code-maven-plugin-1.7.0-20130311.114911-1446.jar)
[INFO] Uploading project information for axis2-wsdl2code-maven-plugin 1.7.0-20130311.114911-1446
[INFO] Retrieving previous metadata from apache.snapshots.https
[WARNING] *** CHECKSUM FAILED - Checksum failed on download: local = 'c0e4ac721229ce0f7b1cab2cc12e6a44cd50dce2';
remote = 'f1d6cb51da564995009b20bb614dd8c42089758b' - RETRYING
[WARNING] *** CHECKSUM FAILED - Checksum failed on download: local = 'c0e4ac721229ce0f7b1cab2cc12e6a44cd50dce2';
remote = 'f1d6cb51da564995009b20bb614dd8c42089758b' - IGNORING
[INFO] Uploading repository metadata for: 'snapshot org.apache.axis2:axis2-wsdl2code-maven-plugin:1.7.0-SNAPSHOT'
[INFO] Retrieving previous metadata from apache.snapshots.https
[WARNING] *** CHECKSUM FAILED - Checksum failed on download: local = '882c3b2f1f3d2eac4ed8567604275d7e7c7a7caf';
remote = '14710de09fd7c17d7f96512a6ac9ce74f49696e1' - RETRYING
[WARNING] *** CHECKSUM FAILED - Checksum failed on download: local = '882c3b2f1f3d2eac4ed8567604275d7e7c7a7caf';
remote = '14710de09fd7c17d7f96512a6ac9ce74f49696e1' - IGNORING
[INFO] Uploading repository metadata for: 'artifact org.apache.axis2:axis2-wsdl2code-maven-plugin'
[INFO] Retrieving previous metadata from apache.snapshots.https
[INFO] Uploading repository metadata for: 'org.apache.axis2'
[INFO] Retrieving previous build number from apache.snapshots.https
Uploading: https://repository.apache.org/content/repositories/snapshots/org/apache/axis2/axis2-wsdl2code-maven-plugin/1.7.0-SNAPSHOT/axis2-wsdl2code-maven-plugin-1.7.0-20130311.114911-1446-sources.jar
10K uploaded  (axis2-wsdl2code-maven-plugin-1.7.0-20130311.114911-1446-sources.jar)
[INFO] Retrieving previous build number from apache.snapshots.https
Uploading: https://repository.apache.org/content/repositories/snapshots/org/apache/axis2/axis2-wsdl2code-maven-plugin/1.7.0-SNAPSHOT/axis2-wsdl2code-maven-plugin-1.7.0-20130311.114911-1446-javadoc.jar
30K uploaded  (axis2-wsdl2code-maven-plugin-1.7.0-20130311.114911-1446-javadoc.jar)
[JENKINS] Archiving <https://builds.apache.org/job/Axis2/ws/axis2/modules/tool/axis2-wsdl2code-maven-plugin/target/axis2-wsdl2code-maven-plugin-1.7.0-SNAPSHOT.jar>
to /home/hudson/hudson/jobs/Axis2/modules/org.apache.axis2$axis2-wsdl2code-maven-plugin/builds/2013-03-11_11-48-55/archive/org.apache.axis2/axis2-wsdl2code-maven-plugin/1.7.0-20130311.114911-1446/axis2-wsdl2code-maven-plugin-1.7.0-20130311.114911-1446.jar
[JENKINS] Archiving <https://builds.apache.org/job/Axis2/ws/axis2/modules/tool/axis2-wsdl2code-maven-plugin/target/axis2-wsdl2code-maven-plugin-1.7.0-SNAPSHOT-sources.jar>
to /home/hudson/hudson/jobs/Axis2/modules/org.apache.axis2$axis2-wsdl2code-maven-plugin/builds/2013-03-11_11-48-55/archive/org.apache.axis2/axis2-wsdl2code-maven-plugin/1.7.0-20130311.114911-1446/axis2-wsdl2code-maven-plugin-1.7.0-20130311.114911-1446-sources.jar
[JENKINS] Archiving <https://builds.apache.org/job/Axis2/ws/axis2/modules/tool/axis2-wsdl2code-maven-plugin/target/axis2-wsdl2code-maven-plugin-1.7.0-SNAPSHOT-javadoc.jar>
to /home/hudson/hudson/jobs/Axis2/modules/org.apache.axis2$axis2-wsdl2code-maven-plugin/builds/2013-03-11_11-48-55/archive/org.apache.axis2/axis2-wsdl2code-maven-plugin/1.7.0-20130311.114911-1446/axis2-wsdl2code-maven-plugin-1.7.0-20130311.114911-1446-javadoc.jar
[INFO] ------------------------------------------------------------------------
[INFO] Building Apache Axis2 - JAXWS Integration Tests
[INFO]    task-segment: [clean, deploy]
[INFO] ------------------------------------------------------------------------
[INFO] [clean:clean {execution: default-clean}]
[INFO] Deleting directory <https://builds.apache.org/job/Axis2/ws/axis2/modules/jaxws-integration/target>
[INFO] [enforcer:enforce {execution: default}]
[INFO] [remote-resources:process {execution: default}]
[WARNING] org.apache.velocity.runtime.exception.ReferenceException: reference : template =
META-INF/DEPENDENCIES.vm [line 40,column 14] : $license.name is not a valid reference.
[INFO] [dependency:copy {execution: default}]
[INFO] Configured Artifact: javax.xml.bind:jaxb-api:?:jar
[INFO] Configured Artifact: org.apache.geronimo.specs:geronimo-saaj_1.3_spec:?:jar
[INFO] Configured Artifact: org.apache.geronimo.specs:geronimo-jaxws_2.2_spec:?:jar
[INFO] Copying jaxb-api-2.2.4.jar to <https://builds.apache.org/job/Axis2/ws/axis2/modules/jaxws-integration/target/endorsed/jaxb-api.jar>
[INFO] Copying geronimo-saaj_1.3_spec-1.0.1.jar to <https://builds.apache.org/job/Axis2/ws/axis2/modules/jaxws-integration/target/endorsed/geronimo-saaj_1.3_spec.jar>
[INFO] Copying geronimo-jaxws_2.2_spec-1.0.jar to <https://builds.apache.org/job/Axis2/ws/axis2/modules/jaxws-integration/target/endorsed/geronimo-jaxws_2.2_spec.jar>
[INFO] [resources:resources {execution: default-resources}]
[INFO] Using 'UTF-8' encoding to copy filtered resources.
[INFO] skip non existing resourceDirectory <https://builds.apache.org/job/Axis2/ws/axis2/modules/jaxws-integration/conf>
[INFO] skip non existing resourceDirectory <https://builds.apache.org/job/Axis2/ws/axis2/modules/jaxws-integration/src>
[INFO] skip non existing resourceDirectory <https://builds.apache.org/job/Axis2/ws/axis2/modules/jaxws-integration/resources>
[INFO] Copying 3 resources
[INFO] [compiler:compile {execution: default-compile}]
[INFO] No sources to compile
[INFO] [axis2:wsdl2code {execution: default}]
Retrieving document at '<https://builds.apache.org/job/Axis2/ws/axis2/modules/jaxws-integration/test-resources/wsdl/echo.wsdl'.>
Retrieving schema at '../xsd/echo.xsd', relative to '<https://builds.apache.org/job/Axis2/ws/axis2/modules/jaxws-integration/test-resources/wsdl/echo.wsdl'.>
log4j:WARN No appenders could be found for logger (org.apache.axiom.locator.DefaultOMMetaFactoryLocator).
log4j:WARN Please initialize the log4j system properly.
[INFO] [antrun:run {execution: gen-ts}]
[INFO] Executing tasks
    [mkdir] Created dir: <https://builds.apache.org/job/Axis2/ws/axis2/modules/jaxws-integration/target/schema>
    [mkdir] Created dir: <https://builds.apache.org/job/Axis2/ws/axis2/modules/jaxws-integration/target/schema/src>
    [mkdir] Created dir: <https://builds.apache.org/job/Axis2/ws/axis2/modules/jaxws-integration/target/schema/classes>
     [echo] Generating JAX-B classes from XSDs
     [echo] Generating java from soap 11
     [echo] Generating java from echo.xsd
     [echo] Generating java from stock1.xsd
     [echo] Generating java from stock2.xsd
     [echo] Generating java from samplemtom.xsd
     [echo] Generating java from greeterTypes.xsd
     [echo] Generating java from ProxyDocLitWrapped.wsdl
     [echo] Generating java from AddNumbers.wsdl
     [echo] Generating java from ProxyDocLitnonWrapped.wsdl
     [echo] Generating java from samplemtomjpeg.wsdl
     [echo] Generating java from RPCLit.wsdl
     [echo] Generating java from RPCLitSWA.wsdl
     [echo] Generating java from gorilla_dlw.wsdl
     [echo] Generating java from SOAP12Echo.wsdl
     [echo] Generating java from AddNumbersHandler.wsdl
     [echo] Generating java from HeadersHandler.wsdl
     [echo] Generating java from async_doclitwr.wsdl
     [echo] Generating java from async_doclitwr2.wsdl
     [echo] Generating java from FaultyWebService.wsdl
     [echo] Generating java from FaultsService.wsdl
     [echo] Generating java from jaxbsource
     [echo] Generating java from doclit_nonwrap.wsdl for javabean endpoint
     [echo]                                     support
     [echo] Generating java from doclitwrap.wsdl for javabean endpoint
     [echo]                                     support
     [echo] Generating java from doclitbare.wsdl for javabean endpoint
     [echo]                                     support
     [echo] Generating java from EchoMessage.wsdl for javabean endpoint
     [echo]                                     support
     [echo] Generating java from resourceinjection.wsdl for javabean
     [echo]                                     endpoint Resource Injection support
     [echo] Generating java from AnyType.wsdl for javabean endpoint
     [echo]                                     AnyType support
     [echo] Generating java from MessageContext.wsdl for message context
     [echo]                                     properties support
     [echo] Generating java from WSDLMultiTests.wsdl
     [echo] Generating java from Polymorphic shapes.wsdl for javabean
     [echo]                                     endpoint support
     [echo] Generating java from SOAPActionTest.wsdl
     [echo] Generating java from rpclitenum.wsdl
     [echo] Generating java from rpclitstringarray.wsdl
     [echo] Generating java from swamtomservice.wsdl
     [echo] Generating java from ProcessDocumentService.wsdl
[INFO] Executed tasks
[INFO] [resources:testResources {execution: default-testResources}]
[INFO] Using 'UTF-8' encoding to copy filtered resources.
[INFO] Copying 50 resources
[INFO] Copying 3 resources
[INFO] [build-helper:add-test-source {execution: add-test-source}]
[INFO] Test Source directory: <https://builds.apache.org/job/Axis2/ws/axis2/modules/jaxws-integration/target/schema/src>
added.
[INFO] Test Source directory: <https://builds.apache.org/job/Axis2/ws/axis2/modules/jaxws-integration/target/generated-sources/axis2/wsdl2code/src>
added.
[INFO] [compiler:testCompile {execution: default-testCompile}]
[INFO] Compiling 592 source files to <https://builds.apache.org/job/Axis2/ws/axis2/modules/jaxws-integration/target/test-classes>
[INFO] -------------------------------------------------------------
[ERROR] COMPILATION ERROR : 
[INFO] -------------------------------------------------------------
[ERROR] <https://builds.apache.org/job/Axis2/ws/axis2/modules/jaxws-integration/test/org/apache/axis2/jaxws/xmlhttp/clientTests/dispatch/datasource/DispatchXMessageDataSourceTests.java>:[26,42]
cannot find symbol
symbol  : class IOUtils
location: package org.apache.axiom.attachments.utils

[INFO] 1error
[INFO] -------------------------------------------------------------
[JENKINS] Archiving <https://builds.apache.org/job/Axis2/ws/axis2/modules/jaxws-integration/pom.xml>
to /home/hudson/hudson/jobs/Axis2/modules/org.apache.axis2$axis2-jaxws-integration/builds/2013-03-11_11-48-55/archive/org.apache.axis2/axis2-jaxws-integration/1.7.0-SNAPSHOT/axis2-jaxws-integration-1.7.0-SNAPSHOT.pom
[INFO] ------------------------------------------------------------------------
[ERROR] BUILD FAILURE
[INFO] ------------------------------------------------------------------------
[INFO] Compilation failure
<https://builds.apache.org/job/Axis2/ws/axis2/modules/jaxws-integration/test/org/apache/axis2/jaxws/xmlhttp/clientTests/dispatch/datasource/DispatchXMessageDataSourceTests.java>:[26,42]
cannot find symbol
symbol  : class IOUtils
location: package org.apache.axiom.attachments.utils


[INFO] ------------------------------------------------------------------------
[INFO] For more information, run Maven with the -e switch
[INFO] ------------------------------------------------------------------------
[INFO] Total time: 6 minutes 50 seconds
[INFO] Finished at: Mon Mar 11 11:55:52 GMT 2013
[INFO] Final Memory: 96M/238M
[INFO] ------------------------------------------------------------------------
Sending e-mails to: java-dev@axis.apache.org andreas.veithen@gmail.com
Sending e-mails to: java-dev@axis.apache.org
channel stopped
[locks-and-latches] Releasing all the locks
[locks-and-latches] All the locks released

---------------------------------------------------------------------
To unsubscribe, e-mail: java-dev-unsubscribe@axis.apache.org
For additional commands, e-mail: java-dev-help@axis.apache.org


Mime
View raw message