axis-java-dev mailing list archives

Site index · List index
Message view « Date » · « Thread »
Top « Date » · « Thread »
From Apache Jenkins Server <jenk...@builds.apache.org>
Subject Build failed in Jenkins: Axis2 » Apache Axis2 - Integration #2248
Date Mon, 11 Mar 2013 13:32:13 GMT
See <https://builds.apache.org/job/Axis2/org.apache.axis2$axis2-integration/2248/>

------------------------------------------
[...truncated 179 lines...]
     [java] Mar 11, 2013 1:31:50 PM org.apache.axis2.schema.SchemaCompiler compile
     [java] WARNING: No schemaLocation for import of http://www.example.com/types; compilation
may fail

init:
    [mkdir] Created dir: <https://builds.apache.org/job/Axis2/org.apache.axis2$axis2-integration/ws/target/rpc-test2/build>
    [mkdir] Created dir: <https://builds.apache.org/job/Axis2/org.apache.axis2$axis2-integration/ws/target/rpc-test2/build/classes>
    [mkdir] Created dir: <https://builds.apache.org/job/Axis2/org.apache.axis2$axis2-integration/ws/target/rpc-test2/build/lib>

pre.compile.test:
     [echo] Stax Availability= true
     [echo] Axis2 Availability= true

compile.src:
    [javac] Compiling 2 source files to <https://builds.apache.org/job/Axis2/org.apache.axis2$axis2-integration/ws/target/rpc-test2/build/classes>

jar.client:
      [jar] Building jar: <https://builds.apache.org/job/Axis2/org.apache.axis2$axis2-integration/ws/target/rpc-test2/build/lib/serviceName-test-client.jar>
     [echo] Running codegen RPC WSDLs - take 3
     [java] Retrieving document at 'test-resources/rpc/test-rpc-2.wsdl'.

init:
    [mkdir] Created dir: <https://builds.apache.org/job/Axis2/org.apache.axis2$axis2-integration/ws/target/rpc-test3/build>
    [mkdir] Created dir: <https://builds.apache.org/job/Axis2/org.apache.axis2$axis2-integration/ws/target/rpc-test3/build/classes>
    [mkdir] Created dir: <https://builds.apache.org/job/Axis2/org.apache.axis2$axis2-integration/ws/target/rpc-test3/build/lib>

pre.compile.test:
     [echo] Stax Availability= true
     [echo] Axis2 Availability= true

compile.src:
    [javac] Compiling 2 source files to <https://builds.apache.org/job/Axis2/org.apache.axis2$axis2-integration/ws/target/rpc-test3/build/classes>

jar.client:
      [jar] Building jar: <https://builds.apache.org/job/Axis2/org.apache.axis2$axis2-integration/ws/target/rpc-test3/build/lib/serviceName-test-client.jar>
     [echo] Running codegen RPC WSDLs - take 4
     [java] Retrieving document at 'test-resources/rpc/test-rpc-2.wsdl'.

init:
    [mkdir] Created dir: <https://builds.apache.org/job/Axis2/org.apache.axis2$axis2-integration/ws/target/rpc-test4/build>
    [mkdir] Created dir: <https://builds.apache.org/job/Axis2/org.apache.axis2$axis2-integration/ws/target/rpc-test4/build/classes>
    [mkdir] Created dir: <https://builds.apache.org/job/Axis2/org.apache.axis2$axis2-integration/ws/target/rpc-test4/build/lib>

pre.compile.test:
     [echo] Stax Availability= true
     [echo] Axis2 Availability= true

compile.src:
    [javac] Compiling 5 source files to <https://builds.apache.org/job/Axis2/org.apache.axis2$axis2-integration/ws/target/rpc-test4/build/classes>

echo.classpath.problem:

jar.server:
     [copy] Copying 2 files to <https://builds.apache.org/job/Axis2/org.apache.axis2$axis2-integration/ws/target/rpc-test4/build/classes/META-INF>
      [jar] Building jar: <https://builds.apache.org/job/Axis2/org.apache.axis2$axis2-integration/ws/target/rpc-test4/build/lib/serviceName.aar>
     [echo] Running codegen RPC WSDLs with helper mode -  take 1
     [java] Retrieving document at 'test-resources/rpc/test-rpc-2.wsdl'.

init:
    [mkdir] Created dir: <https://builds.apache.org/job/Axis2/org.apache.axis2$axis2-integration/ws/target/helper-test1/build>
    [mkdir] Created dir: <https://builds.apache.org/job/Axis2/org.apache.axis2$axis2-integration/ws/target/helper-test1/build/classes>
    [mkdir] Created dir: <https://builds.apache.org/job/Axis2/org.apache.axis2$axis2-integration/ws/target/helper-test1/build/lib>

pre.compile.test:
     [echo] Stax Availability= true
     [echo] Axis2 Availability= true

compile.src:
    [javac] Compiling 8 source files to <https://builds.apache.org/job/Axis2/org.apache.axis2$axis2-integration/ws/target/helper-test1/build/classes>
    [javac] Note: Some input files use unchecked or unsafe operations.
    [javac] Note: Recompile with -Xlint:unchecked for details.

jar.client:
      [jar] Building jar: <https://builds.apache.org/job/Axis2/org.apache.axis2$axis2-integration/ws/target/helper-test1/build/lib/serviceName-test-client.jar>
     [echo] Running codegen RPC WSDLs with helper mode -  take 2
     [java] Retrieving document at 'test-resources/rpc/test-rpc-2.wsdl'.

init:
    [mkdir] Created dir: <https://builds.apache.org/job/Axis2/org.apache.axis2$axis2-integration/ws/target/helper-test2/build>
    [mkdir] Created dir: <https://builds.apache.org/job/Axis2/org.apache.axis2$axis2-integration/ws/target/helper-test2/build/classes>
    [mkdir] Created dir: <https://builds.apache.org/job/Axis2/org.apache.axis2$axis2-integration/ws/target/helper-test2/build/lib>

pre.compile.test:
     [echo] Stax Availability= true
     [echo] Axis2 Availability= true

compile.src:
    [javac] Compiling 8 source files to <https://builds.apache.org/job/Axis2/org.apache.axis2$axis2-integration/ws/target/helper-test2/build/classes>
    [javac] Note: Some input files use unchecked or unsafe operations.
    [javac] Note: Recompile with -Xlint:unchecked for details.

jar.client:
      [jar] Building jar: <https://builds.apache.org/job/Axis2/org.apache.axis2$axis2-integration/ws/target/helper-test2/build/lib/serviceName-test-client.jar>

wsdl20-codegen:
     [echo] Running codegen for WSDL 2.0
     [java] Mar 11, 2013 1:32:01 PM org.apache.woden.internal.ErrorHandlerImpl warning
     [java] WARNING: Woden[Warning],0:0,Description-1001,The targetNamespace 'http://greath.example.com/2004/wsdl/resSvc'
is not dereferencable.

init:
    [mkdir] Created dir: <https://builds.apache.org/job/Axis2/org.apache.axis2$axis2-integration/ws/target/wsdl20-test/build>
    [mkdir] Created dir: <https://builds.apache.org/job/Axis2/org.apache.axis2$axis2-integration/ws/target/wsdl20-test/build/classes>
    [mkdir] Created dir: <https://builds.apache.org/job/Axis2/org.apache.axis2$axis2-integration/ws/target/wsdl20-test/build/lib>

pre.compile.test:
     [echo] Stax Availability= true
     [echo] Axis2 Availability= true

compile.src:
    [javac] Compiling 2 source files to <https://builds.apache.org/job/Axis2/org.apache.axis2$axis2-integration/ws/target/wsdl20-test/build/classes>

jar.client:
      [jar] Building jar: <https://builds.apache.org/job/Axis2/org.apache.axis2$axis2-integration/ws/target/wsdl20-test/build/lib/reservationService-test-client.jar>

init:
     [echo] the files are up to date = ${jars.uptodate}

compile:
    [mkdir] Created dir: <https://builds.apache.org/job/Axis2/org.apache.axis2$axis2-integration/ws/test-resources/SOAP12Testing/SOAP12TestModuleB/build/classes>
    [mkdir] Created dir: <https://builds.apache.org/job/Axis2/org.apache.axis2$axis2-integration/ws/test-resources/SOAP12Testing/SOAP12TestModuleB/build/lib>
    [javac] Compiling 4 source files to <https://builds.apache.org/job/Axis2/org.apache.axis2$axis2-integration/ws/test-resources/SOAP12Testing/SOAP12TestModuleB/build/classes>
    [javac] Note: <https://builds.apache.org/job/Axis2/org.apache.axis2$axis2-integration/ws/test-resources/SOAP12Testing/SOAP12TestModuleB/org/apache/axis2/soap12testing/handlers/SOAP12InFlowHandlerDefaultB.java>
uses or overrides a deprecated API.
    [javac] Note: Recompile with -Xlint:deprecation for details.

jar:
     [copy] Copying 1 file to <https://builds.apache.org/job/Axis2/org.apache.axis2$axis2-integration/ws/test-resources/SOAP12Testing/SOAP12TestModuleB/build/classes/META-INF>
      [jar] Building jar: <https://builds.apache.org/job/Axis2/org.apache.axis2$axis2-integration/ws/target/Repository/modules/SOAP12TestModuleB.jar>
   [delete] Deleting directory <https://builds.apache.org/job/Axis2/org.apache.axis2$axis2-integration/ws/test-resources/SOAP12Testing/SOAP12TestModuleB/build>

init:
     [echo] the files are up to date = ${jars.uptodate}

compile:
    [mkdir] Created dir: <https://builds.apache.org/job/Axis2/org.apache.axis2$axis2-integration/ws/test-resources/SOAP12Testing/SOAP12TestModuleC/build/classes>
    [mkdir] Created dir: <https://builds.apache.org/job/Axis2/org.apache.axis2$axis2-integration/ws/test-resources/SOAP12Testing/SOAP12TestModuleC/build/lib>
    [javac] Compiling 4 source files to <https://builds.apache.org/job/Axis2/org.apache.axis2$axis2-integration/ws/test-resources/SOAP12Testing/SOAP12TestModuleC/build/classes>
    [javac] Note: <https://builds.apache.org/job/Axis2/org.apache.axis2$axis2-integration/ws/test-resources/SOAP12Testing/SOAP12TestModuleC/org/apache/axis2/soap12testing/handlers/SOAP12InFlowHandlerDefaultC.java>
uses or overrides a deprecated API.
    [javac] Note: Recompile with -Xlint:deprecation for details.

jar:
     [copy] Copying 1 file to <https://builds.apache.org/job/Axis2/org.apache.axis2$axis2-integration/ws/test-resources/SOAP12Testing/SOAP12TestModuleC/build/classes/META-INF>
      [jar] Building jar: <https://builds.apache.org/job/Axis2/org.apache.axis2$axis2-integration/ws/target/Repository/modules/SOAP12TestModuleC.jar>
   [delete] Deleting directory <https://builds.apache.org/job/Axis2/org.apache.axis2$axis2-integration/ws/test-resources/SOAP12Testing/SOAP12TestModuleC/build>

init:
     [echo] the files are up to date = ${jars.uptodate}

compile:
    [mkdir] Created dir: <https://builds.apache.org/job/Axis2/org.apache.axis2$axis2-integration/ws/test-resources/SOAP12Testing/SOAP12TestServiceB/build/classes>
    [mkdir] Created dir: <https://builds.apache.org/job/Axis2/org.apache.axis2$axis2-integration/ws/test-resources/SOAP12Testing/SOAP12TestServiceB/build/lib>
    [javac] Compiling 1 source file to <https://builds.apache.org/job/Axis2/org.apache.axis2$axis2-integration/ws/test-resources/SOAP12Testing/SOAP12TestServiceB/build/classes>

jar:
     [copy] Copying 1 file to <https://builds.apache.org/job/Axis2/org.apache.axis2$axis2-integration/ws/test-resources/SOAP12Testing/SOAP12TestServiceB/build/classes/META-INF>
    [mkdir] Created dir: <https://builds.apache.org/job/Axis2/org.apache.axis2$axis2-integration/ws/target/Repository/services>
      [jar] Building jar: <https://builds.apache.org/job/Axis2/org.apache.axis2$axis2-integration/ws/target/Repository/services/SOAP12TestServiceB.jar>
   [delete] Deleting directory <https://builds.apache.org/job/Axis2/org.apache.axis2$axis2-integration/ws/test-resources/SOAP12Testing/SOAP12TestServiceB/build>

init:
     [echo] the files are up to date = ${jars.uptodate}

compile:
    [mkdir] Created dir: <https://builds.apache.org/job/Axis2/org.apache.axis2$axis2-integration/ws/test-resources/SOAP12Testing/SOAP12TestServiceC/build/classes>
    [mkdir] Created dir: <https://builds.apache.org/job/Axis2/org.apache.axis2$axis2-integration/ws/test-resources/SOAP12Testing/SOAP12TestServiceC/build/lib>
    [javac] Compiling 1 source file to <https://builds.apache.org/job/Axis2/org.apache.axis2$axis2-integration/ws/test-resources/SOAP12Testing/SOAP12TestServiceC/build/classes>

jar:
     [copy] Copying 1 file to <https://builds.apache.org/job/Axis2/org.apache.axis2$axis2-integration/ws/test-resources/SOAP12Testing/SOAP12TestServiceC/build/classes/META-INF>
      [jar] Building jar: <https://builds.apache.org/job/Axis2/org.apache.axis2$axis2-integration/ws/target/Repository/services/SOAP12TestServiceC.jar>
   [delete] Deleting directory <https://builds.apache.org/job/Axis2/org.apache.axis2$axis2-integration/ws/test-resources/SOAP12Testing/SOAP12TestServiceC/build>
[INFO] Executed tasks
[INFO] [resources:testResources {execution: default-testResources}]
[INFO] Using 'UTF-8' encoding to copy filtered resources.
[INFO] Copying 3 resources
[INFO] Copying 412 resources
[INFO] Copying 3 resources
[INFO] [build-helper:add-test-source {execution: add-test-source}]
[INFO] Test Source directory: <https://builds.apache.org/job/Axis2/org.apache.axis2$axis2-integration/ws/target/wsdl/complexdatatype/src>
added.
[INFO] Test Source directory: <https://builds.apache.org/job/Axis2/org.apache.axis2$axis2-integration/ws/target/wsdl/complexdatatypebare/src>
added.
[INFO] Test Source directory: <https://builds.apache.org/job/Axis2/org.apache.axis2$axis2-integration/ws/target/xmlbeans/java>
added.
[INFO] [compiler:testCompile {execution: default-testCompile}]
[INFO] Compiling 528 source files to <https://builds.apache.org/job/Axis2/org.apache.axis2$axis2-integration/ws/target/test-classes>
[INFO] -------------------------------------------------------------
[ERROR] COMPILATION ERROR : 
[INFO] -------------------------------------------------------------
[ERROR] <https://builds.apache.org/job/Axis2/org.apache.axis2$axis2-integration/ws/test/org/apache/axis2/mtom/EchoService2.java>:[25,42]
cannot find symbol
symbol  : class IOUtils
location: package org.apache.axiom.attachments.utils

[ERROR] <https://builds.apache.org/job/Axis2/org.apache.axis2$axis2-integration/ws/test/org/apache/axis2/rpc/complex/ComplexDataTypesDocLitBareTest.java>:[25,42]
cannot find symbol
symbol  : class IOUtils
location: package org.apache.axiom.attachments.utils

[ERROR] <https://builds.apache.org/job/Axis2/org.apache.axis2$axis2-integration/ws/test/org/apache/axis2/rpc/complex/ComplexDataTypesComplexDataTypesSOAP11Test.java>:[31,42]
cannot find symbol
symbol  : class IOUtils
location: package org.apache.axiom.attachments.utils

[ERROR] <https://builds.apache.org/job/Axis2/org.apache.axis2$axis2-integration/ws/test/org/apache/axis2/mtom/EchoService2.java>:[44,22]
cannot find symbol
symbol  : variable IOUtils
location: class org.apache.axis2.mtom.EchoService2

[ERROR] <https://builds.apache.org/job/Axis2/org.apache.axis2$axis2-integration/ws/test/org/apache/axis2/rpc/complex/ComplexDataTypesDocLitBareTest.java>:[391,23]
cannot find symbol
symbol  : variable IOUtils
location: class org.apache.axis2.rpc.complex.ComplexDataTypesDocLitBareTest

[ERROR] <https://builds.apache.org/job/Axis2/org.apache.axis2$axis2-integration/ws/test/org/apache/axis2/rpc/complex/ComplexDataTypesComplexDataTypesSOAP11Test.java>:[380,23]
cannot find symbol
symbol  : variable IOUtils
location: class org.apache.axis2.rpc.complex.ComplexDataTypesComplexDataTypesSOAP11Test

[INFO] 6 errors 
[INFO] -------------------------------------------------------------
[JENKINS] Archiving <https://builds.apache.org/job/Axis2/org.apache.axis2$axis2-integration/ws/pom.xml>
to /home/hudson/hudson/jobs/Axis2/modules/org.apache.axis2$axis2-integration/builds/2013-03-11_13-15-31/archive/org.apache.axis2/axis2-integration/1.7.0-SNAPSHOT/axis2-integration-1.7.0-SNAPSHOT.pom
[INFO] ------------------------------------------------------------------------
[ERROR] BUILD FAILURE
[INFO] ------------------------------------------------------------------------
[INFO] Compilation failure

<https://builds.apache.org/job/Axis2/org.apache.axis2$axis2-integration/ws/test/org/apache/axis2/mtom/EchoService2.java>:[25,42]
cannot find symbol
symbol  : class IOUtils
location: package org.apache.axiom.attachments.utils

<https://builds.apache.org/job/Axis2/org.apache.axis2$axis2-integration/ws/test/org/apache/axis2/rpc/complex/ComplexDataTypesDocLitBareTest.java>:[25,42]
cannot find symbol
symbol  : class IOUtils
location: package org.apache.axiom.attachments.utils

<https://builds.apache.org/job/Axis2/org.apache.axis2$axis2-integration/ws/test/org/apache/axis2/rpc/complex/ComplexDataTypesComplexDataTypesSOAP11Test.java>:[31,42]
cannot find symbol
symbol  : class IOUtils
location: package org.apache.axiom.attachments.utils

<https://builds.apache.org/job/Axis2/org.apache.axis2$axis2-integration/ws/test/org/apache/axis2/mtom/EchoService2.java>:[44,22]
cannot find symbol
symbol  : variable IOUtils
location: class org.apache.axis2.mtom.EchoService2

<https://builds.apache.org/job/Axis2/org.apache.axis2$axis2-integration/ws/test/org/apache/axis2/rpc/complex/ComplexDataTypesDocLitBareTest.java>:[391,23]
cannot find symbol
symbol  : variable IOUtils
location: class org.apache.axis2.rpc.complex.ComplexDataTypesDocLitBareTest

<https://builds.apache.org/job/Axis2/org.apache.axis2$axis2-integration/ws/test/org/apache/axis2/rpc/complex/ComplexDataTypesComplexDataTypesSOAP11Test.java>:[380,23]
cannot find symbol
symbol  : variable IOUtils
location: class org.apache.axis2.rpc.complex.ComplexDataTypesComplexDataTypesSOAP11Test


[INFO] ------------------------------------------------------------------------
[INFO] For more information, run Maven with the -e switch
[INFO] ------------------------------------------------------------------------
[INFO] Total time: 16 minutes 31 seconds
[INFO] Finished at: Mon Mar 11 13:32:10 GMT 2013
[INFO] Final Memory: 98M/251M
[INFO] ------------------------------------------------------------------------
Waiting for Jenkins to finish collecting data

---------------------------------------------------------------------
To unsubscribe, e-mail: java-dev-unsubscribe@axis.apache.org
For additional commands, e-mail: java-dev-help@axis.apache.org


Mime
View raw message