axis-java-dev mailing list archives

Site index · List index
Message view « Date » · « Thread »
Top « Date » · « Thread »
From Apache Jenkins Server <jenk...@builds.apache.org>
Subject Build failed in Jenkins: Axis2 » Apache Axis2 - Kernel #2244
Date Mon, 11 Mar 2013 03:39:17 GMT
See <https://builds.apache.org/job/Axis2/org.apache.axis2$axis2-kernel/2244/>

------------------------------------------
[INFO] ------------------------------------------------------------------------
[INFO] Building Apache Axis2 - Kernel
[INFO]    task-segment: [clean, deploy]
[INFO] ------------------------------------------------------------------------
[INFO] [clean:clean {execution: default-clean}]
[INFO] Deleting directory <https://builds.apache.org/job/Axis2/org.apache.axis2$axis2-kernel/ws/target>
[INFO] snapshot org.apache.ws.commons.axiom:axiom-api:1.2.15-SNAPSHOT: checking for updates
from apache.snapshots
Downloading: http://repository.apache.org/snapshots/org/apache/ws/commons/axiom/axiom-api/1.2.15-SNAPSHOT/axiom-api-1.2.15-20130311.014159-147.pom

[INFO] snapshot org.apache.ws.commons.axiom:axiom:1.2.15-SNAPSHOT: checking for updates from
apache.snapshots
Downloading: http://repository.apache.org/snapshots/org/apache/ws/commons/axiom/axiom/1.2.15-SNAPSHOT/axiom-1.2.15-20130311.013923-147.pom

[INFO] snapshot org.apache.james:apache-mime4j-core:0.8-SNAPSHOT: checking for updates from
apache.snapshots
Downloading: http://repository.apache.org/snapshots/org/apache/james/apache-mime4j-core/0.8-SNAPSHOT/apache-mime4j-core-0.8-20130311.012650-542.pom

[INFO] snapshot org.apache.james:apache-mime4j-project:0.8-SNAPSHOT: checking for updates
from apache.snapshots
Downloading: http://repository.apache.org/snapshots/org/apache/james/apache-mime4j-project/0.8-SNAPSHOT/apache-mime4j-project-0.8-20130311.012622-573.pom

[INFO] snapshot org.apache.ws.commons.axiom:axiom-impl:1.2.15-SNAPSHOT: checking for updates
from apache.snapshots
Downloading: http://repository.apache.org/snapshots/org/apache/ws/commons/axiom/axiom-impl/1.2.15-SNAPSHOT/axiom-impl-1.2.15-20130311.014637-147.pom

[INFO] snapshot org.apache.ws.commons.schema:XmlSchema:1.4.8-SNAPSHOT: checking for updates
from apache.snapshots
Downloading: http://repository.apache.org/snapshots/org/apache/ws/commons/schema/XmlSchema/1.4.8-SNAPSHOT/XmlSchema-1.4.8-SNAPSHOT.pom

[INFO] snapshot org.apache.neethi:neethi:3.0.3-SNAPSHOT: checking for updates from apache.snapshots
Downloading: http://repository.apache.org/snapshots/org/apache/neethi/neethi/3.0.3-SNAPSHOT/neethi-3.0.3-20130311.015446-356.pom

[INFO] snapshot org.apache.woden:woden-core:1.0-SNAPSHOT: checking for updates from apache.snapshots
Downloading: http://repository.apache.org/snapshots/org/apache/woden/woden-core/1.0-SNAPSHOT/woden-core-1.0-20130311.033756-366.pom

[INFO] snapshot org.apache.woden:woden:1.0-SNAPSHOT: checking for updates from apache.snapshots
Downloading: http://repository.apache.org/snapshots/org/apache/woden/woden/1.0-SNAPSHOT/woden-1.0-20130311.033752-782.pom

Downloading: http://repository.apache.org/snapshots/org/apache/woden/woden-core/1.0-SNAPSHOT/woden-core-1.0-20130311.033756-366.jar
Downloading: http://repository.apache.org/snapshots/org/apache/neethi/neethi/3.0.3-SNAPSHOT/neethi-3.0.3-20130311.015446-356.jar
Downloading: http://repository.apache.org/snapshots/org/apache/james/apache-mime4j-core/0.8-SNAPSHOT/apache-mime4j-core-0.8-20130311.012650-542.jar
Downloading: http://repository.apache.org/snapshots/org/apache/ws/commons/axiom/axiom-api/1.2.15-SNAPSHOT/axiom-api-1.2.15-20130311.014159-147.jar
Downloading: http://repository.apache.org/snapshots/org/apache/ws/commons/schema/XmlSchema/1.4.8-SNAPSHOT/XmlSchema-1.4.8-SNAPSHOT.jar
145K downloaded  (XmlSchema-1.4.8-SNAPSHOT.jar)
363K downloaded  (woden-core-1.0-20130311.033756-366.jar)
69K downloaded  (neethi-3.0.3-20130311.015446-356.jar)
93K downloaded  (apache-mime4j-core-0.8-20130311.012650-542.jar)
403K downloaded  (axiom-api-1.2.15-20130311.014159-147.jar)
Downloading: http://repository.apache.org/snapshots/org/apache/ws/commons/axiom/axiom-impl/1.2.15-SNAPSHOT/axiom-impl-1.2.15-20130311.014637-147.jar
187K downloaded  (axiom-impl-1.2.15-20130311.014637-147.jar)
[INFO] [enforcer:enforce {execution: default}]
[INFO] [remote-resources:process {execution: default}]
[INFO] [resources:resources {execution: default-resources}]
[INFO] Using 'UTF-8' encoding to copy filtered resources.
[INFO] Copying 1 resource
[INFO] Copying 3 resources
[INFO] Copying 2 resources
[INFO] [antrun:run {execution: process-resources}]
[INFO] Executing tasks
     [copy] Copying 1 file to <https://builds.apache.org/job/Axis2/org.apache.axis2$axis2-kernel/ws/target/classes/org/apache/axis2/i18n>
[INFO] Executed tasks
[INFO] [compiler:compile {execution: default-compile}]
[INFO] Compiling 349 source files to <https://builds.apache.org/job/Axis2/org.apache.axis2$axis2-kernel/ws/target/classes>
[INFO] -------------------------------------------------------------
[ERROR] COMPILATION ERROR : 
[INFO] -------------------------------------------------------------
[ERROR] <https://builds.apache.org/job/Axis2/org.apache.axis2$axis2-kernel/ws/src/org/apache/axis2/util/XMLPrettyPrinter.java>:[22,42]
cannot find symbol
symbol  : class IOUtils
location: package org.apache.axiom.attachments.utils

[ERROR] <https://builds.apache.org/job/Axis2/org.apache.axis2$axis2-kernel/ws/src/org/apache/axis2/builder/BuilderUtil.java>:[25,42]
cannot find symbol
symbol  : class IOUtils
location: package org.apache.axiom.attachments.utils

[ERROR] <https://builds.apache.org/job/Axis2/org.apache.axis2$axis2-kernel/ws/src/org/apache/axis2/deployment/DeploymentClassLoader.java>:[22,42]
cannot find symbol
symbol  : class IOUtils
location: package org.apache.axiom.attachments.utils

[ERROR] <https://builds.apache.org/job/Axis2/org.apache.axis2$axis2-kernel/ws/src/org/apache/axis2/util/XMLPrettyPrinter.java>:[62,31]
cannot find symbol
symbol  : method getStreamAsByteArray(java.io.FileInputStream)
location: class org.apache.axis2.util.IOUtils

[ERROR] <https://builds.apache.org/job/Axis2/org.apache.axis2$axis2-kernel/ws/src/org/apache/axis2/builder/BuilderUtil.java>:[620,36]
cannot find symbol
symbol  : variable IOUtils
location: class org.apache.axis2.builder.BuilderUtil

[ERROR] <https://builds.apache.org/job/Axis2/org.apache.axis2$axis2-kernel/ws/src/org/apache/axis2/builder/BuilderUtil.java>:[641,36]
cannot find symbol
symbol  : variable IOUtils
location: class org.apache.axis2.builder.BuilderUtil

[ERROR] <https://builds.apache.org/job/Axis2/org.apache.axis2$axis2-kernel/ws/src/org/apache/axis2/builder/BuilderUtil.java>:[661,36]
cannot find symbol
symbol  : variable IOUtils
location: class org.apache.axis2.builder.BuilderUtil

[ERROR] <https://builds.apache.org/job/Axis2/org.apache.axis2$axis2-kernel/ws/src/org/apache/axis2/builder/BuilderUtil.java>:[682,36]
cannot find symbol
symbol  : variable IOUtils
location: class org.apache.axis2.builder.BuilderUtil

[ERROR] <https://builds.apache.org/job/Axis2/org.apache.axis2$axis2-kernel/ws/src/org/apache/axis2/deployment/DeploymentClassLoader.java>:[125,41]
cannot find symbol
symbol  : variable IOUtils
location: class org.apache.axis2.deployment.DeploymentClassLoader

[ERROR] <https://builds.apache.org/job/Axis2/org.apache.axis2$axis2-kernel/ws/src/org/apache/axis2/deployment/DeploymentClassLoader.java>:[163,37]
cannot find symbol
symbol  : variable IOUtils
location: class org.apache.axis2.deployment.DeploymentClassLoader

[ERROR] <https://builds.apache.org/job/Axis2/org.apache.axis2$axis2-kernel/ws/src/org/apache/axis2/deployment/DeploymentClassLoader.java>:[212,29]
cannot find symbol
symbol  : variable IOUtils
location: class org.apache.axis2.deployment.DeploymentClassLoader

[INFO] 11 errors 
[INFO] -------------------------------------------------------------
[JENKINS] Archiving <https://builds.apache.org/job/Axis2/org.apache.axis2$axis2-kernel/ws/pom.xml>
to /home/hudson/hudson/jobs/Axis2/modules/org.apache.axis2$axis2-kernel/builds/2013-03-11_03-38-33/archive/org.apache.axis2/axis2-kernel/1.7.0-SNAPSHOT/axis2-kernel-1.7.0-SNAPSHOT.pom
[INFO] ------------------------------------------------------------------------
[ERROR] BUILD FAILURE
[INFO] ------------------------------------------------------------------------
[INFO] Compilation failure

<https://builds.apache.org/job/Axis2/org.apache.axis2$axis2-kernel/ws/src/org/apache/axis2/util/XMLPrettyPrinter.java>:[22,42]
cannot find symbol
symbol  : class IOUtils
location: package org.apache.axiom.attachments.utils

<https://builds.apache.org/job/Axis2/org.apache.axis2$axis2-kernel/ws/src/org/apache/axis2/builder/BuilderUtil.java>:[25,42]
cannot find symbol
symbol  : class IOUtils
location: package org.apache.axiom.attachments.utils

<https://builds.apache.org/job/Axis2/org.apache.axis2$axis2-kernel/ws/src/org/apache/axis2/deployment/DeploymentClassLoader.java>:[22,42]
cannot find symbol
symbol  : class IOUtils
location: package org.apache.axiom.attachments.utils

<https://builds.apache.org/job/Axis2/org.apache.axis2$axis2-kernel/ws/src/org/apache/axis2/util/XMLPrettyPrinter.java>:[62,31]
cannot find symbol
symbol  : method getStreamAsByteArray(java.io.FileInputStream)
location: class org.apache.axis2.util.IOUtils

<https://builds.apache.org/job/Axis2/org.apache.axis2$axis2-kernel/ws/src/org/apache/axis2/builder/BuilderUtil.java>:[620,36]
cannot find symbol
symbol  : variable IOUtils
location: class org.apache.axis2.builder.BuilderUtil

<https://builds.apache.org/job/Axis2/org.apache.axis2$axis2-kernel/ws/src/org/apache/axis2/builder/BuilderUtil.java>:[641,36]
cannot find symbol
symbol  : variable IOUtils
location: class org.apache.axis2.builder.BuilderUtil

<https://builds.apache.org/job/Axis2/org.apache.axis2$axis2-kernel/ws/src/org/apache/axis2/builder/BuilderUtil.java>:[661,36]
cannot find symbol
symbol  : variable IOUtils
location: class org.apache.axis2.builder.BuilderUtil

<https://builds.apache.org/job/Axis2/org.apache.axis2$axis2-kernel/ws/src/org/apache/axis2/builder/BuilderUtil.java>:[682,36]
cannot find symbol
symbol  : variable IOUtils
location: class org.apache.axis2.builder.BuilderUtil

<https://builds.apache.org/job/Axis2/org.apache.axis2$axis2-kernel/ws/src/org/apache/axis2/deployment/DeploymentClassLoader.java>:[125,41]
cannot find symbol
symbol  : variable IOUtils
location: class org.apache.axis2.deployment.DeploymentClassLoader

<https://builds.apache.org/job/Axis2/org.apache.axis2$axis2-kernel/ws/src/org/apache/axis2/deployment/DeploymentClassLoader.java>:[163,37]
cannot find symbol
symbol  : variable IOUtils
location: class org.apache.axis2.deployment.DeploymentClassLoader

<https://builds.apache.org/job/Axis2/org.apache.axis2$axis2-kernel/ws/src/org/apache/axis2/deployment/DeploymentClassLoader.java>:[212,29]
cannot find symbol
symbol  : variable IOUtils
location: class org.apache.axis2.deployment.DeploymentClassLoader


[INFO] ------------------------------------------------------------------------
[INFO] For more information, run Maven with the -e switch
[INFO] ------------------------------------------------------------------------
[INFO] Total time: 23 seconds
[INFO] Finished at: Mon Mar 11 03:39:03 GMT 2013
[INFO] Final Memory: 69M/133M
[INFO] ------------------------------------------------------------------------
Waiting for Jenkins to finish collecting data

---------------------------------------------------------------------
To unsubscribe, e-mail: java-dev-unsubscribe@axis.apache.org
For additional commands, e-mail: java-dev-help@axis.apache.org


Mime
View raw message