axis-java-dev mailing list archives

Site index · List index
Message view « Date » · « Thread »
Top « Date » · « Thread »
From Apache Jenkins Server <jenk...@builds.apache.org>
Subject Build failed in Jenkins: sandesha2-trunk #1146
Date Sun, 27 Jan 2013 15:43:33 GMT
See <https://builds.apache.org/job/sandesha2-trunk/1146/>

------------------------------------------
Started by upstream project "Rampart" build number 1388
originally caused by: 
Started by upstream project "Axis2" build number 2192
originally caused by: 
Started by upstream project "ws-axiom-trunk" build number 1409
originally caused by: 
Started by an SCM change
Building remotely on ubuntu3 in workspace <https://builds.apache.org/job/sandesha2-trunk/ws/>
hudson.util.IOException2: Failed to install http://archive.apache.org/dist/maven/binaries/apache-maven-3.0.3-bin.zip
to /home/hudson/tools/maven/apache-maven-3.0.3
	at hudson.FilePath.installIfNecessaryFrom(FilePath.java:729)
	at hudson.tools.DownloadFromUrlInstaller.performInstallation(DownloadFromUrlInstaller.java:72)
	at hudson.tools.InstallerTranslator.getToolHome(InstallerTranslator.java:61)
	at hudson.tools.ToolLocationNodeProperty.getToolHome(ToolLocationNodeProperty.java:107)
	at hudson.tools.ToolInstallation.translateFor(ToolInstallation.java:203)
	at hudson.tasks.Maven$MavenInstallation.forNode(Maven.java:595)
	at hudson.maven.MavenModuleSetBuild.getEnvironment(MavenModuleSetBuild.java:171)
	at hudson.scm.SubversionSCM.checkout(SubversionSCM.java:682)
	at hudson.model.AbstractProject.checkout(AbstractProject.java:1325)
	at hudson.model.AbstractBuild$AbstractBuildExecution.defaultCheckout(AbstractBuild.java:682)
	at jenkins.scm.SCMCheckoutStrategy.checkout(SCMCheckoutStrategy.java:88)
	at hudson.model.AbstractBuild$AbstractBuildExecution.run(AbstractBuild.java:587)
	at hudson.model.Run.execute(Run.java:1543)
	at hudson.maven.MavenModuleSetBuild.run(MavenModuleSetBuild.java:477)
	at hudson.model.ResourceController.execute(ResourceController.java:88)
	at hudson.model.Executor.run(Executor.java:236)
Caused by: hudson.util.IOException2: remote file operation failed: /home/hudson/tools/maven/apache-maven-3.0.3
at hudson.remoting.Channel@64824941:ubuntu3
	at hudson.FilePath.act(FilePath.java:848)
	at hudson.FilePath.act(FilePath.java:825)
	at hudson.FilePath.deleteContents(FilePath.java:993)
	at hudson.FilePath.installIfNecessaryFrom(FilePath.java:706)
	... 15 more
Caused by: java.io.IOException: Unable to delete /home/hudson/tools/maven/apache-maven-3.0.3/boot/plexus-classworlds-2.4.jar
	at hudson.Util.deleteFile(Util.java:243)
	at hudson.Util.deleteRecursive(Util.java:293)
	at hudson.Util.deleteContentsRecursive(Util.java:204)
	at hudson.Util.deleteRecursive(Util.java:284)
	at hudson.Util.deleteContentsRecursive(Util.java:204)
	at hudson.FilePath$12.invoke(FilePath.java:995)
	at hudson.FilePath$12.invoke(FilePath.java:993)
	at hudson.FilePath$FileCallableWrapper.call(FilePath.java:2309)
	at hudson.remoting.UserRequest.perform(UserRequest.java:118)
	at hudson.remoting.UserRequest.perform(UserRequest.java:48)
	at hudson.remoting.Request$2.run(Request.java:326)
	at hudson.remoting.InterceptingExecutorService$1.call(InterceptingExecutorService.java:72)
	at java.util.concurrent.FutureTask$Sync.innerRun(FutureTask.java:334)
	at java.util.concurrent.FutureTask.run(FutureTask.java:166)
	at java.util.concurrent.ThreadPoolExecutor.runWorker(ThreadPoolExecutor.java:1110)
	at java.util.concurrent.ThreadPoolExecutor$Worker.run(ThreadPoolExecutor.java:603)
	at java.lang.Thread.run(Thread.java:679)
Retrying after 10 seconds
hudson.util.IOException2: Failed to install http://archive.apache.org/dist/maven/binaries/apache-maven-3.0.3-bin.zip
to /home/hudson/tools/maven/apache-maven-3.0.3
	at hudson.FilePath.installIfNecessaryFrom(FilePath.java:729)
	at hudson.tools.DownloadFromUrlInstaller.performInstallation(DownloadFromUrlInstaller.java:72)
	at hudson.tools.InstallerTranslator.getToolHome(InstallerTranslator.java:61)
	at hudson.tools.ToolLocationNodeProperty.getToolHome(ToolLocationNodeProperty.java:107)
	at hudson.tools.ToolInstallation.translateFor(ToolInstallation.java:203)
	at hudson.tasks.Maven$MavenInstallation.forNode(Maven.java:595)
	at hudson.maven.MavenModuleSetBuild.getEnvironment(MavenModuleSetBuild.java:171)
	at hudson.scm.SubversionSCM.checkout(SubversionSCM.java:682)
	at hudson.model.AbstractProject.checkout(AbstractProject.java:1325)
	at hudson.model.AbstractBuild$AbstractBuildExecution.defaultCheckout(AbstractBuild.java:682)
	at jenkins.scm.SCMCheckoutStrategy.checkout(SCMCheckoutStrategy.java:88)
	at hudson.model.AbstractBuild$AbstractBuildExecution.run(AbstractBuild.java:587)
	at hudson.model.Run.execute(Run.java:1543)
	at hudson.maven.MavenModuleSetBuild.run(MavenModuleSetBuild.java:477)
	at hudson.model.ResourceController.execute(ResourceController.java:88)
	at hudson.model.Executor.run(Executor.java:236)
Caused by: hudson.util.IOException2: remote file operation failed: /home/hudson/tools/maven/apache-maven-3.0.3
at hudson.remoting.Channel@64824941:ubuntu3
	at hudson.FilePath.act(FilePath.java:848)
	at hudson.FilePath.act(FilePath.java:825)
	at hudson.FilePath.deleteContents(FilePath.java:993)
	at hudson.FilePath.installIfNecessaryFrom(FilePath.java:706)
	... 15 more
Caused by: java.io.IOException: Unable to delete /home/hudson/tools/maven/apache-maven-3.0.3/boot/plexus-classworlds-2.4.jar
	at hudson.Util.deleteFile(Util.java:243)
	at hudson.Util.deleteRecursive(Util.java:293)
	at hudson.Util.deleteContentsRecursive(Util.java:204)
	at hudson.Util.deleteRecursive(Util.java:284)
	at hudson.Util.deleteContentsRecursive(Util.java:204)
	at hudson.FilePath$12.invoke(FilePath.java:995)
	at hudson.FilePath$12.invoke(FilePath.java:993)
	at hudson.FilePath$FileCallableWrapper.call(FilePath.java:2309)
	at hudson.remoting.UserRequest.perform(UserRequest.java:118)
	at hudson.remoting.UserRequest.perform(UserRequest.java:48)
	at hudson.remoting.Request$2.run(Request.java:326)
	at hudson.remoting.InterceptingExecutorService$1.call(InterceptingExecutorService.java:72)
	at java.util.concurrent.FutureTask$Sync.innerRun(FutureTask.java:334)
	at java.util.concurrent.FutureTask.run(FutureTask.java:166)
	at java.util.concurrent.ThreadPoolExecutor.runWorker(ThreadPoolExecutor.java:1110)
	at java.util.concurrent.ThreadPoolExecutor$Worker.run(ThreadPoolExecutor.java:603)
	at java.lang.Thread.run(Thread.java:679)
Retrying after 10 seconds
hudson.util.IOException2: Failed to install http://archive.apache.org/dist/maven/binaries/apache-maven-3.0.3-bin.zip
to /home/hudson/tools/maven/apache-maven-3.0.3
	at hudson.FilePath.installIfNecessaryFrom(FilePath.java:729)
	at hudson.tools.DownloadFromUrlInstaller.performInstallation(DownloadFromUrlInstaller.java:72)
	at hudson.tools.InstallerTranslator.getToolHome(InstallerTranslator.java:61)
	at hudson.tools.ToolLocationNodeProperty.getToolHome(ToolLocationNodeProperty.java:107)
	at hudson.tools.ToolInstallation.translateFor(ToolInstallation.java:203)
	at hudson.tasks.Maven$MavenInstallation.forNode(Maven.java:595)
	at hudson.maven.MavenModuleSetBuild.getEnvironment(MavenModuleSetBuild.java:171)
	at hudson.scm.SubversionSCM.checkout(SubversionSCM.java:682)
	at hudson.model.AbstractProject.checkout(AbstractProject.java:1325)
	at hudson.model.AbstractBuild$AbstractBuildExecution.defaultCheckout(AbstractBuild.java:682)
	at jenkins.scm.SCMCheckoutStrategy.checkout(SCMCheckoutStrategy.java:88)
	at hudson.model.AbstractBuild$AbstractBuildExecution.run(AbstractBuild.java:587)
	at hudson.model.Run.execute(Run.java:1543)
	at hudson.maven.MavenModuleSetBuild.run(MavenModuleSetBuild.java:477)
	at hudson.model.ResourceController.execute(ResourceController.java:88)
	at hudson.model.Executor.run(Executor.java:236)
Caused by: hudson.util.IOException2: remote file operation failed: /home/hudson/tools/maven/apache-maven-3.0.3
at hudson.remoting.Channel@64824941:ubuntu3
	at hudson.FilePath.act(FilePath.java:848)
	at hudson.FilePath.act(FilePath.java:825)
	at hudson.FilePath.deleteContents(FilePath.java:993)
	at hudson.FilePath.installIfNecessaryFrom(FilePath.java:706)
	... 15 more
Caused by: java.io.IOException: Unable to delete /home/hudson/tools/maven/apache-maven-3.0.3/boot/plexus-classworlds-2.4.jar
	at hudson.Util.deleteFile(Util.java:243)
	at hudson.Util.deleteRecursive(Util.java:293)
	at hudson.Util.deleteContentsRecursive(Util.java:204)
	at hudson.Util.deleteRecursive(Util.java:284)
	at hudson.Util.deleteContentsRecursive(Util.java:204)
	at hudson.FilePath$12.invoke(FilePath.java:995)
	at hudson.FilePath$12.invoke(FilePath.java:993)
	at hudson.FilePath$FileCallableWrapper.call(FilePath.java:2309)
	at hudson.remoting.UserRequest.perform(UserRequest.java:118)
	at hudson.remoting.UserRequest.perform(UserRequest.java:48)
	at hudson.remoting.Request$2.run(Request.java:326)
	at hudson.remoting.InterceptingExecutorService$1.call(InterceptingExecutorService.java:72)
	at java.util.concurrent.FutureTask$Sync.innerRun(FutureTask.java:334)
	at java.util.concurrent.FutureTask.run(FutureTask.java:166)
	at java.util.concurrent.ThreadPoolExecutor.runWorker(ThreadPoolExecutor.java:1110)
	at java.util.concurrent.ThreadPoolExecutor$Worker.run(ThreadPoolExecutor.java:603)
	at java.lang.Thread.run(Thread.java:679)

---------------------------------------------------------------------
To unsubscribe, e-mail: java-dev-unsubscribe@axis.apache.org
For additional commands, e-mail: java-dev-help@axis.apache.org


Mime
View raw message