axis-java-dev mailing list archives

Site index · List index
Message view « Date » · « Thread »
Top « Date » · « Thread »
From Apache Jenkins Server <jenk...@builds.apache.org>
Subject Build failed in Jenkins: axis2-transports-trunk #1166
Date Sun, 09 Dec 2012 18:01:32 GMT
See <https://builds.apache.org/job/axis2-transports-trunk/1166/>

------------------------------------------
[...truncated 45 lines...]
[INFO] Setting property: resource.manager.logwhenfound => 'false'.
[INFO] [remote-resources:process {execution: default}]
[INFO] snapshot org.apache.axis2:axis2-kernel:1.7.0-SNAPSHOT: checking for updates from apache.snapshots
Downloading: http://repository.apache.org/snapshots/org/apache/axis2/axis2-kernel/1.7.0-SNAPSHOT/axis2-kernel-1.7.0-20121209.155215-1261.pom

[INFO] snapshot org.apache.axis2:axis2-parent:1.7.0-SNAPSHOT: checking for updates from apache.snapshots
Downloading: http://repository.apache.org/snapshots/org/apache/axis2/axis2-parent/1.7.0-SNAPSHOT/axis2-parent-1.7.0-20121209.155215-1272.pom

[INFO] snapshot org.apache.ws.commons.axiom:axiom-api:1.2.14-SNAPSHOT: checking for updates
from apache.snapshots
Downloading: http://repository.apache.org/snapshots/org/apache/ws/commons/axiom/axiom-api/1.2.14-SNAPSHOT/axiom-api-1.2.14-20121202.181211-411.pom

[INFO] snapshot org.apache.ws.commons.axiom:axiom-parent:1.2.14-SNAPSHOT: checking for updates
from apache.snapshots
Downloading: http://repository.apache.org/snapshots/org/apache/ws/commons/axiom/axiom-parent/1.2.14-SNAPSHOT/axiom-parent-1.2.14-20121202.180815-416.pom

[INFO] snapshot org.apache.ws.commons.axiom:axiom-impl:1.2.14-SNAPSHOT: checking for updates
from apache.snapshots
Downloading: http://repository.apache.org/snapshots/org/apache/ws/commons/axiom/axiom-impl/1.2.14-SNAPSHOT/axiom-impl-1.2.14-20121202.182016-411.pom

[INFO] snapshot org.apache.ws.commons.schema:XmlSchema:1.4.8-SNAPSHOT: checking for updates
from apache.snapshots
Downloading: http://repository.apache.org/snapshots/org/apache/ws/commons/schema/XmlSchema/1.4.8-SNAPSHOT/XmlSchema-1.4.8-SNAPSHOT.pom

[INFO] snapshot org.apache.neethi:neethi:3.0.3-SNAPSHOT: checking for updates from apache.snapshots
Downloading: http://repository.apache.org/snapshots/org/apache/neethi/neethi/3.0.3-SNAPSHOT/neethi-3.0.3-20121202.172633-349.pom

[INFO] snapshot org.apache.woden:woden-core:1.0-SNAPSHOT: checking for updates from apache.snapshots
Downloading: http://repository.apache.org/snapshots/org/apache/woden/woden-core/1.0-SNAPSHOT/woden-core-1.0-20121209.152427-201.pom

[INFO] snapshot org.apache.woden:woden:1.0-SNAPSHOT: checking for updates from apache.snapshots
Downloading: http://repository.apache.org/snapshots/org/apache/woden/woden/1.0-SNAPSHOT/woden-1.0-20121209.152425-617.pom

Downloading: http://repository.apache.org/snapshots/org/apache/ws/commons/schema/XmlSchema/1.4.8-SNAPSHOT/XmlSchema-1.4.8-SNAPSHOT.jar
Downloading: http://repository.apache.org/snapshots/org/apache/ws/commons/axiom/axiom-api/1.2.14-SNAPSHOT/axiom-api-1.2.14-20121202.181211-411.jar
Downloading: http://repository.apache.org/snapshots/org/apache/axis2/axis2-kernel/1.7.0-SNAPSHOT/axis2-kernel-1.7.0-20121209.155215-1261.jar
Downloading: http://repository.apache.org/snapshots/org/apache/woden/woden-core/1.0-SNAPSHOT/woden-core-1.0-20121209.152427-201.jar
Downloading: http://repository.apache.org/snapshots/org/apache/neethi/neethi/3.0.3-SNAPSHOT/neethi-3.0.3-20121202.172633-349.jar
145K downloaded  (XmlSchema-1.4.8-SNAPSHOT.jar)
69K downloaded  (neethi-3.0.3-20121202.172633-349.jar)
411K downloaded  (axiom-api-1.2.14-20121202.181211-411.jar)
363K downloaded  (woden-core-1.0-20121209.152427-201.jar)
Downloading: http://repository.apache.org/snapshots/org/apache/ws/commons/axiom/axiom-impl/1.2.14-SNAPSHOT/axiom-impl-1.2.14-20121202.182016-411.jar
166K downloaded  (axiom-impl-1.2.14-20121202.182016-411.jar)
1027K downloaded  (axis2-kernel-1.7.0-20121209.155215-1261.jar)
[WARNING] org.apache.velocity.runtime.exception.ReferenceException: reference : template =
META-INF/DEPENDENCIES.vm [line 40,column 14] : $license.name is not a valid reference.
[INFO] [site:attach-descriptor {execution: default-attach-descriptor}]
[INFO] Parent project loaded from repository: org.apache:apache:pom:9
[INFO] Preparing source:jar
[WARNING] Removing: jar from forked lifecycle, to prevent recursive invocation.
[INFO] No goals needed for project - skipping
[INFO] [source:jar {execution: default}]
[INFO] [install:install {execution: default-install}]
[INFO] Installing <https://builds.apache.org/job/axis2-transports-trunk/ws/transports/pom.xml>
to <https://builds.apache.org/job/axis2-transports-trunk/ws/.repository/org/apache/axis2/axis2-transports/1.7.0-SNAPSHOT/axis2-transports-1.7.0-SNAPSHOT.pom>
[INFO] Installing <https://builds.apache.org/job/axis2-transports-trunk/ws/transports/target/axis2-transports-1.7.0-SNAPSHOT-site.xml>
to <https://builds.apache.org/job/axis2-transports-trunk/ws/.repository/org/apache/axis2/axis2-transports/1.7.0-SNAPSHOT/axis2-transports-1.7.0-SNAPSHOT-site.xml>
[INFO] [deploy:deploy {execution: default-deploy}]
[INFO] Retrieving previous build number from apache.snapshots.https
Uploading: https://repository.apache.org/content/repositories/snapshots/org/apache/axis2/axis2-transports/1.7.0-SNAPSHOT/axis2-transports-1.7.0-20121209.180052-706.pom
16K uploaded  (axis2-transports-1.7.0-20121209.180052-706.pom)
[INFO] Retrieving previous metadata from apache.snapshots.https
[INFO] Uploading repository metadata for: 'snapshot org.apache.axis2:axis2-transports:1.7.0-SNAPSHOT'
[INFO] Retrieving previous metadata from apache.snapshots.https
[INFO] Uploading repository metadata for: 'artifact org.apache.axis2:axis2-transports'
[INFO] Retrieving previous build number from apache.snapshots.https
Uploading: https://repository.apache.org/content/repositories/snapshots/org/apache/axis2/axis2-transports/1.7.0-SNAPSHOT/axis2-transports-1.7.0-20121209.180052-706-site.xml
2K uploaded  (axis2-transports-1.7.0-20121209.180052-706-site.xml)
[JENKINS] Archiving <https://builds.apache.org/job/axis2-transports-trunk/ws/transports/pom.xml>
to /home/hudson/hudson/jobs/axis2-transports-trunk/modules/org.apache.axis2$axis2-transports/builds/2012-12-09_18-00-04/archive/org.apache.axis2/axis2-transports/1.7.0-SNAPSHOT/axis2-transports-1.7.0-SNAPSHOT.pom
[JENKINS] Archiving <https://builds.apache.org/job/axis2-transports-trunk/ws/.repository/org/apache/axis2/axis2-transports/1.7.0-SNAPSHOT/axis2-transports-1.7.0-SNAPSHOT.pom>
to /home/hudson/hudson/jobs/axis2-transports-trunk/modules/org.apache.axis2$axis2-transports/builds/2012-12-09_18-00-04/archive/org.apache.axis2/axis2-transports/1.7.0-20121209.180052-706/axis2-transports-1.7.0-20121209.180052-706.pom
[JENKINS] Archiving <https://builds.apache.org/job/axis2-transports-trunk/ws/transports/target/axis2-transports-1.7.0-SNAPSHOT-site.xml>
to /home/hudson/hudson/jobs/axis2-transports-trunk/modules/org.apache.axis2$axis2-transports/builds/2012-12-09_18-00-04/archive/org.apache.axis2/axis2-transports/1.7.0-20121209.180052-706/axis2-transports-1.7.0-20121209.180052-706-site.xml
[INFO] ------------------------------------------------------------------------
[INFO] Building Apache Axis2 - Transport - Sms
[INFO]    task-segment: [clean, deploy]
[INFO] ------------------------------------------------------------------------
[INFO] [clean:clean {execution: default-clean}]
[INFO] Deleting <https://builds.apache.org/job/axis2-transports-trunk/ws/transports/modules/sms/target>
[INFO] [remote-resources:process {execution: default}]
[INFO] snapshot org.apache.axis2:axis2-transport-base:1.7.0-SNAPSHOT: checking for updates
from apache-snapshots
[INFO] snapshot org.apache.axis2:axis2-transport-base:1.7.0-SNAPSHOT: checking for updates
from wso2-m2
[INFO] snapshot org.apache.axis2:axis2-transport-base:1.7.0-SNAPSHOT: checking for updates
from apache.snapshots
Downloading: http://repository.apache.org/snapshots/org/apache/axis2/axis2-transport-base/1.7.0-SNAPSHOT/axis2-transport-base-1.7.0-20121209.155215-714.pom

Downloading: http://people.apache.org/repo/m2-snapshot-repository//org/smslib/smslib/3.4.1/smslib-3.4.1.pom
[INFO] Unable to find resource 'org.smslib:smslib:pom:3.4.1' in repository apache-snapshots
(http://people.apache.org/repo/m2-snapshot-repository/)
Downloading: http://dist.wso2.org/maven2//org/smslib/smslib/3.4.1/smslib-3.4.1.pom
[INFO] Unable to find resource 'org.smslib:smslib:pom:3.4.1' in repository wso2-m2 (http://dist.wso2.org/maven2/)
Downloading: http://repo1.maven.org/maven2/org/smslib/smslib/3.4.1/smslib-3.4.1.pom
[INFO] Unable to find resource 'org.smslib:smslib:pom:3.4.1' in repository central (http://repo1.maven.org/maven2)
[INFO] snapshot org.apache.axis2:addressing:1.7.0-SNAPSHOT: checking for updates from apache-snapshots
[INFO] snapshot org.apache.axis2:addressing:1.7.0-SNAPSHOT: checking for updates from wso2-m2
[INFO] snapshot org.apache.axis2:addressing:1.7.0-SNAPSHOT: checking for updates from apache.snapshots
Downloading: http://repository.apache.org/snapshots/org/apache/axis2/addressing/1.7.0-SNAPSHOT/addressing-1.7.0-20121209.155215-1240.pom

Downloading: http://repository.apache.org/snapshots/org/apache/axis2/axis2-transport-base/1.7.0-SNAPSHOT/axis2-transport-base-1.7.0-20121209.155215-714.jar
102K downloaded  (axis2-transport-base-1.7.0-20121209.155215-714.jar)
Downloading: http://repository.apache.org/snapshots/org/apache/axis2/addressing/1.7.0-SNAPSHOT/addressing-1.7.0-20121209.155215-1240.mar

[WARNING] org.apache.velocity.runtime.exception.ReferenceException: reference : template =
META-INF/DEPENDENCIES.vm [line 40,column 14] : $license.name is not a valid reference.
[INFO] [resources:resources {execution: default-resources}]
[INFO] Using 'UTF-8' encoding to copy filtered resources.
[INFO] skip non existing resourceDirectory <https://builds.apache.org/job/axis2-transports-trunk/ws/transports/modules/sms/src/main/resources>
[INFO] Copying 3 resources
[INFO] [compiler:compile {execution: default-compile}]
[INFO] Compiling 24 source files to <https://builds.apache.org/job/axis2-transports-trunk/ws/transports/modules/sms/target/classes>
[INFO] [dependency:copy {execution: copy}]
[INFO] Configured Artifact: org.aspectj:aspectjweaver:?:jar
[INFO] Copying aspectjweaver-1.6.1.jar to <https://builds.apache.org/job/axis2-transports-trunk/ws/transports/modules/sms/target/lib/aspectjweaver.jar>
[INFO] [resources:testResources {execution: default-testResources}]
[INFO] Using 'UTF-8' encoding to copy filtered resources.
[INFO] skip non existing resourceDirectory <https://builds.apache.org/job/axis2-transports-trunk/ws/transports/modules/sms/src/test/resources>
[INFO] Copying 3 resources
[INFO] [compiler:testCompile {execution: default-testCompile}]
[INFO] Compiling 6 source files to <https://builds.apache.org/job/axis2-transports-trunk/ws/transports/modules/sms/target/test-classes>
[WARNING] DEPRECATED [tasks]: Use target instead
[INFO] [antrun:run {execution: build-repo}]
[WARNING] Parameter tasks is deprecated, use target instead
[INFO] Executing tasks

main:
    [mkdir] Created dir: <https://builds.apache.org/job/axis2-transports-trunk/ws/transports/modules/sms/target/test-resources/samples/conf>
    [mkdir] Created dir: <https://builds.apache.org/job/axis2-transports-trunk/ws/transports/modules/sms/target/test-resources/samples/repository/modules>
    [mkdir] Created dir: <https://builds.apache.org/job/axis2-transports-trunk/ws/transports/modules/sms/target/test-resources/samples/repository/services>
    [mkdir] Created dir: <https://builds.apache.org/job/axis2-transports-trunk/ws/transports/modules/sms/target/test-resources/samples/repository/services/SampleService/org/apache/axis2/transport/sms>
    [mkdir] Created dir: <https://builds.apache.org/job/axis2-transports-trunk/ws/transports/modules/sms/target/test-resources/samples/repository/services/SampleService/META-INF>
     [copy] Copying 1 file to <https://builds.apache.org/job/axis2-transports-trunk/ws/transports/modules/sms/target/test-resources/samples/repository/modules>
     [copy] Copying 1 file to <https://builds.apache.org/job/axis2-transports-trunk/ws/transports/modules/sms/target/test-resources/samples/repository/services/SampleService/org/apache/axis2/transport/sms>
     [copy] Copying 1 file to <https://builds.apache.org/job/axis2-transports-trunk/ws/transports/modules/sms/target/test-resources/samples/conf>
     [copy] Copying 1 file to <https://builds.apache.org/job/axis2-transports-trunk/ws/transports/modules/sms/target/test-resources/samples/repository/services/SampleService/META-INF>
     [copy] Copying 1 file to <https://builds.apache.org/job/axis2-transports-trunk/ws/transports/modules/sms/target/test-resources/samples/repository/services/SampleService/META-INF>
[INFO] Executed tasks
[WARNING] DEPRECATED [systemProperties]: Use systemPropertyVariables instead.
[INFO] [surefire:test {execution: default-test}]
[INFO] Surefire report directory: <https://builds.apache.org/job/axis2-transports-trunk/ws/transports/modules/sms/target/surefire-reports>

-------------------------------------------------------
 T E S T S
-------------------------------------------------------
Running org.apache.axis2.transport.sms.SMSTransportTest
Simple SMSC Listening on port :: 2776
<https://builds.apache.org/job/axis2-transports-trunk/ws/transports/modules/sms/target/test-resources/samples>
 [Axis2] bind and connect to 127.0.0.1 : 2776 on SMPP Transport
 [Axis2] test Server started on port 2776 
Tests run: 1, Failures: 0, Errors: 0, Skipped: 0, Time elapsed: 4.792 sec

Results :

Tests run: 1, Failures: 0, Errors: 0, Skipped: 0

[JENKINS] Recording test results
[INFO] [bundle:bundle {execution: default-bundle}]
[INFO] Preparing source:jar
[WARNING] Removing: jar from forked lifecycle, to prevent recursive invocation.
[INFO] No goals needed for project - skipping
[INFO] [source:jar {execution: default}]
[INFO] Building jar: <https://builds.apache.org/job/axis2-transports-trunk/ws/transports/modules/sms/target/axis2-transport-sms-1.7.0-SNAPSHOT-sources.jar>
[INFO] [install:install {execution: default-install}]
[INFO] Installing <https://builds.apache.org/job/axis2-transports-trunk/ws/transports/modules/sms/target/axis2-transport-sms-1.7.0-SNAPSHOT.jar>
to <https://builds.apache.org/job/axis2-transports-trunk/ws/.repository/org/apache/axis2/axis2-transport-sms/1.7.0-SNAPSHOT/axis2-transport-sms-1.7.0-SNAPSHOT.jar>
[INFO] Installing <https://builds.apache.org/job/axis2-transports-trunk/ws/transports/modules/sms/target/axis2-transport-sms-1.7.0-SNAPSHOT-sources.jar>
to <https://builds.apache.org/job/axis2-transports-trunk/ws/.repository/org/apache/axis2/axis2-transport-sms/1.7.0-SNAPSHOT/axis2-transport-sms-1.7.0-SNAPSHOT-sources.jar>
[INFO] [bundle:install {execution: default-install}]
[INFO] Parsing <https://builds.apache.org/job/axis2-transports-trunk/ws/.repository/repository.xml>
[INFO] Installing org/apache/axis2/axis2-transport-sms/1.7.0-SNAPSHOT/axis2-transport-sms-1.7.0-SNAPSHOT.jar
[INFO] Writing OBR metadata
[INFO] [deploy:deploy {execution: default-deploy}]
[INFO] Retrieving previous build number from apache.snapshots.https
[WARNING] *** CHECKSUM FAILED - Checksum failed on download: local = 'ae35f0a7f9c7b3585e7feefa4381fa26bd346e65';
remote = 'e7544acf0de12d03e23e9acd8aef31c8feca540c' - RETRYING
[WARNING] *** CHECKSUM FAILED - Checksum failed on download: local = 'ae35f0a7f9c7b3585e7feefa4381fa26bd346e65';
remote = 'e7544acf0de12d03e23e9acd8aef31c8feca540c' - IGNORING
Uploading: https://repository.apache.org/content/repositories/snapshots/org/apache/axis2/axis2-transport-sms/1.7.0-SNAPSHOT/axis2-transport-sms-1.7.0-20121209.180052-664.jar
45K uploaded  (axis2-transport-sms-1.7.0-20121209.180052-664.jar)
[INFO] Uploading project information for axis2-transport-sms 1.7.0-20121209.180052-664
[INFO] Retrieving previous metadata from apache.snapshots.https
[INFO] Uploading repository metadata for: 'artifact org.apache.axis2:axis2-transport-sms'
[INFO] Retrieving previous metadata from apache.snapshots.https
[WARNING] *** CHECKSUM FAILED - Checksum failed on download: local = 'ae35f0a7f9c7b3585e7feefa4381fa26bd346e65';
remote = 'e7544acf0de12d03e23e9acd8aef31c8feca540c' - RETRYING
[WARNING] *** CHECKSUM FAILED - Checksum failed on download: local = 'ae35f0a7f9c7b3585e7feefa4381fa26bd346e65';
remote = 'e7544acf0de12d03e23e9acd8aef31c8feca540c' - IGNORING
[INFO] Uploading repository metadata for: 'snapshot org.apache.axis2:axis2-transport-sms:1.7.0-SNAPSHOT'
[INFO] Retrieving previous build number from apache.snapshots.https
Uploading: https://repository.apache.org/content/repositories/snapshots/org/apache/axis2/axis2-transport-sms/1.7.0-SNAPSHOT/axis2-transport-sms-1.7.0-20121209.180052-664-sources.jar
40K uploaded  (axis2-transport-sms-1.7.0-20121209.180052-664-sources.jar)
[INFO] [bundle:deploy {execution: default-deploy}]
[INFO] Remote OBR update disabled (enable with -DremoteOBR)
[JENKINS] Archiving <https://builds.apache.org/job/axis2-transports-trunk/ws/transports/modules/sms/pom.xml>
to /home/hudson/hudson/jobs/axis2-transports-trunk/modules/org.apache.axis2$axis2-transport-sms/builds/2012-12-09_18-00-04/archive/org.apache.axis2/axis2-transport-sms/1.7.0-SNAPSHOT/axis2-transport-sms-1.7.0-SNAPSHOT.pom
[JENKINS] Archiving <https://builds.apache.org/job/axis2-transports-trunk/ws/transports/modules/sms/target/axis2-transport-sms-1.7.0-SNAPSHOT.jar>
to /home/hudson/hudson/jobs/axis2-transports-trunk/modules/org.apache.axis2$axis2-transport-sms/builds/2012-12-09_18-00-04/archive/org.apache.axis2/axis2-transport-sms/1.7.0-20121209.180052-664/axis2-transport-sms-1.7.0-20121209.180052-664.jar
[JENKINS] Archiving <https://builds.apache.org/job/axis2-transports-trunk/ws/transports/modules/sms/target/axis2-transport-sms-1.7.0-SNAPSHOT-sources.jar>
to /home/hudson/hudson/jobs/axis2-transports-trunk/modules/org.apache.axis2$axis2-transport-sms/builds/2012-12-09_18-00-04/archive/org.apache.axis2/axis2-transport-sms/1.7.0-20121209.180052-664/axis2-transport-sms-1.7.0-20121209.180052-664-sources.jar
[INFO] ------------------------------------------------------------------------
[INFO] Building Apache Axis2 - Transport - All
[INFO]    task-segment: [clean, deploy]
[INFO] ------------------------------------------------------------------------
[INFO] [clean:clean {execution: default-clean}]
[INFO] Deleting <https://builds.apache.org/job/axis2-transports-trunk/ws/transports/modules/all/target>
[INFO] [remote-resources:process {execution: default}]
[INFO] snapshot org.apache.axis2:axis2-transport-jms:1.7.0-SNAPSHOT: checking for updates
from apache.snapshots
Downloading: http://repository.apache.org/snapshots/org/apache/axis2/axis2-transport-jms/1.7.0-SNAPSHOT/axis2-transport-jms-1.7.0-20121209.155215-693.pom

[INFO] snapshot org.apache.axis2:axis2-transport-mail:1.7.0-SNAPSHOT: checking for updates
from apache.snapshots
Downloading: http://repository.apache.org/snapshots/org/apache/axis2/axis2-transport-mail/1.7.0-SNAPSHOT/axis2-transport-mail-1.7.0-20121209.155215-694.pom

[INFO] snapshot org.apache.axis2:axis2-transport-tcp:1.7.0-SNAPSHOT: checking for updates
from apache.snapshots
Downloading: http://repository.apache.org/snapshots/org/apache/axis2/axis2-transport-tcp/1.7.0-SNAPSHOT/axis2-transport-tcp-1.7.0-20121209.155215-700.pom

[INFO] snapshot org.apache.axis2:axis2-transport-xmpp:1.7.0-SNAPSHOT: checking for updates
from apache.snapshots
Downloading: http://repository.apache.org/snapshots/org/apache/axis2/axis2-transport-xmpp/1.7.0-SNAPSHOT/axis2-transport-xmpp-1.7.0-20121209.155215-697.pom

[INFO] snapshot org.apache.axis2:axis2-transport-udp:1.7.0-SNAPSHOT: checking for updates
from apache.snapshots
Downloading: http://repository.apache.org/snapshots/org/apache/axis2/axis2-transport-udp/1.7.0-SNAPSHOT/axis2-transport-udp-1.7.0-20121209.155215-699.pom

Downloading: http://repository.apache.org/snapshots/org/apache/axis2/axis2-transport-jms/1.7.0-SNAPSHOT/axis2-transport-jms-1.7.0-20121209.155215-693.jar
78K downloaded  (axis2-transport-jms-1.7.0-20121209.155215-693.jar)
Downloading: http://repository.apache.org/snapshots/org/apache/axis2/axis2-transport-mail/1.7.0-SNAPSHOT/axis2-transport-mail-1.7.0-20121209.155215-694.jar
40K downloaded  (axis2-transport-mail-1.7.0-20121209.155215-694.jar)
Downloading: http://repository.apache.org/snapshots/org/apache/axis2/axis2-transport-tcp/1.7.0-SNAPSHOT/axis2-transport-tcp-1.7.0-20121209.155215-700.jar
26K downloaded  (axis2-transport-tcp-1.7.0-20121209.155215-700.jar)
[INFO] snapshot org.apache.axis2:axis2-transport-sms:1.7.0-SNAPSHOT: checking for updates
from apache.snapshots
Downloading: http://repository.apache.org/snapshots/org/apache/axis2/axis2-transport-xmpp/1.7.0-SNAPSHOT/axis2-transport-xmpp-1.7.0-20121209.155215-697.jar
50K downloaded  (axis2-transport-xmpp-1.7.0-20121209.155215-697.jar)
Downloading: http://repository.apache.org/snapshots/org/apache/axis2/axis2-transport-udp/1.7.0-SNAPSHOT/axis2-transport-udp-1.7.0-20121209.155215-699.jar
22K downloaded  (axis2-transport-udp-1.7.0-20121209.155215-699.jar)
[WARNING] org.apache.velocity.runtime.exception.ReferenceException: reference : template =
META-INF/DEPENDENCIES.vm [line 40,column 14] : $license.name is not a valid reference.
[INFO] [resources:resources {execution: default-resources}]
[INFO] Using 'UTF-8' encoding to copy filtered resources.
[INFO] Copying 0 resource
[INFO] Copying 3 resources
[INFO] [compiler:compile {execution: default-compile}]
[INFO] No sources to compile
[INFO] [resources:testResources {execution: default-testResources}]
[INFO] Using 'UTF-8' encoding to copy filtered resources.
[INFO] skip non existing resourceDirectory <https://builds.apache.org/job/axis2-transports-trunk/ws/transports/modules/all/src/test/resources>
[INFO] Copying 3 resources
[INFO] [compiler:testCompile {execution: default-testCompile}]
[INFO] No sources to compile
[INFO] [surefire:test {execution: default-test}]
[INFO] Surefire report directory: <https://builds.apache.org/job/axis2-transports-trunk/ws/transports/modules/all/target/surefire-reports>

-------------------------------------------------------
 T E S T S
-------------------------------------------------------

Results :

Tests run: 0, Failures: 0, Errors: 0, Skipped: 0

[JENKINS] Recording test resultsDec 9, 2012 6:01:30 PM hudson.remoting.SynchronousCommandTransport$ReaderThread
run
SEVERE: I/O error in channel channel
java.io.StreamCorruptedException
	at java.io.ObjectInputStream.readObject0(ObjectInputStream.java:1332)
	at java.io.ObjectInputStream.readObject(ObjectInputStream.java:348)

	at hudson.remoting.Command.readFrom(Command.java:90)
	at hudson.remoting.ClassicCommandTransport.read(ClassicCommandTransport.java:59)
	at hudson.remoting.SynchronousCommandTransport$ReaderThread.run(SynchronousCommandTransport.java:48)
channel stopped
[locks-and-latches] Releasing all the locks
[locks-and-latches] All the locks released
ERROR: Maven JVM terminated unexpectedly with exit code 0


---------------------------------------------------------------------
To unsubscribe, e-mail: java-dev-unsubscribe@axis.apache.org
For additional commands, e-mail: java-dev-help@axis.apache.org


Mime
View raw message