axis-java-dev mailing list archives

Site index · List index
Message view « Date » · « Thread »
Top « Date » · « Thread »
From Apache Jenkins Server <jenk...@builds.apache.org>
Subject Build failed in Jenkins: Rampart #1290
Date Thu, 20 Dec 2012 12:58:30 GMT
See <https://builds.apache.org/job/Rampart/1290/>

------------------------------------------
[...truncated 62 lines...]
Downloaded: http://repository.apache.org/snapshots/org/apache/ws/commons/axiom/axiom-impl/1.2.15-SNAPSHOT/axiom-impl-1.2.15-20121220.125501-10.pom
(8 KB at 413.3 KB/sec)
Downloading: http://repository.apache.org/snapshots/org/apache/ws/commons/schema/XmlSchema/1.4.8-SNAPSHOT/maven-metadata.xml
Downloaded: http://repository.apache.org/snapshots/org/apache/ws/commons/schema/XmlSchema/1.4.8-SNAPSHOT/maven-metadata.xml
(283 B at 13.8 KB/sec)
Downloading: http://repository.apache.org/snapshots/org/apache/ws/commons/schema/XmlSchema/1.4.8-SNAPSHOT/XmlSchema-1.4.8-SNAPSHOT.pom
Downloaded: http://repository.apache.org/snapshots/org/apache/ws/commons/schema/XmlSchema/1.4.8-SNAPSHOT/XmlSchema-1.4.8-SNAPSHOT.pom
(18 KB at 963.3 KB/sec)
Downloading: http://repository.apache.org/snapshots/org/apache/neethi/neethi/3.0.3-SNAPSHOT/maven-metadata.xml
Downloaded: http://repository.apache.org/snapshots/org/apache/neethi/neethi/3.0.3-SNAPSHOT/maven-metadata.xml
(2 KB at 27.7 KB/sec)
Downloading: http://repository.apache.org/snapshots/org/apache/neethi/neethi/3.0.3-SNAPSHOT/neethi-3.0.3-20121202.172633-349.pom
Downloaded: http://repository.apache.org/snapshots/org/apache/neethi/neethi/3.0.3-SNAPSHOT/neethi-3.0.3-20121202.172633-349.pom
(14 KB at 136.1 KB/sec)
Downloading: http://repository.apache.org/snapshots/org/apache/woden/woden-core/1.0-SNAPSHOT/maven-metadata.xml
Downloaded: http://repository.apache.org/snapshots/org/apache/woden/woden-core/1.0-SNAPSHOT/maven-metadata.xml
(776 B at 24.4 KB/sec)
Downloading: http://repository.apache.org/snapshots/org/apache/woden/woden-core/1.0-SNAPSHOT/woden-core-1.0-20121219.122841-226.pom
Downloaded: http://repository.apache.org/snapshots/org/apache/woden/woden-core/1.0-SNAPSHOT/woden-core-1.0-20121219.122841-226.pom
(5 KB at 82.2 KB/sec)
Downloading: http://repository.apache.org/snapshots/org/apache/woden/woden/1.0-SNAPSHOT/maven-metadata.xml
Downloaded: http://repository.apache.org/snapshots/org/apache/woden/woden/1.0-SNAPSHOT/maven-metadata.xml
(598 B at 30.7 KB/sec)
Downloading: http://repository.apache.org/snapshots/org/apache/woden/woden/1.0-SNAPSHOT/woden-1.0-20121219.122839-642.pom
Downloaded: http://repository.apache.org/snapshots/org/apache/woden/woden/1.0-SNAPSHOT/woden-1.0-20121219.122839-642.pom
(13 KB at 667.1 KB/sec)
Downloading: http://repository.apache.org/snapshots/org/apache/axis2/mex/1.7.0-SNAPSHOT/maven-metadata.xml
Downloaded: http://repository.apache.org/snapshots/org/apache/axis2/mex/1.7.0-SNAPSHOT/maven-metadata.xml
(358 B at 1.0 KB/sec)
Downloading: http://repository.apache.org/snapshots/org/apache/axis2/mex/1.7.0-SNAPSHOT/mex-1.7.0-20121220.102944-1173.pom
Downloaded: http://repository.apache.org/snapshots/org/apache/axis2/mex/1.7.0-SNAPSHOT/mex-1.7.0-20121220.102944-1173.pom
(6 KB at 49.8 KB/sec)
Downloading: http://repository.apache.org/snapshots/org/apache/axis2/axis2-mtompolicy/1.7.0-SNAPSHOT/maven-metadata.xml
Downloaded: http://repository.apache.org/snapshots/org/apache/axis2/axis2-mtompolicy/1.7.0-SNAPSHOT/maven-metadata.xml
(371 B at 0.9 KB/sec)
Downloading: http://repository.apache.org/snapshots/org/apache/axis2/axis2-mtompolicy/1.7.0-SNAPSHOT/axis2-mtompolicy-1.7.0-20121220.102944-1208.pom
Downloaded: http://repository.apache.org/snapshots/org/apache/axis2/axis2-mtompolicy/1.7.0-SNAPSHOT/axis2-mtompolicy-1.7.0-20121220.102944-1208.pom
(4 KB at 37.7 KB/sec)
Downloading: http://repository.apache.org/snapshots/org/apache/axis2/addressing/1.7.0-SNAPSHOT/maven-metadata.xml
Downloaded: http://repository.apache.org/snapshots/org/apache/axis2/addressing/1.7.0-SNAPSHOT/maven-metadata.xml
(365 B at 2.0 KB/sec)
Downloading: http://repository.apache.org/snapshots/org/apache/axis2/addressing/1.7.0-SNAPSHOT/addressing-1.7.0-20121220.102944-1265.pom
Downloaded: http://repository.apache.org/snapshots/org/apache/axis2/addressing/1.7.0-SNAPSHOT/addressing-1.7.0-20121220.102944-1265.pom
(6 KB at 58.9 KB/sec)
Downloading: http://repository.apache.org/snapshots/org/apache/axis2/axis2-kernel/1.7.0-SNAPSHOT/axis2-kernel-1.7.0-20121220.102944-1286.jar
Downloading: http://repository.apache.org/snapshots/org/apache/ws/commons/axiom/axiom-api/1.2.15-SNAPSHOT/axiom-api-1.2.15-20121220.124925-10.jar
Downloading: http://repository.apache.org/snapshots/org/apache/ws/commons/axiom/axiom-impl/1.2.15-SNAPSHOT/axiom-impl-1.2.15-20121220.125501-10.jar
Downloading: http://repository.apache.org/snapshots/org/apache/ws/commons/schema/XmlSchema/1.4.8-SNAPSHOT/XmlSchema-1.4.8-SNAPSHOT.jar
Downloading: http://repository.apache.org/snapshots/org/apache/neethi/neethi/3.0.3-SNAPSHOT/neethi-3.0.3-20121202.172633-349.jar
Downloaded: http://repository.apache.org/snapshots/org/apache/ws/commons/axiom/axiom-impl/1.2.15-SNAPSHOT/axiom-impl-1.2.15-20121220.125501-10.jar
(167 KB at 3790.9 KB/sec)
Downloading: http://repository.apache.org/snapshots/org/apache/woden/woden-core/1.0-SNAPSHOT/woden-core-1.0-20121219.122841-226.jar
Downloaded: http://repository.apache.org/snapshots/org/apache/ws/commons/axiom/axiom-api/1.2.15-SNAPSHOT/axiom-api-1.2.15-20121220.124925-10.jar
(407 KB at 6068.3 KB/sec)
Downloading: http://repository.apache.org/snapshots/org/apache/axis2/mex/1.7.0-SNAPSHOT/mex-1.7.0-20121220.102944-1173-impl.jar
Downloaded: http://repository.apache.org/snapshots/org/apache/ws/commons/schema/XmlSchema/1.4.8-SNAPSHOT/XmlSchema-1.4.8-SNAPSHOT.jar
(146 KB at 1939.4 KB/sec)
Downloading: http://repository.apache.org/snapshots/org/apache/axis2/axis2-mtompolicy/1.7.0-SNAPSHOT/axis2-mtompolicy-1.7.0-20121220.102944-1208.jar
Downloaded: http://repository.apache.org/snapshots/org/apache/woden/woden-core/1.0-SNAPSHOT/woden-core-1.0-20121219.122841-226.jar
(364 KB at 2839.9 KB/sec)
Downloading: http://repository.apache.org/snapshots/org/apache/axis2/addressing/1.7.0-SNAPSHOT/addressing-1.7.0-20121220.102944-1265.mar
Downloaded: http://repository.apache.org/snapshots/org/apache/neethi/neethi/3.0.3-SNAPSHOT/neethi-3.0.3-20121202.172633-349.jar
(70 KB at 368.8 KB/sec)
Downloaded: http://repository.apache.org/snapshots/org/apache/axis2/mex/1.7.0-SNAPSHOT/mex-1.7.0-20121220.102944-1173-impl.jar
(33 KB at 237.6 KB/sec)
Downloaded: http://repository.apache.org/snapshots/org/apache/axis2/axis2-mtompolicy/1.7.0-SNAPSHOT/axis2-mtompolicy-1.7.0-20121220.102944-1208.jar
(14 KB at 91.0 KB/sec)
Downloaded: http://repository.apache.org/snapshots/org/apache/axis2/addressing/1.7.0-SNAPSHOT/addressing-1.7.0-20121220.102944-1265.mar
(31 KB at 451.4 KB/sec)
Downloaded: http://repository.apache.org/snapshots/org/apache/axis2/axis2-kernel/1.7.0-SNAPSHOT/axis2-kernel-1.7.0-20121220.102944-1286.jar
(1028 KB at 3618.2 KB/sec)
mojoStarted org.apache.maven.plugins:maven-clean-plugin:2.4.1(default-clean)
[INFO] 
[INFO] --- maven-clean-plugin:2.4.1:clean (default-clean) @ rampart-project ---
[INFO] Deleting <https://builds.apache.org/job/Rampart/ws/trunk/target>
mojoSucceeded org.apache.maven.plugins:maven-clean-plugin:2.4.1(default-clean)
mojoStarted org.apache.maven.plugins:maven-enforcer-plugin:1.1(default)
[INFO] 
[INFO] --- maven-enforcer-plugin:1.1:enforce (default) @ rampart-project ---
mojoSucceeded org.apache.maven.plugins:maven-enforcer-plugin:1.1(default)
mojoStarted org.apache.maven.plugins:maven-remote-resources-plugin:1.1(default)
[INFO] 
[INFO] --- maven-remote-resources-plugin:1.1:process (default) @ rampart-project ---
[INFO] Setting property: classpath.resource.loader.class => 'org.codehaus.plexus.velocity.ContextClassLoaderResourceLoader'.
[INFO] Setting property: velocimacro.messages.on => 'false'.
[INFO] Setting property: resource.loader => 'classpath'.
[INFO] Setting property: resource.manager.logwhenfound => 'false'.
[WARNING] org.apache.velocity.runtime.exception.ReferenceException: reference : template =
META-INF/DEPENDENCIES.vm [line 40,column 14] : $license.name is not a valid reference.
mojoSucceeded org.apache.maven.plugins:maven-remote-resources-plugin:1.1(default)
mojoStarted org.apache.maven.plugins:maven-install-plugin:2.3(default-install)
[INFO] 
[INFO] --- maven-install-plugin:2.3:install (default-install) @ rampart-project ---
[INFO] Installing <https://builds.apache.org/job/Rampart/ws/trunk/pom.xml> to <https://builds.apache.org/job/Rampart/ws/.repository/org/apache/rampart/rampart-project/1.7.0-SNAPSHOT/rampart-project-1.7.0-SNAPSHOT.pom>
mojoSucceeded org.apache.maven.plugins:maven-install-plugin:2.3(default-install)
projectSucceeded org.apache.rampart:rampart-project:1.7.0-SNAPSHOT
projectStarted org.apache.rampart:rampart-policy:1.7.0-SNAPSHOT
[INFO]                                                                         
[INFO] ------------------------------------------------------------------------
[INFO] Building Rampart - Policy 1.7.0-SNAPSHOT
[INFO] ------------------------------------------------------------------------
mojoStarted org.apache.maven.plugins:maven-clean-plugin:2.4.1(default-clean)[INFO] Deleting
<https://builds.apache.org/job/Rampart/ws/trunk/modules/rampart-policy/target>

[INFO] 
[INFO] --- maven-clean-plugin:2.4.1:clean (default-clean) @ rampart-policy ---
mojoSucceeded org.apache.maven.plugins:maven-clean-plugin:2.4.1(default-clean)
mojoStarted org.apache.maven.plugins:maven-enforcer-plugin:1.1(default)
[INFO] 
[INFO] --- maven-enforcer-plugin:1.1:enforce (default) @ rampart-policy ---
mojoSucceeded org.apache.maven.plugins:maven-enforcer-plugin:1.1(default)
mojoStarted org.apache.maven.plugins:maven-remote-resources-plugin:1.1(default)
[INFO] 
[INFO] --- maven-remote-resources-plugin:1.1:process (default) @ rampart-policy ---
[WARNING] org.apache.velocity.runtime.exception.ReferenceException: reference : template =
META-INF/DEPENDENCIES.vm [line 40,column 14] : $license.name is not a valid reference.
mojoSucceeded org.apache.maven.plugins:maven-remote-resources-plugin:1.1(default)
mojoStarted org.apache.maven.plugins:maven-resources-plugin:2.4(default-resources)
[INFO] 
[INFO] --- maven-resources-plugin:2.4:resources (default-resources) @ rampart-policy ---
[INFO] Using 'UTF-8' encoding to copy filtered resources.
[INFO] Copying 1 resource
[INFO] Copying 3 resources
mojoSucceeded org.apache.maven.plugins:maven-resources-plugin:2.4(default-resources)
mojoStarted org.apache.maven.plugins:maven-compiler-plugin:2.0(default-compile)
[INFO] 
[INFO] --- maven-compiler-plugin:2.0:compile (default-compile) @ rampart-policy ---
Compiling 89 source files to <https://builds.apache.org/job/Rampart/ws/trunk/modules/rampart-policy/target/classes>
mojoSucceeded org.apache.maven.plugins:maven-compiler-plugin:2.0(default-compile)
mojoStarted org.apache.maven.plugins:maven-resources-plugin:2.4(default-testResources)[INFO]
Using 'UTF-8' encoding to copy filtered resources.
[INFO] skip non existing resourceDirectory <https://builds.apache.org/job/Rampart/ws/trunk/modules/rampart-policy/src/test/resources>
[INFO] Copying 3 resources

[INFO] 
[INFO] --- maven-resources-plugin:2.4:testResources (default-testResources) @ rampart-policy
---
mojoSucceeded org.apache.maven.plugins:maven-resources-plugin:2.4(default-testResources)
mojoStarted org.apache.maven.plugins:maven-compiler-plugin:2.0(default-testCompile)[INFO]
No sources to compile

[INFO] 
[INFO] --- maven-compiler-plugin:2.0:testCompile (default-testCompile) @ rampart-policy ---
mojoSucceeded org.apache.maven.plugins:maven-compiler-plugin:2.0(default-testCompile)
mojoStarted org.apache.maven.plugins:maven-surefire-plugin:2.10(default-test)
[INFO] 
[INFO] --- maven-surefire-plugin:2.10:test (default-test) @ rampart-policy ---
[INFO] Surefire report directory: <https://builds.apache.org/job/Rampart/ws/trunk/modules/rampart-policy/target/surefire-reports>

-------------------------------------------------------
 T E S T S
-------------------------------------------------------

Results :

Tests run: 0, Failures: 0, Errors: 0, Skipped: 0

mojoSucceeded org.apache.maven.plugins:maven-surefire-plugin:2.10(default-test)
[JENKINS] Recording test results
mojoStarted org.apache.maven.plugins:maven-jar-plugin:2.3(default-jar)
[INFO] 
[INFO] --- maven-jar-plugin:2.3:jar (default-jar) @ rampart-policy ---
[INFO] Building jar: <https://builds.apache.org/job/Rampart/ws/trunk/modules/rampart-policy/target/rampart-policy-1.7.0-SNAPSHOT.jar>
mojoSucceeded org.apache.maven.plugins:maven-jar-plugin:2.3(default-jar)
mojoStarted org.apache.maven.plugins:maven-install-plugin:2.3(default-install)
[INFO] Installing <https://builds.apache.org/job/Rampart/ws/trunk/modules/rampart-policy/target/rampart-policy-1.7.0-SNAPSHOT.jar>
to <https://builds.apache.org/job/Rampart/ws/.repository/org/apache/rampart/rampart-policy/1.7.0-SNAPSHOT/rampart-policy-1.7.0-SNAPSHOT.jar>
[INFO] [INFO] Installing <https://builds.apache.org/job/Rampart/ws/trunk/modules/rampart-policy/pom.xml>
to <https://builds.apache.org/job/Rampart/ws/.repository/org/apache/rampart/rampart-policy/1.7.0-SNAPSHOT/rampart-policy-1.7.0-SNAPSHOT.pom>

[INFO] --- maven-install-plugin:2.3:install (default-install) @ rampart-policy ---
mojoSucceeded org.apache.maven.plugins:maven-install-plugin:2.3(default-install)
projectSucceeded org.apache.rampart:rampart-policy:1.7.0-SNAPSHOT
projectStarted org.apache.rampart:rampart-trust:1.7.0-SNAPSHOT
[INFO]                                                                         
[INFO] ------------------------------------------------------------------------
[INFO] Building Rampart - Trust 1.7.0-SNAPSHOT
[INFO] ------------------------------------------------------------------------
Downloading: http://repository.apache.org/snapshots/org/apache/ws/commons/axiom/axiom-dom/1.2.15-SNAPSHOT/maven-metadata.xml
Downloaded: http://repository.apache.org/snapshots/org/apache/ws/commons/axiom/axiom-dom/1.2.15-SNAPSHOT/maven-metadata.xml
(2 KB at 14.7 KB/sec)
Downloading: http://repository.apache.org/snapshots/org/apache/ws/commons/axiom/axiom-dom/1.2.15-SNAPSHOT/axiom-dom-1.2.15-20121220.115451-9.pom
Downloaded: http://repository.apache.org/snapshots/org/apache/ws/commons/axiom/axiom-dom/1.2.15-SNAPSHOT/axiom-dom-1.2.15-20121220.115451-9.pom
(9 KB at 125.7 KB/sec)
Downloading: http://repository.apache.org/snapshots/org/apache/ws/commons/axiom/axiom-dom/1.2.15-SNAPSHOT/axiom-dom-1.2.15-20121220.115451-9.jar
Downloaded: http://repository.apache.org/snapshots/org/apache/ws/commons/axiom/axiom-dom/1.2.15-SNAPSHOT/axiom-dom-1.2.15-20121220.115451-9.jar
(208 KB at 5054.9 KB/sec)
mojoStarted org.apache.maven.plugins:maven-clean-plugin:2.4.1(default-clean)
[INFO] 
[INFO] --- maven-clean-plugin:2.4.1:clean (default-clean) @ rampart-trust ---
[INFO] Deleting <https://builds.apache.org/job/Rampart/ws/trunk/modules/rampart-trust/target>
mojoSucceeded org.apache.maven.plugins:maven-clean-plugin:2.4.1(default-clean)
mojoStarted org.apache.maven.plugins:maven-enforcer-plugin:1.1(default)
[INFO] 
[INFO] --- maven-enforcer-plugin:1.1:enforce (default) @ rampart-trust ---
mojoSucceeded org.apache.maven.plugins:maven-enforcer-plugin:1.1(default)
mojoStarted org.apache.maven.plugins:maven-remote-resources-plugin:1.1(default)
[INFO] 
[INFO] --- maven-remote-resources-plugin:1.1:process (default) @ rampart-trust ---
[WARNING] org.apache.velocity.runtime.exception.ReferenceException: reference : template =
META-INF/DEPENDENCIES.vm [line 40,column 14] : $license.name is not a valid reference.
mojoSucceeded org.apache.maven.plugins:maven-remote-resources-plugin:1.1(default)
mojoStarted org.apache.maven.plugins:maven-resources-plugin:2.4(default-resources)[INFO] Using
'UTF-8' encoding to copy filtered resources.

[INFO] 
[INFO] --- maven-resources-plugin:2.4:resources (default-resources) @ rampart-trust ---
[INFO] Copying 1 resource
[INFO] Copying 3 resources
mojoSucceeded org.apache.maven.plugins:maven-resources-plugin:2.4(default-resources)
mojoStarted org.apache.maven.plugins:maven-compiler-plugin:2.0(default-compile)
[INFO] 
[INFO] --- maven-compiler-plugin:2.0:compile (default-compile) @ rampart-trust ---Compiling
39 source files to <https://builds.apache.org/job/Rampart/ws/trunk/modules/rampart-trust/target/classes>

mojoSucceeded org.apache.maven.plugins:maven-compiler-plugin:2.0(default-compile)
mojoStarted org.apache.maven.plugins:maven-resources-plugin:2.4(default-testResources)[INFO]
Using 'UTF-8' encoding to copy filtered resources.

[INFO] 
[INFO] --- maven-resources-plugin:2.4:testResources (default-testResources) @ rampart-trust
---
[INFO] Copying 4 resources
[INFO] Copying 3 resources
mojoSucceeded org.apache.maven.plugins:maven-resources-plugin:2.4(default-testResources)
mojoStarted org.apache.maven.plugins:maven-compiler-plugin:2.0(default-testCompile)
[INFO] 
[INFO] --- maven-compiler-plugin:2.0:testCompile (default-testCompile) @ rampart-trust ---
Compiling 8 source files to <https://builds.apache.org/job/Rampart/ws/trunk/modules/rampart-trust/target/test-classes>
mojoSucceeded org.apache.maven.plugins:maven-compiler-plugin:2.0(default-testCompile)
mojoStarted org.apache.maven.plugins:maven-surefire-plugin:2.10(default-test)[INFO] Surefire
report directory: <https://builds.apache.org/job/Rampart/ws/trunk/modules/rampart-trust/target/surefire-reports>

[INFO] 
-------------------------------------------------------
 T E S T S
-------------------------------------------------------

[INFO] --- maven-surefire-plugin:2.10:test (default-test) @ rampart-trust ---
Running org.apache.rahas.test.util.TestUtil
Tests run: 0, Failures: 0, Errors: 0, Skipped: 0, Time elapsed: 0 sec
Running org.apache.rahas.test.util.TestSAMLCallbackHandler
Tests run: 0, Failures: 0, Errors: 0, Skipped: 0, Time elapsed: 0.001 sec
Running org.apache.rahas.test.util.TestCallbackHandler
Tests run: 0, Failures: 0, Errors: 0, Skipped: 0, Time elapsed: 0 sec
Running org.apache.rahas.test.util.AbstractTestCase
Tests run: 1, Failures: 0, Errors: 0, Skipped: 0, Time elapsed: 1.593 sec
Running org.apache.rahas.impl.SAML2TokenIssuerTest
Tests run: 4, Failures: 0, Errors: 0, Skipped: 0, Time elapsed: 16.576 sec
Running
	at hudson.util.RobustReflectionConverter.doMarshal(RobustReflectionConverter.java:160)
	at hudson.util.RobustReflectionConverter.marshal(RobustReflectionConverter.java:101)
	at com.thoughtworks.xstream.core.AbstractReferenceMarshaller.convert(AbstractReferenceMarshaller.java:68)
	at com.thoughtworks.xstream.core.TreeMarshaller.convertAnother(TreeMarshaller.java:78)
	at com.thoughtworks.xstream.core.TreeMarshaller.convertAnother(TreeMarshaller.java:63)
	at com.thoughtworks.xstream.converters.collections.AbstractCollectionConverter.writeItem(AbstractCollectionConverter.java:64)
	at com.thoughtworks.xstream.converters.collections.CollectionConverter.marshal(CollectionConverter.java:55)
	at com.thoughtworks.xstream.core.AbstractReferenceMarshaller.convert(AbstractReferenceMarshaller.java:68)
	at com.thoughtworks.xstream.core.TreeMarshaller.convertAnother(TreeMarshaller.java:78)
	at hudson.util.RobustReflectionConverter.marshallField(RobustReflectionConverter.java:216)
	at hudson.util.RobustReflectionConverter$2.writeField(RobustReflectionConverter.java:203)
	... 54 more
Caused by: com.thoughtworks.xstream.io.StreamException:  : No space left on device
	at com.thoughtworks.xstream.core.util.QuickWriter.flush(QuickWriter.java:73)
	at com.thoughtworks.xstream.core.util.QuickWriter.write(QuickWriter.java:49)
	at com.thoughtworks.xstream.io.xml.PrettyPrintWriter.writeText(PrettyPrintWriter.java:245)
	at com.thoughtworks.xstream.io.xml.PrettyPrintWriter.writeText(PrettyPrintWriter.java:199)
	at com.thoughtworks.xstream.io.xml.PrettyPrintWriter.setValue(PrettyPrintWriter.java:182)
	at com.thoughtworks.xstream.io.WriterWrapper.setValue(WriterWrapper.java:45)
	at com.thoughtworks.xstream.converters.SingleValueConverterWrapper.marshal(SingleValueConverterWrapper.java:45)
	at com.thoughtworks.xstream.core.AbstractReferenceMarshaller.convert(AbstractReferenceMarshaller.java:48)
	at com.thoughtworks.xstream.core.TreeMarshaller.convertAnother(TreeMarshaller.java:78)
	at hudson.util.RobustReflectionConverter.marshallField(RobustReflectionConverter.java:216)
	at hudson.util.RobustReflectionConverter$2.writeField(RobustReflectionConverter.java:203)
	... 67 more
Caused by: java.io.IOException: No space left on device
	at java.io.FileOutputStream.writeBytes(Native Method)
	at java.io.FileOutputStream.write(FileOutputStream.java:318)
	at sun.nio.cs.StreamEncoder.writeBytes(StreamEncoder.java:221)
	at sun.nio.cs.StreamEncoder.implFlushBuffer(StreamEncoder.java:291)
	at sun.nio.cs.StreamEncoder.implFlush(StreamEncoder.java:295)
	at sun.nio.cs.StreamEncoder.flush(StreamEncoder.java:141)
	at java.io.OutputStreamWriter.flush(OutputStreamWriter.java:229)
	at java.io.BufferedWriter.flush(BufferedWriter.java:254)
	at hudson.util.AtomicFileWriter.flush(AtomicFileWriter.java:90)
	at com.thoughtworks.xstream.core.util.QuickWriter.flush(QuickWriter.java:71)
	... 77 more
channel stopped
[locks-and-latches] Releasing all the locks
[locks-and-latches] All the locks released

---------------------------------------------------------------------
To unsubscribe, e-mail: java-dev-unsubscribe@axis.apache.org
For additional commands, e-mail: java-dev-help@axis.apache.org


Mime
View raw message