axis-java-dev mailing list archives

Site index · List index
Message view « Date » · « Thread »
Top « Date » · « Thread »
From Apache Jenkins Server <jenk...@builds.apache.org>
Subject Build failed in Jenkins: axis2-transports-trunk #1141
Date Fri, 16 Nov 2012 23:39:02 GMT
See <https://builds.apache.org/job/axis2-transports-trunk/1141/changes>

Changes:

[veithen] Removed the http module. Its contents have been moved to Axis2 core.

------------------------------------------
Started by an SCM change
Started by upstream project "Axis2" build number 1941
Building remotely on ubuntu1 in workspace <https://builds.apache.org/job/axis2-transports-trunk/ws/>
Updating http://svn.apache.org/repos/asf/axis/axis2/java/transports/trunk
D         modules/http
D         modules/mail
D         modules/xmpp
D         modules/tcp
D         modules/testkit
D         modules/udp
D         modules/jms
D         modules/base
U         pom.xml
At revision 1410610
[axis2-transports-trunk] $ /bin/bash -xe /tmp/hudson5094805663675735301.sh
+ '[' -d <https://builds.apache.org/job/axis2-transports-trunk/ws/.repository> ']'
++ find <https://builds.apache.org/job/axis2-transports-trunk/ws/.repository> -type
d -and -name '*-SNAPSHOT'
+ rm -rf <https://builds.apache.org/job/axis2-transports-trunk/ws/.repository/org/apache/neethi/neethi/3.0.3-SNAPSHOT>
<https://builds.apache.org/job/axis2-transports-trunk/ws/.repository/org/apache/axis2/axis2-parent/1.7.0-SNAPSHOT>
<https://builds.apache.org/job/axis2-transports-trunk/ws/.repository/org/apache/axis2/axis2-transport-sms/1.7.0-SNAPSHOT>
<https://builds.apache.org/job/axis2-transports-trunk/ws/.repository/org/apache/axis2/axis2-transport-base/1.7.0-SNAPSHOT>
<https://builds.apache.org/job/axis2-transports-trunk/ws/.repository/org/apache/axis2/axis2-transports/1.7.0-SNAPSHOT>
<https://builds.apache.org/job/axis2-transports-trunk/ws/.repository/org/apache/axis2/axis2-transport-udp/1.7.0-SNAPSHOT>
<https://builds.apache.org/job/axis2-transports-trunk/ws/.repository/org/apache/axis2/axis2-transport-http/1.7.0-SNAPSHOT>
<https://builds.apache.org/job/axis2-transports-trunk/ws/.repository/org/apache/axis2/axis2-transport-http-tests/1.7.0-SNAPSHOT>
<https://builds.apache.org/job/axis2-transports-trunk/ws/.repository/org/apache/axis2/axis2-transport-jms/1.7.0-SNAPSHOT>
<https://builds.apache.org/job/axis2-transports-trunk/ws/.repository/org/apache/axis2/axis2-transport-testkit/1.7.0-SNAPSHOT>
<https://builds.apache.org/job/axis2-transports-trunk/ws/.repository/org/apache/axis2/axis2-kernel/1.7.0-SNAPSHOT>
<https://builds.apache.org/job/axis2-transports-trunk/ws/.repository/org/apache/axis2/axis2-transport-all/1.7.0-SNAPSHOT>
<https://builds.apache.org/job/axis2-transports-trunk/ws/.repository/org/apache/axis2/axis2-transport-xmpp/1.7.0-SNAPSHOT>
<https://builds.apache.org/job/axis2-transports-trunk/ws/.repository/org/apache/axis2/axis2-transport-mail/1.7.0-SNAPSHOT>
<https://builds.apache.org/job/axis2-transports-trunk/ws/.repository/org/apache/axis2/addressing/1.7.0-SNAPSHOT>
<https://builds.apache.org/job/axis2-transports-trunk/ws/.repository/org/apache/axis2/axis2-transport-tcp/1.7.0-SNAPSHOT>
<https://builds.apache.org/job/axis2-transports-trunk/ws/.repository/org/apache/woden/woden-core/1.0-SNAPSHOT>
<https://builds.apache.org/job/axis2-transports-trunk/ws/.repository/org/apache/woden/woden/1.0-SNAPSHOT>
<https://builds.apache.org/job/axis2-transports-trunk/ws/.repository/org/apache/ws/commons/axiom/axiom-parent/1.2.14-SNAPSHOT>
<https://builds.apache.org/job/axis2-transports-trunk/ws/.repository/org/apache/ws/commons/axiom/axiom-api/1.2.14-SNAPSHOT>
<https://builds.apache.org/job/axis2-transports-trunk/ws/.repository/org/apache/ws/commons/axiom/axiom-impl/1.2.14-SNAPSHOT>
<https://builds.apache.org/job/axis2-transports-trunk/ws/.repository/org/apache/ws/commons/schema/XmlSchema/1.4.8-SNAPSHOT>
[locks-and-latches] Checking to see if we really have the locks
[locks-and-latches] Have all the locks, build can start
Parsing POMs
Modules changed, recalculating dependency graph
[transports] $ /home/hudson/tools/java/latest1.5/bin/java -cp /home/jenkins/jenkins-slave/maven-agent.jar:/home/jenkins/jenkins-slave/classworlds.jar
hudson.maven.agent.Main /home/hudson/tools/maven/apache-maven-2.2.1 /home/jenkins/jenkins-slave/slave.jar
/home/jenkins/jenkins-slave/maven-interceptor.jar 37926 /home/jenkins/jenkins-slave/maven2.1-interceptor.jar
channel started
<===[JENKINS REMOTING CAPACITY]===>   log4j:WARN No appenders could be found for logger
(org.apache.commons.beanutils.converters.BooleanConverter).
log4j:WARN Please initialize the log4j system properly.
Executing Maven:  -B -f <https://builds.apache.org/job/axis2-transports-trunk/ws/transports/pom.xml>
-Dmaven.repo.local=<https://builds.apache.org/job/axis2-transports-trunk/ws/.repository>
clean deploy
[INFO] Scanning for projects...
[INFO] Reactor build order: 
[INFO]   Apache Axis2 - Transport - Root
[INFO]   Apache Axis2 - Transport - Sms
[INFO]   Apache Axis2 - Transport - All
[INFO] ------------------------------------------------------------------------
[INFO] Building Apache Axis2 - Transport - Root
[INFO]    task-segment: [clean, deploy]
[INFO] ------------------------------------------------------------------------
[INFO] [clean:clean {execution: default-clean}]
[INFO] Deleting <https://builds.apache.org/job/axis2-transports-trunk/ws/transports/target>
[INFO] Setting property: classpath.resource.loader.class => 'org.codehaus.plexus.velocity.ContextClassLoaderResourceLoader'.
[INFO] Setting property: velocimacro.messages.on => 'false'.
[INFO] Setting property: resource.loader => 'classpath'.
[INFO] Setting property: resource.manager.logwhenfound => 'false'.
[INFO] [remote-resources:process {execution: default}]
[INFO] snapshot org.apache.axis2:axis2-kernel:1.7.0-SNAPSHOT: checking for updates from apache.snapshots
Downloading: http://repository.apache.org/snapshots/org/apache/axis2/axis2-kernel/1.7.0-SNAPSHOT/axis2-kernel-1.7.0-20121116.213538-1214.pom

[INFO] snapshot org.apache.axis2:axis2-parent:1.7.0-SNAPSHOT: checking for updates from apache.snapshots
Downloading: http://repository.apache.org/snapshots/org/apache/axis2/axis2-parent/1.7.0-SNAPSHOT/axis2-parent-1.7.0-20121116.213538-1225.pom

[INFO] snapshot org.apache.ws.commons.axiom:axiom-api:1.2.14-SNAPSHOT: checking for updates
from apache.snapshots
Downloading: http://repository.apache.org/snapshots/org/apache/ws/commons/axiom/axiom-api/1.2.14-SNAPSHOT/axiom-api-1.2.14-20121114.193154-404.pom

[INFO] snapshot org.apache.ws.commons.axiom:axiom-parent:1.2.14-SNAPSHOT: checking for updates
from apache.snapshots
Downloading: http://repository.apache.org/snapshots/org/apache/ws/commons/axiom/axiom-parent/1.2.14-SNAPSHOT/axiom-parent-1.2.14-20121114.192748-409.pom

[INFO] snapshot org.apache.ws.commons.axiom:axiom-impl:1.2.14-SNAPSHOT: checking for updates
from apache.snapshots
Downloading: http://repository.apache.org/snapshots/org/apache/ws/commons/axiom/axiom-impl/1.2.14-SNAPSHOT/axiom-impl-1.2.14-20121114.194026-404.pom

[INFO] snapshot org.apache.ws.commons.schema:XmlSchema:1.4.8-SNAPSHOT: checking for updates
from apache.snapshots
Downloading: http://repository.apache.org/snapshots/org/apache/ws/commons/schema/XmlSchema/1.4.8-SNAPSHOT/XmlSchema-1.4.8-SNAPSHOT.pom

[INFO] snapshot org.apache.neethi:neethi:3.0.3-SNAPSHOT: checking for updates from apache.snapshots
Downloading: http://repository.apache.org/snapshots/org/apache/neethi/neethi/3.0.3-SNAPSHOT/neethi-3.0.3-20121114.195623-344.pom

[INFO] snapshot org.apache.woden:woden-core:1.0-SNAPSHOT: checking for updates from apache.snapshots
Downloading: http://repository.apache.org/snapshots/org/apache/woden/woden-core/1.0-SNAPSHOT/woden-core-1.0-20121116.213344-154.pom

[INFO] snapshot org.apache.woden:woden:1.0-SNAPSHOT: checking for updates from apache.snapshots
Downloading: http://repository.apache.org/snapshots/org/apache/woden/woden/1.0-SNAPSHOT/woden-1.0-20121116.213342-570.pom

Downloading: http://repo1.maven.org/maven2/commons-io/commons-io/2.1/commons-io-2.1.pom
10K downloaded  (commons-io-2.1.pom)
Downloading: http://repo1.maven.org/maven2/commons-io/commons-io/2.1/commons-io-2.1.jar
Downloading: http://repository.apache.org/snapshots/org/apache/ws/commons/schema/XmlSchema/1.4.8-SNAPSHOT/XmlSchema-1.4.8-SNAPSHOT.jar
Downloading: http://repository.apache.org/snapshots/org/apache/ws/commons/axiom/axiom-api/1.2.14-SNAPSHOT/axiom-api-1.2.14-20121114.193154-404.jar
Downloading: http://repository.apache.org/snapshots/org/apache/woden/woden-core/1.0-SNAPSHOT/woden-core-1.0-20121116.213344-154.jar
Downloading: http://repository.apache.org/snapshots/org/apache/axis2/axis2-kernel/1.7.0-SNAPSHOT/axis2-kernel-1.7.0-20121116.213538-1214.jar
159K downloaded  (commons-io-2.1.jar)
Downloading: http://repository.apache.org/snapshots/org/apache/neethi/neethi/3.0.3-SNAPSHOT/neethi-3.0.3-20121114.195623-344.jar
69K downloaded  (neethi-3.0.3-20121114.195623-344.jar)
145K downloaded  (XmlSchema-1.4.8-SNAPSHOT.jar)
363K downloaded  (woden-core-1.0-20121116.213344-154.jar)
411K downloaded  (axiom-api-1.2.14-20121114.193154-404.jar)
Downloading: http://repository.apache.org/snapshots/org/apache/ws/commons/axiom/axiom-impl/1.2.14-SNAPSHOT/axiom-impl-1.2.14-20121114.194026-404.jar
166K downloaded  (axiom-impl-1.2.14-20121114.194026-404.jar)
1027K downloaded  (axis2-kernel-1.7.0-20121116.213538-1214.jar)
[WARNING] org.apache.velocity.runtime.exception.ReferenceException: reference : template =
META-INF/DEPENDENCIES.vm [line 40,column 14] : $license.name is not a valid reference.
[INFO] [site:attach-descriptor {execution: default-attach-descriptor}]
[INFO] Parent project loaded from repository: org.apache:apache:pom:9
[INFO] Preparing source:jar
[WARNING] Removing: jar from forked lifecycle, to prevent recursive invocation.
[INFO] No goals needed for project - skipping
[INFO] [source:jar {execution: default}]
[INFO] [install:install {execution: default-install}]
[INFO] Installing <https://builds.apache.org/job/axis2-transports-trunk/ws/transports/pom.xml>
to <https://builds.apache.org/job/axis2-transports-trunk/ws/.repository/org/apache/axis2/axis2-transports/1.7.0-SNAPSHOT/axis2-transports-1.7.0-SNAPSHOT.pom>
[INFO] Installing <https://builds.apache.org/job/axis2-transports-trunk/ws/transports/target/axis2-transports-1.7.0-SNAPSHOT-site.xml>
to <https://builds.apache.org/job/axis2-transports-trunk/ws/.repository/org/apache/axis2/axis2-transports/1.7.0-SNAPSHOT/axis2-transports-1.7.0-SNAPSHOT-site.xml>
[INFO] [deploy:deploy {execution: default-deploy}]
[INFO] Retrieving previous build number from apache.snapshots.https
Uploading: https://repository.apache.org/content/repositories/snapshots/org/apache/axis2/axis2-transports/1.7.0-SNAPSHOT/axis2-transports-1.7.0-20121116.233845-683.pom
16K uploaded  (axis2-transports-1.7.0-20121116.233845-683.pom)
[INFO] Retrieving previous metadata from apache.snapshots.https
[INFO] Uploading repository metadata for: 'snapshot org.apache.axis2:axis2-transports:1.7.0-SNAPSHOT'
[INFO] Retrieving previous metadata from apache.snapshots.https
[INFO] Uploading repository metadata for: 'artifact org.apache.axis2:axis2-transports'
[INFO] Retrieving previous build number from apache.snapshots.https
Uploading: https://repository.apache.org/content/repositories/snapshots/org/apache/axis2/axis2-transports/1.7.0-SNAPSHOT/axis2-transports-1.7.0-20121116.233845-683-site.xml
2K uploaded  (axis2-transports-1.7.0-20121116.233845-683-site.xml)
[JENKINS] Archiving <https://builds.apache.org/job/axis2-transports-trunk/ws/transports/pom.xml>
to /home/hudson/hudson/jobs/axis2-transports-trunk/modules/org.apache.axis2$axis2-transports/builds/2012-11-16_23-37-52/archive/org.apache.axis2/axis2-transports/1.7.0-SNAPSHOT/axis2-transports-1.7.0-SNAPSHOT.pom
[JENKINS] Archiving <https://builds.apache.org/job/axis2-transports-trunk/ws/.repository/org/apache/axis2/axis2-transports/1.7.0-SNAPSHOT/axis2-transports-1.7.0-SNAPSHOT.pom>
to /home/hudson/hudson/jobs/axis2-transports-trunk/modules/org.apache.axis2$axis2-transports/builds/2012-11-16_23-37-52/archive/org.apache.axis2/axis2-transports/1.7.0-20121116.233845-683/axis2-transports-1.7.0-20121116.233845-683.pom
[JENKINS] Archiving <https://builds.apache.org/job/axis2-transports-trunk/ws/transports/target/axis2-transports-1.7.0-SNAPSHOT-site.xml>
to /home/hudson/hudson/jobs/axis2-transports-trunk/modules/org.apache.axis2$axis2-transports/builds/2012-11-16_23-37-52/archive/org.apache.axis2/axis2-transports/1.7.0-20121116.233845-683/axis2-transports-1.7.0-20121116.233845-683-site.xml
[INFO] ------------------------------------------------------------------------
[INFO] Building Apache Axis2 - Transport - Sms
[INFO]    task-segment: [clean, deploy]
[INFO] ------------------------------------------------------------------------
[INFO] [clean:clean {execution: default-clean}]
[INFO] Deleting <https://builds.apache.org/job/axis2-transports-trunk/ws/transports/modules/sms/target>
[INFO] [remote-resources:process {execution: default}]
[INFO] snapshot org.apache.axis2:axis2-transport-base:1.7.0-SNAPSHOT: checking for updates
from apache-snapshots
[INFO] snapshot org.apache.axis2:axis2-transport-base:1.7.0-SNAPSHOT: checking for updates
from wso2-m2
[INFO] snapshot org.apache.axis2:axis2-transport-base:1.7.0-SNAPSHOT: checking for updates
from apache.snapshots
Downloading: http://repository.apache.org/snapshots/org/apache/axis2/axis2-transport-base/1.7.0-SNAPSHOT/axis2-transport-base-1.7.0-20121116.213538-668.pom

Downloading: http://people.apache.org/repo/m2-snapshot-repository//org/smslib/smslib/3.4.1/smslib-3.4.1.pom
[INFO] Unable to find resource 'org.smslib:smslib:pom:3.4.1' in repository apache-snapshots
(http://people.apache.org/repo/m2-snapshot-repository/)
Downloading: http://dist.wso2.org/maven2//org/smslib/smslib/3.4.1/smslib-3.4.1.pom
[INFO] Unable to find resource 'org.smslib:smslib:pom:3.4.1' in repository wso2-m2 (http://dist.wso2.org/maven2/)
Downloading: http://repo1.maven.org/maven2/org/smslib/smslib/3.4.1/smslib-3.4.1.pom
[INFO] Unable to find resource 'org.smslib:smslib:pom:3.4.1' in repository central (http://repo1.maven.org/maven2)
Downloading: http://repository.apache.org/snapshots/org/apache/axis2/axis2-transport-base/1.7.0-SNAPSHOT/axis2-transport-base-1.7.0-20121116.213538-668.jar
102K downloaded  (axis2-transport-base-1.7.0-20121116.213538-668.jar)
[WARNING] org.apache.velocity.runtime.exception.ReferenceException: reference : template =
META-INF/DEPENDENCIES.vm [line 40,column 14] : $license.name is not a valid reference.
[INFO] [resources:resources {execution: default-resources}]
[INFO] Using 'UTF-8' encoding to copy filtered resources.
[INFO] skip non existing resourceDirectory <https://builds.apache.org/job/axis2-transports-trunk/ws/transports/modules/sms/src/main/resources>
[INFO] Copying 3 resources
[INFO] [compiler:compile {execution: default-compile}]
[INFO] Compiling 24 source files to <https://builds.apache.org/job/axis2-transports-trunk/ws/transports/modules/sms/target/classes>
[INFO] [dependency:copy {execution: copy}]
[INFO] Configured Artifact: org.aspectj:aspectjweaver:?:jar
[INFO] Copying aspectjweaver-1.6.1.jar to <https://builds.apache.org/job/axis2-transports-trunk/ws/transports/modules/sms/target/lib/aspectjweaver.jar>
[INFO] [resources:testResources {execution: default-testResources}]
[INFO] Using 'UTF-8' encoding to copy filtered resources.
[INFO] skip non existing resourceDirectory <https://builds.apache.org/job/axis2-transports-trunk/ws/transports/modules/sms/src/test/resources>
[INFO] Copying 3 resources
[INFO] [compiler:testCompile {execution: default-testCompile}]
[INFO] Compiling 6 source files to <https://builds.apache.org/job/axis2-transports-trunk/ws/transports/modules/sms/target/test-classes>
[WARNING] DEPRECATED [tasks]: Use target instead
[INFO] [antrun:run {execution: build-repo}]
[WARNING] Parameter tasks is deprecated, use target instead
[INFO] Executing tasks

main:
    [mkdir] Created dir: <https://builds.apache.org/job/axis2-transports-trunk/ws/transports/modules/sms/target/test-resources/samples/conf>
    [mkdir] Created dir: <https://builds.apache.org/job/axis2-transports-trunk/ws/transports/modules/sms/target/test-resources/samples/repository/modules>
    [mkdir] Created dir: <https://builds.apache.org/job/axis2-transports-trunk/ws/transports/modules/sms/target/test-resources/samples/repository/services>
    [mkdir] Created dir: <https://builds.apache.org/job/axis2-transports-trunk/ws/transports/modules/sms/target/test-resources/samples/repository/services/SampleService/org/apache/axis2/transport/sms>
    [mkdir] Created dir: <https://builds.apache.org/job/axis2-transports-trunk/ws/transports/modules/sms/target/test-resources/samples/repository/services/SampleService/META-INF>
[JENKINS] Archiving <https://builds.apache.org/job/axis2-transports-trunk/ws/transports/modules/sms/pom.xml>
to /home/hudson/hudson/jobs/axis2-transports-trunk/modules/org.apache.axis2$axis2-transport-sms/builds/2012-11-16_23-37-52/archive/org.apache.axis2/axis2-transport-sms/1.7.0-SNAPSHOT/axis2-transport-sms-1.7.0-SNAPSHOT.pom
[INFO] ------------------------------------------------------------------------
[ERROR] BUILD ERROR
[INFO] ------------------------------------------------------------------------
[INFO] An Ant BuildException has occured: Warning: Could not find file <https://builds.apache.org/job/axis2-transports-trunk/ws/.repository/org/apache/axis2/addressing/1.7.0-SNAPSHOT/addressing-1.7.0-SNAPSHOT.mar>
to copy.

[INFO] ------------------------------------------------------------------------
[INFO] For more information, run Maven with the -e switch
[INFO] ------------------------------------------------------------------------
[INFO] Total time: 30 seconds
[INFO] Finished at: Fri Nov 16 23:39:00 UTC 2012
[INFO] Final Memory: 49M/201M
[INFO] ------------------------------------------------------------------------
Waiting for Jenkins to finish collecting data
channel stopped
[locks-and-latches] Releasing all the locks
[locks-and-latches] All the locks released

---------------------------------------------------------------------
To unsubscribe, e-mail: java-dev-unsubscribe@axis.apache.org
For additional commands, e-mail: java-dev-help@axis.apache.org


Mime
View raw message