axis-java-dev mailing list archives

Site index · List index
Message view « Date » · « Thread »
Top « Date » · « Thread »
From Apache Jenkins Server <jenk...@builds.apache.org>
Subject Build failed in Jenkins: axis-trunk » Interoperability mock services #167
Date Wed, 03 Oct 2012 16:08:10 GMT
See <https://builds.apache.org/job/axis-trunk/org.apache.axis$interop-mock/167/changes>

Changes:

[veithen] * Added a couple of mock services that will be used to replace some external Web
services that are no longer available.
* Use these mock services to validate the processing of GET requests in the java.net HTTP
transport.

------------------------------------------
projectStarted org.apache.axis:interop-mock:1.4.1-SNAPSHOT
[INFO]                                                                         
[INFO] ------------------------------------------------------------------------
[INFO] Building Interoperability mock services 1.4.1-SNAPSHOT
[INFO] ------------------------------------------------------------------------
mojoStarted org.apache.maven.plugins:maven-clean-plugin:2.4.1(default-clean)
[INFO] 
[INFO] --- maven-clean-plugin:2.4.1:clean (default-clean) @ interop-mock ---
mojoSucceeded org.apache.maven.plugins:maven-clean-plugin:2.4.1(default-clean)
mojoStarted org.apache.maven.plugins:maven-enforcer-plugin:1.1.1(default)
[INFO] 
[INFO] --- maven-enforcer-plugin:1.1.1:enforce (default) @ interop-mock ---
mojoSucceeded org.apache.maven.plugins:maven-enforcer-plugin:1.1.1(default)
mojoStarted org.apache.maven.plugins:maven-remote-resources-plugin:1.1(default)
[INFO] 
[INFO] --- maven-remote-resources-plugin:1.1:process (default) @ interop-mock ---
mojoSucceeded org.apache.maven.plugins:maven-remote-resources-plugin:1.1(default)
mojoStarted org.apache.maven.plugins:maven-resources-plugin:2.4.3(default-resources)[INFO]
Using 'UTF-8' encoding to copy filtered resources.
[INFO] Copying 5 resources
[INFO] Copying 3 resources

[INFO] 
[INFO] --- maven-resources-plugin:2.4.3:resources (default-resources) @ interop-mock ---
mojoSucceeded org.apache.maven.plugins:maven-resources-plugin:2.4.3(default-resources)
mojoStarted org.apache.maven.plugins:maven-compiler-plugin:2.3.2(default-compile)
[INFO] [INFO] Compiling 5 source files to <https://builds.apache.org/job/axis-trunk/org.apache.axis$interop-mock/ws/target/classes>

[INFO] --- maven-compiler-plugin:2.3.2:compile (default-compile) @ interop-mock ---
[INFO] -------------------------------------------------------------
[ERROR] COMPILATION ERROR : 
[INFO] -------------------------------------------------------------
[ERROR] <https://builds.apache.org/job/axis-trunk/org.apache.axis$interop-mock/ws/src/main/java/org/apache/axis/test/interop/mock/MockPostHandler.java>:[25,24]
package javax.activation does not exist
[ERROR] <https://builds.apache.org/job/axis-trunk/org.apache.axis$interop-mock/ws/src/main/java/org/apache/axis/test/interop/mock/MockPostHandler.java>:[26,24]
package javax.activation does not exist
[ERROR] <https://builds.apache.org/job/axis-trunk/org.apache.axis$interop-mock/ws/src/main/java/org/apache/axis/test/interop/mock/MockPostHandler.java>:[69,8]
cannot find symbol
symbol  : class MimeType
location: class org.apache.axis.test.interop.mock.MockPostHandler
[ERROR] <https://builds.apache.org/job/axis-trunk/org.apache.axis$interop-mock/ws/src/main/java/org/apache/axis/test/interop/mock/MockPostHandler.java>:[71,37]
cannot find symbol
symbol  : class MimeType
location: class org.apache.axis.test.interop.mock.MockPostHandler
[ERROR] <https://builds.apache.org/job/axis-trunk/org.apache.axis$interop-mock/ws/src/main/java/org/apache/axis/test/interop/mock/MockPostHandler.java>:[72,17]
cannot find symbol
symbol  : class MimeTypeParseException
location: class org.apache.axis.test.interop.mock.MockPostHandler
[ERROR] <https://builds.apache.org/job/axis-trunk/org.apache.axis$interop-mock/ws/src/main/java/org/apache/axis/test/interop/mock/MockPostHandler.java>:[105,8]
cannot find symbol
symbol  : class MimeType
location: class org.apache.axis.test.interop.mock.MockPostHandler
[ERROR] <https://builds.apache.org/job/axis-trunk/org.apache.axis$interop-mock/ws/src/main/java/org/apache/axis/test/interop/mock/MockPostHandler.java>:[107,38]
cannot find symbol
symbol  : class MimeType
location: class org.apache.axis.test.interop.mock.MockPostHandler
[ERROR] <https://builds.apache.org/job/axis-trunk/org.apache.axis$interop-mock/ws/src/main/java/org/apache/axis/test/interop/mock/MockPostHandler.java>:[108,17]
cannot find symbol
symbol  : class MimeTypeParseException
location: class org.apache.axis.test.interop.mock.MockPostHandler
[INFO] 8 errors 
[INFO] -------------------------------------------------------------
mojoFailed org.apache.maven.plugins:maven-compiler-plugin:2.3.2(default-compile)
projectFailed org.apache.axis:interop-mock:1.4.1-SNAPSHOT

---------------------------------------------------------------------
To unsubscribe, e-mail: java-dev-unsubscribe@axis.apache.org
For additional commands, e-mail: java-dev-help@axis.apache.org


Mime
View raw message