axis-java-dev mailing list archives

Site index · List index
Message view « Date » · « Thread »
Top « Date » · « Thread »
From Apache Jenkins Server <jenk...@builds.apache.org>
Subject Build failed in Jenkins: axis-trunk #167
Date Wed, 03 Oct 2012 16:09:18 GMT
See <https://builds.apache.org/job/axis-trunk/167/changes>

Changes:

[veithen] * Added a couple of mock services that will be used to replace some external Web
services that are no longer available.
* Use these mock services to validate the processing of GET requests in the java.net HTTP
transport.

------------------------------------------
[...truncated 5016 lines...]
[INFO] 
[INFO] --- maven-gpg-plugin:1.1:sign (default) @ axis-castor ---
mojoSucceeded org.apache.maven.plugins:maven-gpg-plugin:1.1(default)
mojoStarted org.apache.maven.plugins:maven-install-plugin:2.3.1(default-install)[INFO] Installing
<https://builds.apache.org/job/axis-trunk/ws/axis/axis-castor/target/axis-castor-1.4.1-SNAPSHOT.jar>
to /home/jenkins/jenkins-slave/maven-repositories/1/org/apache/axis/axis-castor/1.4.1-SNAPSHOT/axis-castor-1.4.1-SNAPSHOT.jar

[INFO] 
[INFO] --- maven-install-plugin:2.3.1:install (default-install) @ axis-castor ---
[INFO] Installing <https://builds.apache.org/job/axis-trunk/ws/axis/axis-castor/pom.xml>
to /home/jenkins/jenkins-slave/maven-repositories/1/org/apache/axis/axis-castor/1.4.1-SNAPSHOT/axis-castor-1.4.1-SNAPSHOT.pom
[INFO] Installing <https://builds.apache.org/job/axis-trunk/ws/axis/axis-castor/target/axis-castor-1.4.1-SNAPSHOT-sources.jar>
to /home/jenkins/jenkins-slave/maven-repositories/1/org/apache/axis/axis-castor/1.4.1-SNAPSHOT/axis-castor-1.4.1-SNAPSHOT-sources.jar
[INFO] Installing <https://builds.apache.org/job/axis-trunk/ws/axis/axis-castor/target/axis-castor-1.4.1-SNAPSHOT-javadoc.jar>
to /home/jenkins/jenkins-slave/maven-repositories/1/org/apache/axis/axis-castor/1.4.1-SNAPSHOT/axis-castor-1.4.1-SNAPSHOT-javadoc.jar
mojoSucceeded org.apache.maven.plugins:maven-install-plugin:2.3.1(default-install)
mojoStarted org.apache.maven.plugins:maven-deploy-plugin:2.5(default-deploy)
[INFO] 
[INFO] Downloading: https://repository.apache.org/content/repositories/snapshots/org/apache/axis/axis-castor/1.4.1-SNAPSHOT/maven-metadata.xml
--- maven-deploy-plugin:2.5:deploy (default-deploy) @ axis-castor ---
Downloaded: https://repository.apache.org/content/repositories/snapshots/org/apache/axis/axis-castor/1.4.1-SNAPSHOT/maven-metadata.xml
(2 KB at 7.4 KB/sec)
Uploading: https://repository.apache.org/content/repositories/snapshots/org/apache/axis/axis-castor/1.4.1-SNAPSHOT/axis-castor-1.4.1-20121003.160752-111.jar
Uploaded: https://repository.apache.org/content/repositories/snapshots/org/apache/axis/axis-castor/1.4.1-SNAPSHOT/axis-castor-1.4.1-20121003.160752-111.jar
(19 KB at 344.3 KB/sec)
Uploading: https://repository.apache.org/content/repositories/snapshots/org/apache/axis/axis-castor/1.4.1-SNAPSHOT/axis-castor-1.4.1-20121003.160752-111.pom
Uploaded: https://repository.apache.org/content/repositories/snapshots/org/apache/axis/axis-castor/1.4.1-SNAPSHOT/axis-castor-1.4.1-20121003.160752-111.pom
(3 KB at 49.0 KB/sec)
Downloading: https://repository.apache.org/content/repositories/snapshots/org/apache/axis/axis-castor/maven-metadata.xml
Downloaded: https://repository.apache.org/content/repositories/snapshots/org/apache/axis/axis-castor/maven-metadata.xml
(286 B at 4.2 KB/sec)
Uploading: https://repository.apache.org/content/repositories/snapshots/org/apache/axis/axis-castor/1.4.1-SNAPSHOT/maven-metadata.xml
Uploaded: https://repository.apache.org/content/repositories/snapshots/org/apache/axis/axis-castor/1.4.1-SNAPSHOT/maven-metadata.xml
(2 KB at 3.6 KB/sec)
Uploading: https://repository.apache.org/content/repositories/snapshots/org/apache/axis/axis-castor/maven-metadata.xml
Uploaded: https://repository.apache.org/content/repositories/snapshots/org/apache/axis/axis-castor/maven-metadata.xml
(286 B at 2.1 KB/sec)
Uploading: https://repository.apache.org/content/repositories/snapshots/org/apache/axis/axis-castor/1.4.1-SNAPSHOT/axis-castor-1.4.1-20121003.160752-111-sources.jar
Uploaded: https://repository.apache.org/content/repositories/snapshots/org/apache/axis/axis-castor/1.4.1-SNAPSHOT/axis-castor-1.4.1-20121003.160752-111-sources.jar
(18 KB at 344.6 KB/sec)
Uploading: https://repository.apache.org/content/repositories/snapshots/org/apache/axis/axis-castor/1.4.1-SNAPSHOT/maven-metadata.xml
Uploaded: https://repository.apache.org/content/repositories/snapshots/org/apache/axis/axis-castor/1.4.1-SNAPSHOT/maven-metadata.xml
(2 KB at 24.2 KB/sec)
Uploading: https://repository.apache.org/content/repositories/snapshots/org/apache/axis/axis-castor/1.4.1-SNAPSHOT/axis-castor-1.4.1-20121003.160752-111-javadoc.jar
Uploaded: https://repository.apache.org/content/repositories/snapshots/org/apache/axis/axis-castor/1.4.1-SNAPSHOT/axis-castor-1.4.1-20121003.160752-111-javadoc.jar
(69 KB at 1152.9 KB/sec)
Uploading: https://repository.apache.org/content/repositories/snapshots/org/apache/axis/axis-castor/1.4.1-SNAPSHOT/maven-metadata.xml
Uploaded: https://repository.apache.org/content/repositories/snapshots/org/apache/axis/axis-castor/1.4.1-SNAPSHOT/maven-metadata.xml
(2 KB at 22.8 KB/sec)
mojoSucceeded org.apache.maven.plugins:maven-deploy-plugin:2.5(default-deploy)
projectSucceeded org.apache.axis:axis-castor:1.4.1-SNAPSHOT
projectStarted org.apache.axis:interop-mock:1.4.1-SNAPSHOT
[INFO]                                                                         
[INFO] ------------------------------------------------------------------------
[INFO] Building Interoperability mock services 1.4.1-SNAPSHOT
[INFO] ------------------------------------------------------------------------
mojoStarted org.apache.maven.plugins:maven-clean-plugin:2.4.1(default-clean)
[INFO] 
[INFO] --- maven-clean-plugin:2.4.1:clean (default-clean) @ interop-mock ---
mojoSucceeded org.apache.maven.plugins:maven-clean-plugin:2.4.1(default-clean)
mojoStarted org.apache.maven.plugins:maven-enforcer-plugin:1.1.1(default)
[INFO] 
[INFO] --- maven-enforcer-plugin:1.1.1:enforce (default) @ interop-mock ---
mojoSucceeded org.apache.maven.plugins:maven-enforcer-plugin:1.1.1(default)
mojoStarted org.apache.maven.plugins:maven-remote-resources-plugin:1.1(default)
[INFO] 
[INFO] --- maven-remote-resources-plugin:1.1:process (default) @ interop-mock ---
mojoSucceeded org.apache.maven.plugins:maven-remote-resources-plugin:1.1(default)
mojoStarted org.apache.maven.plugins:maven-resources-plugin:2.4.3(default-resources)[INFO]
Using 'UTF-8' encoding to copy filtered resources.
[INFO] Copying 5 resources
[INFO] Copying 3 resources

[INFO] 
[INFO] --- maven-resources-plugin:2.4.3:resources (default-resources) @ interop-mock ---
mojoSucceeded org.apache.maven.plugins:maven-resources-plugin:2.4.3(default-resources)
mojoStarted org.apache.maven.plugins:maven-compiler-plugin:2.3.2(default-compile)
[INFO] [INFO] Compiling 5 source files to <https://builds.apache.org/job/axis-trunk/ws/axis/interop-mock/target/classes>

[INFO] --- maven-compiler-plugin:2.3.2:compile (default-compile) @ interop-mock ---
[INFO] -------------------------------------------------------------
[ERROR] COMPILATION ERROR : 
[INFO] -------------------------------------------------------------
[ERROR] <https://builds.apache.org/job/axis-trunk/ws/axis/interop-mock/src/main/java/org/apache/axis/test/interop/mock/MockPostHandler.java>:[25,24]
package javax.activation does not exist
[ERROR] <https://builds.apache.org/job/axis-trunk/ws/axis/interop-mock/src/main/java/org/apache/axis/test/interop/mock/MockPostHandler.java>:[26,24]
package javax.activation does not exist
[ERROR] <https://builds.apache.org/job/axis-trunk/ws/axis/interop-mock/src/main/java/org/apache/axis/test/interop/mock/MockPostHandler.java>:[69,8]
cannot find symbol
symbol  : class MimeType
location: class org.apache.axis.test.interop.mock.MockPostHandler
[ERROR] <https://builds.apache.org/job/axis-trunk/ws/axis/interop-mock/src/main/java/org/apache/axis/test/interop/mock/MockPostHandler.java>:[71,37]
cannot find symbol
symbol  : class MimeType
location: class org.apache.axis.test.interop.mock.MockPostHandler
[ERROR] <https://builds.apache.org/job/axis-trunk/ws/axis/interop-mock/src/main/java/org/apache/axis/test/interop/mock/MockPostHandler.java>:[72,17]
cannot find symbol
symbol  : class MimeTypeParseException
location: class org.apache.axis.test.interop.mock.MockPostHandler
[ERROR] <https://builds.apache.org/job/axis-trunk/ws/axis/interop-mock/src/main/java/org/apache/axis/test/interop/mock/MockPostHandler.java>:[105,8]
cannot find symbol
symbol  : class MimeType
location: class org.apache.axis.test.interop.mock.MockPostHandler
[ERROR] <https://builds.apache.org/job/axis-trunk/ws/axis/interop-mock/src/main/java/org/apache/axis/test/interop/mock/MockPostHandler.java>:[107,38]
cannot find symbol
symbol  : class MimeType
location: class org.apache.axis.test.interop.mock.MockPostHandler
[ERROR] <https://builds.apache.org/job/axis-trunk/ws/axis/interop-mock/src/main/java/org/apache/axis/test/interop/mock/MockPostHandler.java>:[108,17]
cannot find symbol
symbol  : class MimeTypeParseException
location: class org.apache.axis.test.interop.mock.MockPostHandler
[INFO] 8 errors 
[INFO] -------------------------------------------------------------
mojoFailed org.apache.maven.plugins:maven-compiler-plugin:2.3.2(default-compile)
projectFailed org.apache.axis:interop-mock:1.4.1-SNAPSHOT
sessionEnded
[INFO] ------------------------------------------------------------------------
[INFO] Reactor Summary:
[INFO] 
[INFO] Axis .............................................. SUCCESS [44.326s]
[INFO] Axis :: SAAJ ...................................... SUCCESS [6.504s]
[INFO] Axis :: JAX-RPC ................................... SUCCESS [4.880s]
[INFO] Axis :: Core ...................................... SUCCESS [37.030s]
[INFO] Test Utilities .................................... SUCCESS [3.186s]
[INFO] Axis :: Ant tasks ................................. SUCCESS [7.000s]
[INFO] Axis :: Maven ..................................... SUCCESS [1.268s]
[INFO] Maven plugin common classes ....................... SUCCESS [3.196s]
[INFO] Axis :: Maven :: maven-wsdl2java-plugin ........... SUCCESS [12.122s]
[INFO] Axis :: Maven :: maven-java2wsdl-plugin ........... SUCCESS [3.857s]
[INFO] Axis :: Maven :: maven-axis-server-plugin ......... SUCCESS [4.940s]
[INFO] Axis :: Stand-alone server ........................ SUCCESS [4.066s]
[INFO] Axis :: Castor support ............................ SUCCESS [4.349s]
[INFO] Interoperability mock services .................... FAILURE [1.129s]
[INFO] Axis :: java.net HTTP Transport ................... SKIPPED
[INFO] Axis :: JMS transport ............................. SKIPPED
[INFO] Axis :: Integration tests ......................... SKIPPED
[INFO] Axis :: WAR ....................................... SKIPPED
[INFO] Samples ........................................... SKIPPED
[INFO] Attachments Sample ................................ SKIPPED
[INFO] Bidbuy Sample ..................................... SKIPPED
[INFO] Echo Sample ....................................... SKIPPED
[INFO] Encoding Sample ................................... SKIPPED
[INFO] Faults Sample ..................................... SKIPPED
[INFO] Handler Sample .................................... SKIPPED
[INFO] Integration Guide Sample .......................... SKIPPED
[INFO] JAXM Sample ....................................... SKIPPED
[INFO] Stock Quote Sample ................................ SKIPPED
[INFO] JAX-RPC Sample .................................... SKIPPED
[INFO] Message Sample .................................... SKIPPED
[INFO] MTOM Stub Sample .................................. SKIPPED
[INFO] Misc Sample ....................................... SKIPPED
[INFO] Transport Sample .................................. SKIPPED
[INFO] Proxy Sample ...................................... SKIPPED
[INFO] Distribution ...................................... SKIPPED
[INFO] ------------------------------------------------------------------------
[INFO] BUILD FAILURE
[INFO] ------------------------------------------------------------------------
[INFO] Total time: 2:19.562s
[INFO] Finished at: Wed Oct 03 16:07:54 GMT 2012
[INFO] Final Memory: 46M/210M
[INFO] ------------------------------------------------------------------------
Projects to build: [MavenProject: org.apache.axis:axis-project:1.4.1-SNAPSHOT @ <https://builds.apache.org/job/axis-trunk/ws/axis/pom.xml,>
MavenProject: org.apache.axis:axis-saaj:1.4.1-SNAPSHOT @ <https://builds.apache.org/job/axis-trunk/ws/axis/axis-saaj/pom.xml,>
MavenProject: org.apache.axis:axis-jaxrpc:1.4.1-SNAPSHOT @ <https://builds.apache.org/job/axis-trunk/ws/axis/axis-jaxrpc/pom.xml,>
MavenProject: org.apache.axis:axis:1.4.1-SNAPSHOT @ <https://builds.apache.org/job/axis-trunk/ws/axis/axis/pom.xml,>
MavenProject: org.apache.axis:axis-testutils:1.4.1-SNAPSHOT @ <https://builds.apache.org/job/axis-trunk/ws/axis/axis-testutils/pom.xml,>
MavenProject: org.apache.axis:axis-ant:1.4.1-SNAPSHOT @ <https://builds.apache.org/job/axis-trunk/ws/axis/axis-ant/pom.xml,>
MavenProject: org.apache.axis:maven:1.4.1-SNAPSHOT @ <https://builds.apache.org/job/axis-trunk/ws/axis/maven/pom.xml,>
MavenProject: org.apache.axis:nsmap:1.4.1-SNAPSHOT @ <https://builds.apache.org/job/axis-trunk/ws/axis/maven/nsmap/pom.xml,>
MavenProject: org.apache.axis:maven-wsdl2java-plugin:1.4.1-SNAPSHOT @ <https://builds.apache.org/job/axis-trunk/ws/axis/maven/maven-wsdl2java-plugin/pom.xml,>
MavenProject: org.apache.axis:maven-java2wsdl-plugin:1.4.1-SNAPSHOT @ <https://builds.apache.org/job/axis-trunk/ws/axis/maven/maven-java2wsdl-plugin/pom.xml,>
MavenProject: org.apache.axis:maven-axis-server-plugin:1.4.1-SNAPSHOT @ <https://builds.apache.org/job/axis-trunk/ws/axis/maven/maven-axis-server-plugin/pom.xml,>
MavenProject: org.apache.axis:axis-standalone-server:1.4.1-SNAPSHOT @ <https://builds.apache.org/job/axis-trunk/ws/axis/axis-standalone-server/pom.xml,>
MavenProject: org.apache.axis:axis-castor:1.4.1-SNAPSHOT @ <https://builds.apache.org/job/axis-trunk/ws/axis/axis-castor/pom.xml,>
MavenProject: org.apache.axis:interop-mock:1.4.1-SNAPSHOT @ <https://builds.apache.org/job/axis-trunk/ws/axis/interop-mock/pom.xml,>
MavenProject: org.apache.axis:axis-rt-transports-http-javanet:1.4.1-SNAPSHOT @ <https://builds.apache.org/job/axis-trunk/ws/axis/axis-rt-transports-http-javanet/pom.xml,>
MavenProject: org.apache.axis:axis-jms:1.4.1-SNAPSHOT @ <https://builds.apache.org/job/axis-trunk/ws/axis/axis-jms/pom.xml,>
MavenProject: org.apache.axis:integration:1.4.1-SNAPSHOT @ <https://builds.apache.org/job/axis-trunk/ws/axis/integration/pom.xml,>
MavenProject: org.apache.axis:axis-war:1.4.1-SNAPSHOT @ <https://builds.apache.org/job/axis-trunk/ws/axis/axis-war/pom.xml,>
MavenProject: org.apache.axis:samples:1.4.1-SNAPSHOT @ <https://builds.apache.org/job/axis-trunk/ws/axis/samples/pom.xml,>
MavenProject: org.apache.axis:attachments-sample:1.4.1-SNAPSHOT @ <https://builds.apache.org/job/axis-trunk/ws/axis/samples/attachments-sample/pom.xml,>
MavenProject: org.apache.axis:bidbuy-sample:1.4.1-SNAPSHOT @ <https://builds.apache.org/job/axis-trunk/ws/axis/samples/bidbuy-sample/pom.xml,>
MavenProject: org.apache.axis:echo-sample:1.4.1-SNAPSHOT @ <https://builds.apache.org/job/axis-trunk/ws/axis/samples/echo-sample/pom.xml,>
MavenProject: org.apache.axis:encoding-sample:1.4.1-SNAPSHOT @ <https://builds.apache.org/job/axis-trunk/ws/axis/samples/encoding-sample/pom.xml,>
MavenProject: org.apache.axis:faults-sample:1.4.1-SNAPSHOT @ <https://builds.apache.org/job/axis-trunk/ws/axis/samples/faults-sample/pom.xml,>
MavenProject: org.apache.axis:handler-sample:1.4.1-SNAPSHOT @ <https://builds.apache.org/job/axis-trunk/ws/axis/samples/handler-sample/pom.xml,>
MavenProject: org.apache.axis:integrationguide-sample:1.4.1-SNAPSHOT @ <https://builds.apache.org/job/axis-trunk/ws/axis/samples/integrationguide-sample/pom.xml,>
MavenProject: org.apache.axis:jaxm-sample:1.4.1-SNAPSHOT @ <https://builds.apache.org/job/axis-trunk/ws/axis/samples/jaxm-sample/pom.xml,>
MavenProject: org.apache.axis:stock-sample:1.4.1-SNAPSHOT @ <https://builds.apache.org/job/axis-trunk/ws/axis/samples/stock-sample/pom.xml,>
MavenProject: org.apache.axis:jaxrpc-sample:1.4.1-SNAPSHOT @ <https://builds.apache.org/job/axis-trunk/ws/axis/samples/jaxrpc-sample/pom.xml,>
MavenProject: org.apache.axis:message-sample:1.4.1-SNAPSHOT @ <https://builds.apache.org/job/axis-trunk/ws/axis/samples/message-sample/pom.xml,>
MavenProject: org.apache.axis:mtomstub-sample:1.4.1-SNAPSHOT @ <https://builds.apache.org/job/axis-trunk/ws/axis/samples/mtomstub-sample/pom.xml,>
MavenProject: org.apache.axis:misc-sample:1.4.1-SNAPSHOT @ <https://builds.apache.org/job/axis-trunk/ws/axis/samples/misc-sample/pom.xml,>
MavenProject: org.apache.axis:transport-sample:1.4.1-SNAPSHOT @ <https://builds.apache.org/job/axis-trunk/ws/axis/samples/transport-sample/pom.xml,>
MavenProject: org.apache.axis:proxy-sample:1.4.1-SNAPSHOT @ <https://builds.apache.org/job/axis-trunk/ws/axis/samples/proxy-sample/pom.xml,>
MavenProject: org.apache.axis:distribution:1.4.1-SNAPSHOT @ <https://builds.apache.org/job/axis-trunk/ws/axis/distribution/pom.xml]>
[JENKINS] Archiving <https://builds.apache.org/job/axis-trunk/ws/axis/samples/jaxrpc-sample/pom.xml>
to /home/hudson/hudson/jobs/axis-trunk/modules/org.apache.axis$jaxrpc-sample/builds/2012-10-03_16-05-29/archive/org.apache.axis/jaxrpc-sample/1.4.1-SNAPSHOT/jaxrpc-sample-1.4.1-SNAPSHOT.pom
[JENKINS] Archiving <https://builds.apache.org/job/axis-trunk/ws/axis/samples/integrationguide-sample/pom.xml>
to /home/hudson/hudson/jobs/axis-trunk/modules/org.apache.axis$integrationguide-sample/builds/2012-10-03_16-05-29/archive/org.apache.axis/integrationguide-sample/1.4.1-SNAPSHOT/integrationguide-sample-1.4.1-SNAPSHOT.pom
[JENKINS] Archiving <https://builds.apache.org/job/axis-trunk/ws/axis/samples/handler-sample/pom.xml>
to /home/hudson/hudson/jobs/axis-trunk/modules/org.apache.axis$handler-sample/builds/2012-10-03_16-05-29/archive/org.apache.axis/handler-sample/1.4.1-SNAPSHOT/handler-sample-1.4.1-SNAPSHOT.pom
[JENKINS] Archiving <https://builds.apache.org/job/axis-trunk/ws/axis/interop-mock/pom.xml>
to /home/hudson/hudson/jobs/axis-trunk/modules/org.apache.axis$interop-mock/builds/2012-10-03_16-05-29/archive/org.apache.axis/interop-mock/1.4.1-SNAPSHOT/interop-mock-1.4.1-SNAPSHOT.pom
[JENKINS] Archiving <https://builds.apache.org/job/axis-trunk/ws/axis/samples/proxy-sample/pom.xml>
to /home/hudson/hudson/jobs/axis-trunk/modules/org.apache.axis$proxy-sample/builds/2012-10-03_16-05-29/archive/org.apache.axis/proxy-sample/1.4.1-SNAPSHOT/proxy-sample-1.4.1-SNAPSHOT.pom
[JENKINS] Archiving <https://builds.apache.org/job/axis-trunk/ws/axis/integration/pom.xml>
to /home/hudson/hudson/jobs/axis-trunk/modules/org.apache.axis$integration/builds/2012-10-03_16-05-29/archive/org.apache.axis/integration/1.4.1-SNAPSHOT/integration-1.4.1-SNAPSHOT.pom
[JENKINS] Archiving <https://builds.apache.org/job/axis-trunk/ws/axis/samples/encoding-sample/pom.xml>
to /home/hudson/hudson/jobs/axis-trunk/modules/org.apache.axis$encoding-sample/builds/2012-10-03_16-05-29/archive/org.apache.axis/encoding-sample/1.4.1-SNAPSHOT/encoding-sample-1.4.1-SNAPSHOT.pom
[JENKINS] Archiving <https://builds.apache.org/job/axis-trunk/ws/axis/samples/pom.xml>
to /home/hudson/hudson/jobs/axis-trunk/modules/org.apache.axis$samples/builds/2012-10-03_16-05-29/archive/org.apache.axis/samples/1.4.1-SNAPSHOT/samples-1.4.1-SNAPSHOT.pom
[JENKINS] Archiving <https://builds.apache.org/job/axis-trunk/ws/axis/distribution/pom.xml>
to /home/hudson/hudson/jobs/axis-trunk/modules/org.apache.axis$distribution/builds/2012-10-03_16-05-30/archive/org.apache.axis/distribution/1.4.1-SNAPSHOT/distribution-1.4.1-SNAPSHOT.pom
[JENKINS] Archiving <https://builds.apache.org/job/axis-trunk/ws/axis/pom.xml> to /home/hudson/hudson/jobs/axis-trunk/modules/org.apache.axis$axis-project/builds/2012-10-03_16-05-29/archive/org.apache.axis/axis-project/1.4.1-SNAPSHOT/axis-project-1.4.1-SNAPSHOT.pom
[JENKINS] Archiving <https://builds.apache.org/job/axis-trunk/ws/axis/target/axis-project-1.4.1-SNAPSHOT-source-release.zip>
to /home/hudson/hudson/jobs/axis-trunk/modules/org.apache.axis$axis-project/builds/2012-10-03_16-05-29/archive/org.apache.axis/axis-project/1.4.1-20121003.160619-163/axis-project-1.4.1-20121003.160619-163-source-release.zip
[JENKINS] Archiving <https://builds.apache.org/job/axis-trunk/ws/axis/samples/faults-sample/pom.xml>
to /home/hudson/hudson/jobs/axis-trunk/modules/org.apache.axis$faults-sample/builds/2012-10-03_16-05-29/archive/org.apache.axis/faults-sample/1.4.1-SNAPSHOT/faults-sample-1.4.1-SNAPSHOT.pom
[JENKINS] Archiving <https://builds.apache.org/job/axis-trunk/ws/axis/samples/stock-sample/pom.xml>
to /home/hudson/hudson/jobs/axis-trunk/modules/org.apache.axis$stock-sample/builds/2012-10-03_16-05-30/archive/org.apache.axis/stock-sample/1.4.1-SNAPSHOT/stock-sample-1.4.1-SNAPSHOT.pom
[JENKINS] Archiving <https://builds.apache.org/job/axis-trunk/ws/axis/samples/echo-sample/pom.xml>
to /home/hudson/hudson/jobs/axis-trunk/modules/org.apache.axis$echo-sample/builds/2012-10-03_16-05-29/archive/org.apache.axis/echo-sample/1.4.1-SNAPSHOT/echo-sample-1.4.1-SNAPSHOT.pom
[JENKINS] Archiving <https://builds.apache.org/job/axis-trunk/ws/axis/samples/attachments-sample/pom.xml>
to /home/hudson/hudson/jobs/axis-trunk/modules/org.apache.axis$attachments-sample/builds/2012-10-03_16-05-29/archive/org.apache.axis/attachments-sample/1.4.1-SNAPSHOT/attachments-sample-1.4.1-SNAPSHOT.pom
[JENKINS] Archiving <https://builds.apache.org/job/axis-trunk/ws/axis/maven/maven-wsdl2java-plugin/pom.xml>
to /home/hudson/hudson/jobs/axis-trunk/modules/org.apache.axis$maven-wsdl2java-plugin/builds/2012-10-03_16-05-29/archive/org.apache.axis/maven-wsdl2java-plugin/1.4.1-SNAPSHOT/maven-wsdl2java-plugin-1.4.1-SNAPSHOT.pom
[JENKINS] Archiving <https://builds.apache.org/job/axis-trunk/ws/axis/maven/maven-wsdl2java-plugin/target/maven-wsdl2java-plugin-1.4.1-SNAPSHOT.jar>
to /home/hudson/hudson/jobs/axis-trunk/modules/org.apache.axis$maven-wsdl2java-plugin/builds/2012-10-03_16-05-29/archive/org.apache.axis/maven-wsdl2java-plugin/1.4.1-20121003.160735-69/maven-wsdl2java-plugin-1.4.1-20121003.160735-69.jar
[JENKINS] Archiving <https://builds.apache.org/job/axis-trunk/ws/axis/maven/maven-wsdl2java-plugin/target/maven-wsdl2java-plugin-1.4.1-SNAPSHOT-sources.jar>
to /home/hudson/hudson/jobs/axis-trunk/modules/org.apache.axis$maven-wsdl2java-plugin/builds/2012-10-03_16-05-29/archive/org.apache.axis/maven-wsdl2java-plugin/1.4.1-20121003.160735-69/maven-wsdl2java-plugin-1.4.1-20121003.160735-69-sources.jar
[JENKINS] Archiving <https://builds.apache.org/job/axis-trunk/ws/axis/maven/maven-wsdl2java-plugin/target/maven-wsdl2java-plugin-1.4.1-SNAPSHOT-javadoc.jar>
to /home/hudson/hudson/jobs/axis-trunk/modules/org.apache.axis$maven-wsdl2java-plugin/builds/2012-10-03_16-05-29/archive/org.apache.axis/maven-wsdl2java-plugin/1.4.1-20121003.160735-69/maven-wsdl2java-plugin-1.4.1-20121003.160735-69-javadoc.jar
[JENKINS] Archiving <https://builds.apache.org/job/axis-trunk/ws/axis/axis-jaxrpc/pom.xml>
to /home/hudson/hudson/jobs/axis-trunk/modules/org.apache.axis$axis-jaxrpc/builds/2012-10-03_16-05-29/archive/org.apache.axis/axis-jaxrpc/1.4.1-SNAPSHOT/axis-jaxrpc-1.4.1-SNAPSHOT.pom
[JENKINS] Archiving <https://builds.apache.org/job/axis-trunk/ws/axis/axis-jaxrpc/target/axis-jaxrpc-1.4.1-SNAPSHOT.jar>
to /home/hudson/hudson/jobs/axis-trunk/modules/org.apache.axis$axis-jaxrpc/builds/2012-10-03_16-05-29/archive/org.apache.axis/axis-jaxrpc/1.4.1-20121003.160631-161/axis-jaxrpc-1.4.1-20121003.160631-161.jar
[JENKINS] Archiving <https://builds.apache.org/job/axis-trunk/ws/axis/axis-jaxrpc/target/axis-jaxrpc-1.4.1-SNAPSHOT-sources.jar>
to /home/hudson/hudson/jobs/axis-trunk/modules/org.apache.axis$axis-jaxrpc/builds/2012-10-03_16-05-29/archive/org.apache.axis/axis-jaxrpc/1.4.1-20121003.160631-161/axis-jaxrpc-1.4.1-20121003.160631-161-sources.jar
[JENKINS] Archiving <https://builds.apache.org/job/axis-trunk/ws/axis/axis-jaxrpc/target/axis-jaxrpc-1.4.1-SNAPSHOT-javadoc.jar>
to /home/hudson/hudson/jobs/axis-trunk/modules/org.apache.axis$axis-jaxrpc/builds/2012-10-03_16-05-29/archive/org.apache.axis/axis-jaxrpc/1.4.1-20121003.160631-161/axis-jaxrpc-1.4.1-20121003.160631-161-javadoc.jar
[JENKINS] Archiving <https://builds.apache.org/job/axis-trunk/ws/axis/samples/bidbuy-sample/pom.xml>
to /home/hudson/hudson/jobs/axis-trunk/modules/org.apache.axis$bidbuy-sample/builds/2012-10-03_16-05-29/archive/org.apache.axis/bidbuy-sample/1.4.1-SNAPSHOT/bidbuy-sample-1.4.1-SNAPSHOT.pom
[JENKINS] Archiving <https://builds.apache.org/job/axis-trunk/ws/axis/axis/pom.xml>
to /home/hudson/hudson/jobs/axis-trunk/modules/org.apache.axis$axis/builds/2012-10-03_16-05-29/archive/org.apache.axis/axis/1.4.1-SNAPSHOT/axis-1.4.1-SNAPSHOT.pom
[JENKINS] Archiving <https://builds.apache.org/job/axis-trunk/ws/axis/axis/target/axis-1.4.1-SNAPSHOT.jar>
to /home/hudson/hudson/jobs/axis-trunk/modules/org.apache.axis$axis/builds/2012-10-03_16-05-29/archive/org.apache.axis/axis/1.4.1-20121003.160707-157/axis-1.4.1-20121003.160707-157.jar
[JENKINS] Archiving <https://builds.apache.org/job/axis-trunk/ws/axis/axis/target/axis-1.4.1-SNAPSHOT-sources.jar>
to /home/hudson/hudson/jobs/axis-trunk/modules/org.apache.axis$axis/builds/2012-10-03_16-05-29/archive/org.apache.axis/axis/1.4.1-20121003.160707-157/axis-1.4.1-20121003.160707-157-sources.jar
[JENKINS] Archiving <https://builds.apache.org/job/axis-trunk/ws/axis/axis/target/axis-1.4.1-SNAPSHOT-javadoc.jar>
to /home/hudson/hudson/jobs/axis-trunk/modules/org.apache.axis$axis/builds/2012-10-03_16-05-29/archive/org.apache.axis/axis/1.4.1-20121003.160707-157/axis-1.4.1-20121003.160707-157-javadoc.jar
[JENKINS] Archiving <https://builds.apache.org/job/axis-trunk/ws/axis/samples/jaxm-sample/pom.xml>
to /home/hudson/hudson/jobs/axis-trunk/modules/org.apache.axis$jaxm-sample/builds/2012-10-03_16-05-29/archive/org.apache.axis/jaxm-sample/1.4.1-SNAPSHOT/jaxm-sample-1.4.1-SNAPSHOT.pom
[JENKINS] Archiving <https://builds.apache.org/job/axis-trunk/ws/axis/axis-standalone-server/pom.xml>
to /home/hudson/hudson/jobs/axis-trunk/modules/org.apache.axis$axis-standalone-server/builds/2012-10-03_16-05-29/archive/org.apache.axis/axis-standalone-server/1.4.1-SNAPSHOT/axis-standalone-server-1.4.1-SNAPSHOT.pom
[JENKINS] Archiving <https://builds.apache.org/job/axis-trunk/ws/axis/axis-standalone-server/target/axis-standalone-server-1.4.1-SNAPSHOT.jar>
to /home/hudson/hudson/jobs/axis-trunk/modules/org.apache.axis$axis-standalone-server/builds/2012-10-03_16-05-29/archive/org.apache.axis/axis-standalone-server/1.4.1-20121003.160748-115/axis-standalone-server-1.4.1-20121003.160748-115.jar
[JENKINS] Archiving <https://builds.apache.org/job/axis-trunk/ws/axis/axis-standalone-server/target/axis-standalone-server-1.4.1-SNAPSHOT-sources.jar>
to /home/hudson/hudson/jobs/axis-trunk/modules/org.apache.axis$axis-standalone-server/builds/2012-10-03_16-05-29/archive/org.apache.axis/axis-standalone-server/1.4.1-20121003.160748-115/axis-standalone-server-1.4.1-20121003.160748-115-sources.jar
[JENKINS] Archiving <https://builds.apache.org/job/axis-trunk/ws/axis/axis-standalone-server/target/axis-standalone-server-1.4.1-SNAPSHOT-javadoc.jar>
to /home/hudson/hudson/jobs/axis-trunk/modules/org.apache.axis$axis-standalone-server/builds/2012-10-03_16-05-29/archive/org.apache.axis/axis-standalone-server/1.4.1-20121003.160748-115/axis-standalone-server-1.4.1-20121003.160748-115-javadoc.jar
[JENKINS] Archiving <https://builds.apache.org/job/axis-trunk/ws/axis/maven/maven-axis-server-plugin/pom.xml>
to /home/hudson/hudson/jobs/axis-trunk/modules/org.apache.axis$maven-axis-server-plugin/builds/2012-10-03_16-05-29/archive/org.apache.axis/maven-axis-server-plugin/1.4.1-SNAPSHOT/maven-axis-server-plugin-1.4.1-SNAPSHOT.pom
[JENKINS] Archiving <https://builds.apache.org/job/axis-trunk/ws/axis/maven/maven-axis-server-plugin/target/maven-axis-server-plugin-1.4.1-SNAPSHOT.jar>
to /home/hudson/hudson/jobs/axis-trunk/modules/org.apache.axis$maven-axis-server-plugin/builds/2012-10-03_16-05-29/archive/org.apache.axis/maven-axis-server-plugin/1.4.1-20121003.160743-69/maven-axis-server-plugin-1.4.1-20121003.160743-69.jar
[JENKINS] Archiving <https://builds.apache.org/job/axis-trunk/ws/axis/maven/maven-axis-server-plugin/target/maven-axis-server-plugin-1.4.1-SNAPSHOT-sources.jar>
to /home/hudson/hudson/jobs/axis-trunk/modules/org.apache.axis$maven-axis-server-plugin/builds/2012-10-03_16-05-29/archive/org.apache.axis/maven-axis-server-plugin/1.4.1-20121003.160743-69/maven-axis-server-plugin-1.4.1-20121003.160743-69-sources.jar
[JENKINS] Archiving <https://builds.apache.org/job/axis-trunk/ws/axis/maven/maven-axis-server-plugin/target/maven-axis-server-plugin-1.4.1-SNAPSHOT-javadoc.jar>
to /home/hudson/hudson/jobs/axis-trunk/modules/org.apache.axis$maven-axis-server-plugin/builds/2012-10-03_16-05-29/archive/org.apache.axis/maven-axis-server-plugin/1.4.1-20121003.160743-69/maven-axis-server-plugin-1.4.1-20121003.160743-69-javadoc.jar
[JENKINS] Archiving <https://builds.apache.org/job/axis-trunk/ws/axis/axis-ant/pom.xml>
to /home/hudson/hudson/jobs/axis-trunk/modules/org.apache.axis$axis-ant/builds/2012-10-03_16-05-29/archive/org.apache.axis/axis-ant/1.4.1-SNAPSHOT/axis-ant-1.4.1-SNAPSHOT.pom
[JENKINS] Archiving <https://builds.apache.org/job/axis-trunk/ws/axis/axis-ant/target/axis-ant-1.4.1-SNAPSHOT.jar>
to /home/hudson/hudson/jobs/axis-trunk/modules/org.apache.axis$axis-ant/builds/2012-10-03_16-05-29/archive/org.apache.axis/axis-ant/1.4.1-20121003.160718-151/axis-ant-1.4.1-20121003.160718-151.jar
[JENKINS] Archiving <https://builds.apache.org/job/axis-trunk/ws/axis/axis-ant/target/axis-ant-1.4.1-SNAPSHOT-sources.jar>
to /home/hudson/hudson/jobs/axis-trunk/modules/org.apache.axis$axis-ant/builds/2012-10-03_16-05-29/archive/org.apache.axis/axis-ant/1.4.1-20121003.160718-151/axis-ant-1.4.1-20121003.160718-151-sources.jar
[JENKINS] Archiving <https://builds.apache.org/job/axis-trunk/ws/axis/axis-ant/target/axis-ant-1.4.1-SNAPSHOT-javadoc.jar>
to /home/hudson/hudson/jobs/axis-trunk/modules/org.apache.axis$axis-ant/builds/2012-10-03_16-05-29/archive/org.apache.axis/axis-ant/1.4.1-20121003.160718-151/axis-ant-1.4.1-20121003.160718-151-javadoc.jar
[JENKINS] Archiving <https://builds.apache.org/job/axis-trunk/ws/axis/axis-castor/pom.xml>
to /home/hudson/hudson/jobs/axis-trunk/modules/org.apache.axis$axis-castor/builds/2012-10-03_16-05-29/archive/org.apache.axis/axis-castor/1.4.1-SNAPSHOT/axis-castor-1.4.1-SNAPSHOT.pom
[JENKINS] Archiving <https://builds.apache.org/job/axis-trunk/ws/axis/axis-castor/target/axis-castor-1.4.1-SNAPSHOT.jar>
to /home/hudson/hudson/jobs/axis-trunk/modules/org.apache.axis$axis-castor/builds/2012-10-03_16-05-29/archive/org.apache.axis/axis-castor/1.4.1-20121003.160752-111/axis-castor-1.4.1-20121003.160752-111.jar
[JENKINS] Archiving <https://builds.apache.org/job/axis-trunk/ws/axis/axis-castor/target/axis-castor-1.4.1-SNAPSHOT-sources.jar>
to /home/hudson/hudson/jobs/axis-trunk/modules/org.apache.axis$axis-castor/builds/2012-10-03_16-05-29/archive/org.apache.axis/axis-castor/1.4.1-20121003.160752-111/axis-castor-1.4.1-20121003.160752-111-sources.jar
[JENKINS] Archiving <https://builds.apache.org/job/axis-trunk/ws/axis/axis-castor/target/axis-castor-1.4.1-SNAPSHOT-javadoc.jar>
to /home/hudson/hudson/jobs/axis-trunk/modules/org.apache.axis$axis-castor/builds/2012-10-03_16-05-29/archive/org.apache.axis/axis-castor/1.4.1-20121003.160752-111/axis-castor-1.4.1-20121003.160752-111-javadoc.jar
[JENKINS] Archiving <https://builds.apache.org/job/axis-trunk/ws/axis/axis-war/pom.xml>
to /home/hudson/hudson/jobs/axis-trunk/modules/org.apache.axis$axis-war/builds/2012-10-03_16-05-29/archive/org.apache.axis/axis-war/1.4.1-SNAPSHOT/axis-war-1.4.1-SNAPSHOT.pom
[JENKINS] Archiving <https://builds.apache.org/job/axis-trunk/ws/axis/maven/maven-java2wsdl-plugin/pom.xml>
to /home/hudson/hudson/jobs/axis-trunk/modules/org.apache.axis$maven-java2wsdl-plugin/builds/2012-10-03_16-05-29/archive/org.apache.axis/maven-java2wsdl-plugin/1.4.1-SNAPSHOT/maven-java2wsdl-plugin-1.4.1-SNAPSHOT.pom
[JENKINS] Archiving <https://builds.apache.org/job/axis-trunk/ws/axis/maven/maven-java2wsdl-plugin/target/maven-java2wsdl-plugin-1.4.1-SNAPSHOT.jar>
to /home/hudson/hudson/jobs/axis-trunk/modules/org.apache.axis$maven-java2wsdl-plugin/builds/2012-10-03_16-05-29/archive/org.apache.axis/maven-java2wsdl-plugin/1.4.1-20121003.160739-58/maven-java2wsdl-plugin-1.4.1-20121003.160739-58.jar
[JENKINS] Archiving <https://builds.apache.org/job/axis-trunk/ws/axis/maven/maven-java2wsdl-plugin/target/maven-java2wsdl-plugin-1.4.1-SNAPSHOT-sources.jar>
to /home/hudson/hudson/jobs/axis-trunk/modules/org.apache.axis$maven-java2wsdl-plugin/builds/2012-10-03_16-05-29/archive/org.apache.axis/maven-java2wsdl-plugin/1.4.1-20121003.160739-58/maven-java2wsdl-plugin-1.4.1-20121003.160739-58-sources.jar
[JENKINS] Archiving <https://builds.apache.org/job/axis-trunk/ws/axis/maven/maven-java2wsdl-plugin/target/maven-java2wsdl-plugin-1.4.1-SNAPSHOT-javadoc.jar>
to /home/hudson/hudson/jobs/axis-trunk/modules/org.apache.axis$maven-java2wsdl-plugin/builds/2012-10-03_16-05-29/archive/org.apache.axis/maven-java2wsdl-plugin/1.4.1-20121003.160739-58/maven-java2wsdl-plugin-1.4.1-20121003.160739-58-javadoc.jar
[JENKINS] Archiving <https://builds.apache.org/job/axis-trunk/ws/axis/samples/mtomstub-sample/pom.xml>
to /home/hudson/hudson/jobs/axis-trunk/modules/org.apache.axis$mtomstub-sample/builds/2012-10-03_16-05-29/archive/org.apache.axis/mtomstub-sample/1.4.1-SNAPSHOT/mtomstub-sample-1.4.1-SNAPSHOT.pom
[JENKINS] Archiving <https://builds.apache.org/job/axis-trunk/ws/axis/axis-jms/pom.xml>
to /home/hudson/hudson/jobs/axis-trunk/modules/org.apache.axis$axis-jms/builds/2012-10-03_16-05-29/archive/org.apache.axis/axis-jms/1.4.1-SNAPSHOT/axis-jms-1.4.1-SNAPSHOT.pom
[JENKINS] Archiving <https://builds.apache.org/job/axis-trunk/ws/axis/samples/transport-sample/pom.xml>
to /home/hudson/hudson/jobs/axis-trunk/modules/org.apache.axis$transport-sample/builds/2012-10-03_16-05-30/archive/org.apache.axis/transport-sample/1.4.1-SNAPSHOT/transport-sample-1.4.1-SNAPSHOT.pom
[JENKINS] Archiving <https://builds.apache.org/job/axis-trunk/ws/axis/samples/message-sample/pom.xml>
to /home/hudson/hudson/jobs/axis-trunk/modules/org.apache.axis$message-sample/builds/2012-10-03_16-05-29/archive/org.apache.axis/message-sample/1.4.1-SNAPSHOT/message-sample-1.4.1-SNAPSHOT.pom
[JENKINS] Archiving <https://builds.apache.org/job/axis-trunk/ws/axis/samples/misc-sample/pom.xml>
to /home/hudson/hudson/jobs/axis-trunk/modules/org.apache.axis$misc-sample/builds/2012-10-03_16-05-29/archive/org.apache.axis/misc-sample/1.4.1-SNAPSHOT/misc-sample-1.4.1-SNAPSHOT.pom
[JENKINS] Archiving <https://builds.apache.org/job/axis-trunk/ws/axis/maven/nsmap/pom.xml>
to /home/hudson/hudson/jobs/axis-trunk/modules/org.apache.axis$nsmap/builds/2012-10-03_16-05-29/archive/org.apache.axis/nsmap/1.4.1-SNAPSHOT/nsmap-1.4.1-SNAPSHOT.pom
[JENKINS] Archiving <https://builds.apache.org/job/axis-trunk/ws/axis/maven/nsmap/target/nsmap-1.4.1-SNAPSHOT.jar>
to /home/hudson/hudson/jobs/axis-trunk/modules/org.apache.axis$nsmap/builds/2012-10-03_16-05-29/archive/org.apache.axis/nsmap/1.4.1-20121003.160723-60/nsmap-1.4.1-20121003.160723-60.jar
[JENKINS] Archiving <https://builds.apache.org/job/axis-trunk/ws/axis/maven/nsmap/target/nsmap-1.4.1-SNAPSHOT-sources.jar>
to /home/hudson/hudson/jobs/axis-trunk/modules/org.apache.axis$nsmap/builds/2012-10-03_16-05-29/archive/org.apache.axis/nsmap/1.4.1-20121003.160723-60/nsmap-1.4.1-20121003.160723-60-sources.jar
[JENKINS] Archiving <https://builds.apache.org/job/axis-trunk/ws/axis/maven/nsmap/target/nsmap-1.4.1-SNAPSHOT-javadoc.jar>
to /home/hudson/hudson/jobs/axis-trunk/modules/org.apache.axis$nsmap/builds/2012-10-03_16-05-29/archive/org.apache.axis/nsmap/1.4.1-20121003.160723-60/nsmap-1.4.1-20121003.160723-60-javadoc.jar
[JENKINS] Archiving <https://builds.apache.org/job/axis-trunk/ws/axis/axis-saaj/pom.xml>
to /home/hudson/hudson/jobs/axis-trunk/modules/org.apache.axis$axis-saaj/builds/2012-10-03_16-05-29/archive/org.apache.axis/axis-saaj/1.4.1-SNAPSHOT/axis-saaj-1.4.1-SNAPSHOT.pom
[JENKINS] Archiving <https://builds.apache.org/job/axis-trunk/ws/axis/axis-saaj/target/axis-saaj-1.4.1-SNAPSHOT.jar>
to /home/hudson/hudson/jobs/axis-trunk/modules/org.apache.axis$axis-saaj/builds/2012-10-03_16-05-29/archive/org.apache.axis/axis-saaj/1.4.1-20121003.160626-161/axis-saaj-1.4.1-20121003.160626-161.jar
[JENKINS] Archiving <https://builds.apache.org/job/axis-trunk/ws/axis/axis-saaj/target/axis-saaj-1.4.1-SNAPSHOT-sources.jar>
to /home/hudson/hudson/jobs/axis-trunk/modules/org.apache.axis$axis-saaj/builds/2012-10-03_16-05-29/archive/org.apache.axis/axis-saaj/1.4.1-20121003.160626-161/axis-saaj-1.4.1-20121003.160626-161-sources.jar
[JENKINS] Archiving <https://builds.apache.org/job/axis-trunk/ws/axis/axis-saaj/target/axis-saaj-1.4.1-SNAPSHOT-javadoc.jar>
to /home/hudson/hudson/jobs/axis-trunk/modules/org.apache.axis$axis-saaj/builds/2012-10-03_16-05-29/archive/org.apache.axis/axis-saaj/1.4.1-20121003.160626-161/axis-saaj-1.4.1-20121003.160626-161-javadoc.jar
[JENKINS] Archiving <https://builds.apache.org/job/axis-trunk/ws/axis/axis-rt-transports-http-javanet/pom.xml>
to /home/hudson/hudson/jobs/axis-trunk/modules/org.apache.axis$axis-rt-transports-http-javanet/builds/2012-10-03_16-05-29/archive/org.apache.axis/axis-rt-transports-http-javanet/1.4.1-SNAPSHOT/axis-rt-transports-http-javanet-1.4.1-SNAPSHOT.pom
[JENKINS] Archiving <https://builds.apache.org/job/axis-trunk/ws/axis/axis-testutils/pom.xml>
to /home/hudson/hudson/jobs/axis-trunk/modules/org.apache.axis$axis-testutils/builds/2012-10-03_16-05-29/archive/org.apache.axis/axis-testutils/1.4.1-SNAPSHOT/axis-testutils-1.4.1-SNAPSHOT.pom
[JENKINS] Archiving <https://builds.apache.org/job/axis-trunk/ws/axis/axis-testutils/target/axis-testutils-1.4.1-SNAPSHOT.jar>
to /home/hudson/hudson/jobs/axis-trunk/modules/org.apache.axis$axis-testutils/builds/2012-10-03_16-05-29/archive/org.apache.axis/axis-testutils/1.4.1-20121003.160711-16/axis-testutils-1.4.1-20121003.160711-16.jar
[JENKINS] Archiving <https://builds.apache.org/job/axis-trunk/ws/axis/axis-testutils/target/axis-testutils-1.4.1-SNAPSHOT-sources.jar>
to /home/hudson/hudson/jobs/axis-trunk/modules/org.apache.axis$axis-testutils/builds/2012-10-03_16-05-29/archive/org.apache.axis/axis-testutils/1.4.1-20121003.160711-16/axis-testutils-1.4.1-20121003.160711-16-sources.jar
[JENKINS] Archiving <https://builds.apache.org/job/axis-trunk/ws/axis/axis-testutils/target/axis-testutils-1.4.1-SNAPSHOT-javadoc.jar>
to /home/hudson/hudson/jobs/axis-trunk/modules/org.apache.axis$axis-testutils/builds/2012-10-03_16-05-29/archive/org.apache.axis/axis-testutils/1.4.1-20121003.160711-16/axis-testutils-1.4.1-20121003.160711-16-javadoc.jar
[JENKINS] Archiving <https://builds.apache.org/job/axis-trunk/ws/axis/maven/pom.xml>
to /home/hudson/hudson/jobs/axis-trunk/modules/org.apache.axis$maven/builds/2012-10-03_16-05-29/archive/org.apache.axis/maven/1.4.1-SNAPSHOT/maven-1.4.1-SNAPSHOT.pom
Waiting for Jenkins to finish collecting data
mavenExecutionResult exceptions not empty
message : Failed to execute goal org.apache.maven.plugins:maven-compiler-plugin:2.3.2:compile
(default-compile) on project interop-mock: Compilation failure
cause : Compilation failure
Stack trace : 
org.apache.maven.lifecycle.LifecycleExecutionException: Failed to execute goal org.apache.maven.plugins:maven-compiler-plugin:2.3.2:compile
(default-compile) on project interop-mock: Compilation failure
	at org.apache.maven.lifecycle.internal.MojoExecutor.execute(MojoExecutor.java:213)
	at org.apache.maven.lifecycle.internal.MojoExecutor.execute(MojoExecutor.java:153)
	at org.apache.maven.lifecycle.internal.MojoExecutor.execute(MojoExecutor.java:145)
	at org.apache.maven.lifecycle.internal.LifecycleModuleBuilder.buildProject(LifecycleModuleBuilder.java:84)
	at org.apache.maven.lifecycle.internal.LifecycleModuleBuilder.buildProject(LifecycleModuleBuilder.java:59)
	at org.apache.maven.lifecycle.internal.LifecycleStarter.singleThreadedBuild(LifecycleStarter.java:183)
	at org.apache.maven.lifecycle.internal.LifecycleStarter.execute(LifecycleStarter.java:161)
	at org.apache.maven.DefaultMaven.doExecute(DefaultMaven.java:320)
	at org.apache.maven.DefaultMaven.execute(DefaultMaven.java:156)
	at org.jvnet.hudson.maven3.launcher.Maven3Launcher.main(Maven3Launcher.java:79)
	at sun.reflect.NativeMethodAccessorImpl.invoke0(Native Method)
	at sun.reflect.NativeMethodAccessorImpl.invoke(NativeMethodAccessorImpl.java:39)
	at sun.reflect.DelegatingMethodAccessorImpl.invoke(DelegatingMethodAccessorImpl.java:25)
	at java.lang.reflect.Method.invoke(Method.java:592)
	at org.codehaus.plexus.classworlds.launcher.Launcher.launchStandard(Launcher.java:329)
	at org.codehaus.plexus.classworlds.launcher.Launcher.launch(Launcher.java:239)
	at org.jvnet.hudson.maven3.agent.Maven3Main.launch(Maven3Main.java:158)
	at hudson.maven.Maven3Builder.call(Maven3Builder.java:98)
	at hudson.maven.Maven3Builder.call(Maven3Builder.java:64)
	at hudson.remoting.UserRequest.perform(UserRequest.java:118)
	at hudson.remoting.UserRequest.perform(UserRequest.java:48)
	at hudson.remoting.Request$2.run(Request.java:326)
	at hudson.remoting.InterceptingExecutorService$1.call(InterceptingExecutorService.java:72)
	at java.util.concurrent.FutureTask$Sync.innerRun(FutureTask.java:269)
	at java.util.concurrent.FutureTask.run(FutureTask.java:123)
	at java.util.concurrent.ThreadPoolExecutor$Worker.runTask(ThreadPoolExecutor.java:651)
	at java.util.concurrent.ThreadPoolExecutor$Worker.run(ThreadPoolExecutor.java:676)
	at java.lang.Thread.run(Thread.java:595)
Caused by: org.apache.maven.plugin.CompilationFailureException: Compilation failure
	at org.apache.maven.plugin.AbstractCompilerMojo.execute(AbstractCompilerMojo.java:656)
	at org.apache.maven.plugin.CompilerMojo.execute(CompilerMojo.java:128)
	at org.apache.maven.plugin.DefaultBuildPluginManager.executeMojo(DefaultBuildPluginManager.java:101)
	at org.apache.maven.lifecycle.internal.MojoExecutor.execute(MojoExecutor.java:209)
	... 27 more
Sending e-mails to: java-dev@axis.apache.org andreas.veithen@gmail.com
channel stopped

---------------------------------------------------------------------
To unsubscribe, e-mail: java-dev-unsubscribe@axis.apache.org
For additional commands, e-mail: java-dev-help@axis.apache.org


Mime
View raw message