axis-java-dev mailing list archives

Site index · List index
Message view « Date » · « Thread »
Top « Date » · « Thread »
From Apache Jenkins Server <jenk...@builds.apache.org>
Subject Build failed in Jenkins: axis2-transports-trunk #1108
Date Mon, 22 Oct 2012 02:58:51 GMT
See <https://builds.apache.org/job/axis2-transports-trunk/1108/>

------------------------------------------
[...truncated 878 lines...]
	at org.apache.axis2.transport.base.AbstractTransportListener.handleIncomingMessage(AbstractTransportListener.java:328)
	at org.apache.axis2.transport.jms.JMSMessageReceiver.processThoughEngine(JMSMessageReceiver.java:200)
	at org.apache.axis2.transport.jms.JMSMessageReceiver.onMessage(JMSMessageReceiver.java:122)
	at org.apache.axis2.transport.jms.ServiceTaskManager$MessageListenerTask.handleMessage(ServiceTaskManager.java:533)
	at org.apache.axis2.transport.jms.ServiceTaskManager$MessageListenerTask.run(ServiceTaskManager.java:436)
	at org.apache.axis2.transport.base.threads.NativeWorkerPool$1.run(NativeWorkerPool.java:173)
	at java.util.concurrent.ThreadPoolExecutor$Worker.runTask(ThreadPoolExecutor.java:651)
	at java.util.concurrent.ThreadPoolExecutor$Worker.run(ThreadPoolExecutor.java:676)
	at java.lang.Thread.run(Thread.java:595)
ERROR [jms-Worker-2] JMSMessageReceiver Unknown error processing message
java.lang.IllegalMonitorStateException
	at java.lang.Object.wait(Native Method)
	at java.lang.Object.wait(Object.java:474)
	at org.apache.axis2.transport.testkit.tests.misc.MinConcurrencyTest$1.receive(MinConcurrencyTest.java:91)
	at org.apache.axis2.engine.AxisEngine.receive(AxisEngine.java:169)
	at org.apache.axis2.transport.base.AbstractTransportListener.handleIncomingMessage(AbstractTransportListener.java:328)
	at org.apache.axis2.transport.jms.JMSMessageReceiver.processThoughEngine(JMSMessageReceiver.java:200)
	at org.apache.axis2.transport.jms.JMSMessageReceiver.onMessage(JMSMessageReceiver.java:122)
	at org.apache.axis2.transport.jms.ServiceTaskManager$MessageListenerTask.handleMessage(ServiceTaskManager.java:533)
	at org.apache.axis2.transport.jms.ServiceTaskManager$MessageListenerTask.run(ServiceTaskManager.java:436)
	at org.apache.axis2.transport.base.threads.NativeWorkerPool$1.run(NativeWorkerPool.java:173)
	at java.util.concurrent.ThreadPoolExecutor$Worker.runTask(ThreadPoolExecutor.java:651)
	at java.util.concurrent.ThreadPoolExecutor$Worker.run(ThreadPoolExecutor.java:676)
	at java.lang.Thread.run(Thread.java:595)
ERROR [jms-Worker-3] JMSMessageReceiver Unknown error processing message
java.lang.IllegalMonitorStateException
	at java.lang.Object.wait(Native Method)
	at java.lang.Object.wait(Object.java:474)
	at org.apache.axis2.transport.testkit.tests.misc.MinConcurrencyTest$1.receive(MinConcurrencyTest.java:91)
	at org.apache.axis2.engine.AxisEngine.receive(AxisEngine.java:169)
	at org.apache.axis2.transport.base.AbstractTransportListener.handleIncomingMessage(AbstractTransportListener.java:328)
	at org.apache.axis2.transport.jms.JMSMessageReceiver.processThoughEngine(JMSMessageReceiver.java:200)
	at org.apache.axis2.transport.jms.JMSMessageReceiver.onMessage(JMSMessageReceiver.java:122)
	at org.apache.axis2.transport.jms.ServiceTaskManager$MessageListenerTask.handleMessage(ServiceTaskManager.java:533)
	at org.apache.axis2.transport.jms.ServiceTaskManager$MessageListenerTask.run(ServiceTaskManager.java:436)
	at org.apache.axis2.transport.base.threads.NativeWorkerPool$1.run(NativeWorkerPool.java:173)
	at java.util.concurrent.ThreadPoolExecutor$Worker.runTask(ThreadPoolExecutor.java:651)
	at java.util.concurrent.ThreadPoolExecutor$Worker.run(ThreadPoolExecutor.java:676)
	at java.lang.Thread.run(Thread.java:595)
ERROR [jms-Worker-4] JMSMessageReceiver Unknown error processing message
java.lang.IllegalMonitorStateException
	at java.lang.Object.wait(Native Method)
	at java.lang.Object.wait(Object.java:474)
	at org.apache.axis2.transport.testkit.tests.misc.MinConcurrencyTest$1.receive(MinConcurrencyTest.java:91)
	at org.apache.axis2.engine.AxisEngine.receive(AxisEngine.java:169)
	at org.apache.axis2.transport.base.AbstractTransportListener.handleIncomingMessage(AbstractTransportListener.java:328)
	at org.apache.axis2.transport.jms.JMSMessageReceiver.processThoughEngine(JMSMessageReceiver.java:200)
	at org.apache.axis2.transport.jms.JMSMessageReceiver.onMessage(JMSMessageReceiver.java:122)
	at org.apache.axis2.transport.jms.ServiceTaskManager$MessageListenerTask.handleMessage(ServiceTaskManager.java:533)
	at org.apache.axis2.transport.jms.ServiceTaskManager$MessageListenerTask.run(ServiceTaskManager.java:436)
	at org.apache.axis2.transport.base.threads.NativeWorkerPool$1.run(NativeWorkerPool.java:173)
	at java.util.concurrent.ThreadPoolExecutor$Worker.runTask(ThreadPoolExecutor.java:651)
	at java.util.concurrent.ThreadPoolExecutor$Worker.run(ThreadPoolExecutor.java:676)
	at java.lang.Thread.run(Thread.java:595)
[AppClassLoader@1a5ab41] weaveinfo Join point 'method-call(void javax.jms.MessageProducer.send(javax.jms.Message))'
in Type 'org.apache.axis2.transport.jms.MockEchoEndpoint$1' (MockEchoEndpoint.java:83) advised
by before advice from 'org.apache.axis2.transport.jms.LogAspect' (LogAspect.java)
Tests run: 198, Failures: 0, Errors: 0, Skipped: 0, Time elapsed: 89.223 sec
Running org.apache.axis2.transport.jms.ctype.ContentTypeRuleTest
Tests run: 2, Failures: 0, Errors: 0, Skipped: 0, Time elapsed: 0.014 sec

Results :

Tests run: 200, Failures: 0, Errors: 0, Skipped: 0

[JENKINS] Recording test results
[INFO] [bundle:bundle {execution: default-bundle}]
[INFO] Preparing source:jar
[WARNING] Removing: jar from forked lifecycle, to prevent recursive invocation.
[INFO] No goals needed for project - skipping
[INFO] [source:jar {execution: default}]
[INFO] Building jar: <https://builds.apache.org/job/axis2-transports-trunk/ws/transports/modules/jms/target/axis2-transport-jms-1.7.0-SNAPSHOT-sources.jar>
[INFO] [install:install {execution: default-install}]
[INFO] Installing <https://builds.apache.org/job/axis2-transports-trunk/ws/transports/modules/jms/target/axis2-transport-jms-1.7.0-SNAPSHOT.jar>
to <https://builds.apache.org/job/axis2-transports-trunk/ws/.repository/org/apache/axis2/axis2-transport-jms/1.7.0-SNAPSHOT/axis2-transport-jms-1.7.0-SNAPSHOT.jar>
[INFO] Installing <https://builds.apache.org/job/axis2-transports-trunk/ws/transports/modules/jms/target/axis2-transport-jms-1.7.0-SNAPSHOT-sources.jar>
to <https://builds.apache.org/job/axis2-transports-trunk/ws/.repository/org/apache/axis2/axis2-transport-jms/1.7.0-SNAPSHOT/axis2-transport-jms-1.7.0-SNAPSHOT-sources.jar>
[INFO] [bundle:install {execution: default-install}]
[INFO] Parsing <https://builds.apache.org/job/axis2-transports-trunk/ws/.repository/repository.xml>
[INFO] Installing org/apache/axis2/axis2-transport-jms/1.7.0-SNAPSHOT/axis2-transport-jms-1.7.0-SNAPSHOT.jar
[INFO] Writing OBR metadata
[INFO] [deploy:deploy {execution: default-deploy}]
[INFO] Retrieving previous build number from apache.snapshots.https
[WARNING] *** CHECKSUM FAILED - Checksum failed on download: local = '7538919d27bdb043e3a23b86f00f91108e1d67f4';
remote = '7983806303d2cf76c6e2663d92019983a43737b9' - RETRYING
[WARNING] *** CHECKSUM FAILED - Checksum failed on download: local = '7538919d27bdb043e3a23b86f00f91108e1d67f4';
remote = '7983806303d2cf76c6e2663d92019983a43737b9' - IGNORING
Uploading: https://repository.apache.org/content/repositories/snapshots/org/apache/axis2/axis2-transport-jms/1.7.0-SNAPSHOT/axis2-transport-jms-1.7.0-20121022.025356-620.jar
78K uploaded  (axis2-transport-jms-1.7.0-20121022.025356-620.jar)
[INFO] Retrieving previous metadata from apache.snapshots.https
[INFO] Uploading repository metadata for: 'artifact org.apache.axis2:axis2-transport-jms'
[INFO] Retrieving previous metadata from apache.snapshots.https
[WARNING] *** CHECKSUM FAILED - Checksum failed on download: local = '7538919d27bdb043e3a23b86f00f91108e1d67f4';
remote = '7983806303d2cf76c6e2663d92019983a43737b9' - RETRYING
[WARNING] *** CHECKSUM FAILED - Checksum failed on download: local = '7538919d27bdb043e3a23b86f00f91108e1d67f4';
remote = '7983806303d2cf76c6e2663d92019983a43737b9' - IGNORING
[INFO] Uploading repository metadata for: 'snapshot org.apache.axis2:axis2-transport-jms:1.7.0-SNAPSHOT'
[INFO] Uploading project information for axis2-transport-jms 1.7.0-20121022.025356-620
[INFO] Retrieving previous build number from apache.snapshots.https
Uploading: https://repository.apache.org/content/repositories/snapshots/org/apache/axis2/axis2-transport-jms/1.7.0-SNAPSHOT/axis2-transport-jms-1.7.0-20121022.025356-620-sources.jar
67K uploaded  (axis2-transport-jms-1.7.0-20121022.025356-620-sources.jar)
[INFO] [bundle:deploy {execution: default-deploy}]
[INFO] Remote OBR update disabled (enable with -DremoteOBR)
[JENKINS] Archiving <https://builds.apache.org/job/axis2-transports-trunk/ws/transports/modules/jms/pom.xml>
to /home/hudson/hudson/jobs/axis2-transports-trunk/modules/org.apache.axis2$axis2-transport-jms/builds/2012-10-22_02-53-04/archive/org.apache.axis2/axis2-transport-jms/1.7.0-SNAPSHOT/axis2-transport-jms-1.7.0-SNAPSHOT.pom
[JENKINS] Archiving <https://builds.apache.org/job/axis2-transports-trunk/ws/transports/modules/jms/target/axis2-transport-jms-1.7.0-SNAPSHOT.jar>
to /home/hudson/hudson/jobs/axis2-transports-trunk/modules/org.apache.axis2$axis2-transport-jms/builds/2012-10-22_02-53-04/archive/org.apache.axis2/axis2-transport-jms/1.7.0-20121022.025356-620/axis2-transport-jms-1.7.0-20121022.025356-620.jar
[JENKINS] Archiving <https://builds.apache.org/job/axis2-transports-trunk/ws/transports/modules/jms/target/axis2-transport-jms-1.7.0-SNAPSHOT-sources.jar>
to /home/hudson/hudson/jobs/axis2-transports-trunk/modules/org.apache.axis2$axis2-transport-jms/builds/2012-10-22_02-53-04/archive/org.apache.axis2/axis2-transport-jms/1.7.0-20121022.025356-620/axis2-transport-jms-1.7.0-20121022.025356-620-sources.jar
[INFO] ------------------------------------------------------------------------
[INFO] Building Apache Axis2 - Transport - Sms
[INFO]    task-segment: [clean, deploy]
[INFO] ------------------------------------------------------------------------
[INFO] [clean:clean {execution: default-clean}]
[INFO] Deleting <https://builds.apache.org/job/axis2-transports-trunk/ws/transports/modules/sms/target>
[INFO] [remote-resources:process {execution: default}]
Downloading: http://people.apache.org/repo/m2-snapshot-repository//org/smslib/smslib/3.4.1/smslib-3.4.1.pom
[INFO] Unable to find resource 'org.smslib:smslib:pom:3.4.1' in repository apache-snapshots
(http://people.apache.org/repo/m2-snapshot-repository/)
Downloading: http://dist.wso2.org/maven2//org/smslib/smslib/3.4.1/smslib-3.4.1.pom
[INFO] Unable to find resource 'org.smslib:smslib:pom:3.4.1' in repository wso2-m2 (http://dist.wso2.org/maven2/)
Downloading: http://repo1.maven.org/maven2/org/smslib/smslib/3.4.1/smslib-3.4.1.pom
[INFO] Unable to find resource 'org.smslib:smslib:pom:3.4.1' in repository central (http://repo1.maven.org/maven2)
[INFO] [resources:resources {execution: default-resources}]
[INFO] Using 'UTF-8' encoding to copy filtered resources.
[INFO] skip non existing resourceDirectory <https://builds.apache.org/job/axis2-transports-trunk/ws/transports/modules/sms/src/main/resources>
[INFO] Copying 3 resources
[INFO] [compiler:compile {execution: default-compile}]
[INFO] Compiling 24 source files to <https://builds.apache.org/job/axis2-transports-trunk/ws/transports/modules/sms/target/classes>
[INFO] [dependency:copy {execution: copy}]
[INFO] Configured Artifact: org.aspectj:aspectjweaver:?:jar
[INFO] Copying aspectjweaver-1.6.1.jar to <https://builds.apache.org/job/axis2-transports-trunk/ws/transports/modules/sms/target/lib/aspectjweaver.jar>
[INFO] [resources:testResources {execution: default-testResources}]
[INFO] Using 'UTF-8' encoding to copy filtered resources.
[INFO] skip non existing resourceDirectory <https://builds.apache.org/job/axis2-transports-trunk/ws/transports/modules/sms/src/test/resources>
[INFO] Copying 3 resources
[INFO] [compiler:testCompile {execution: default-testCompile}]
[INFO] Compiling 6 source files to <https://builds.apache.org/job/axis2-transports-trunk/ws/transports/modules/sms/target/test-classes>
[WARNING] DEPRECATED [tasks]: Use target instead
[INFO] [antrun:run {execution: build-repo}]
[WARNING] Parameter tasks is deprecated, use target instead
[INFO] Executing tasks

main:
    [mkdir] Created dir: <https://builds.apache.org/job/axis2-transports-trunk/ws/transports/modules/sms/target/test-resources/samples/conf>
    [mkdir] Created dir: <https://builds.apache.org/job/axis2-transports-trunk/ws/transports/modules/sms/target/test-resources/samples/repository/modules>
    [mkdir] Created dir: <https://builds.apache.org/job/axis2-transports-trunk/ws/transports/modules/sms/target/test-resources/samples/repository/services>
    [mkdir] Created dir: <https://builds.apache.org/job/axis2-transports-trunk/ws/transports/modules/sms/target/test-resources/samples/repository/services/SampleService/org/apache/axis2/transport/sms>
    [mkdir] Created dir: <https://builds.apache.org/job/axis2-transports-trunk/ws/transports/modules/sms/target/test-resources/samples/repository/services/SampleService/META-INF>
     [copy] Copying 1 file to <https://builds.apache.org/job/axis2-transports-trunk/ws/transports/modules/sms/target/test-resources/samples/repository/modules>
     [copy] Copying 1 file to <https://builds.apache.org/job/axis2-transports-trunk/ws/transports/modules/sms/target/test-resources/samples/repository/services/SampleService/org/apache/axis2/transport/sms>
     [copy] Copying 1 file to <https://builds.apache.org/job/axis2-transports-trunk/ws/transports/modules/sms/target/test-resources/samples/conf>
     [copy] Copying 1 file to <https://builds.apache.org/job/axis2-transports-trunk/ws/transports/modules/sms/target/test-resources/samples/repository/services/SampleService/META-INF>
     [copy] Copying 1 file to <https://builds.apache.org/job/axis2-transports-trunk/ws/transports/modules/sms/target/test-resources/samples/repository/services/SampleService/META-INF>
[INFO] Executed tasks
[WARNING] DEPRECATED [systemProperties]: Use systemPropertyVariables instead.
[INFO] [surefire:test {execution: default-test}]
[INFO] Surefire report directory: <https://builds.apache.org/job/axis2-transports-trunk/ws/transports/modules/sms/target/surefire-reports>

-------------------------------------------------------
 T E S T S
-------------------------------------------------------
Running org.apache.axis2.transport.sms.SMSTransportTest
Simple SMSC Listening on port :: 2776
<https://builds.apache.org/job/axis2-transports-trunk/ws/transports/modules/sms/target/test-resources/samples>
 [Axis2] bind and connect to 127.0.0.1 : 2776 on SMPP Transport
 [Axis2] test Server started on port 2776 
Tests run: 1, Failures: 0, Errors: 0, Skipped: 0, Time elapsed: 3.739 sec

Results :

Tests run: 1, Failures: 0, Errors: 0, Skipped: 0

[JENKINS] Recording test results
[INFO] [bundle:bundle {execution: default-bundle}]
[INFO] Preparing source:jar
[WARNING] Removing: jar from forked lifecycle, to prevent recursive invocation.
[INFO] No goals needed for project - skipping
[INFO] [source:jar {execution: default}]
[INFO] Building jar: <https://builds.apache.org/job/axis2-transports-trunk/ws/transports/modules/sms/target/axis2-transport-sms-1.7.0-SNAPSHOT-sources.jar>
[INFO] [install:install {execution: default-install}]
[INFO] Installing <https://builds.apache.org/job/axis2-transports-trunk/ws/transports/modules/sms/target/axis2-transport-sms-1.7.0-SNAPSHOT.jar>
to <https://builds.apache.org/job/axis2-transports-trunk/ws/.repository/org/apache/axis2/axis2-transport-sms/1.7.0-SNAPSHOT/axis2-transport-sms-1.7.0-SNAPSHOT.jar>
[INFO] Installing <https://builds.apache.org/job/axis2-transports-trunk/ws/transports/modules/sms/target/axis2-transport-sms-1.7.0-SNAPSHOT-sources.jar>
to <https://builds.apache.org/job/axis2-transports-trunk/ws/.repository/org/apache/axis2/axis2-transport-sms/1.7.0-SNAPSHOT/axis2-transport-sms-1.7.0-SNAPSHOT-sources.jar>
[INFO] [bundle:install {execution: default-install}]
[INFO] Parsing <https://builds.apache.org/job/axis2-transports-trunk/ws/.repository/repository.xml>
[INFO] Installing org/apache/axis2/axis2-transport-sms/1.7.0-SNAPSHOT/axis2-transport-sms-1.7.0-SNAPSHOT.jar
[INFO] Writing OBR metadata
[INFO] [deploy:deploy {execution: default-deploy}]
[INFO] Retrieving previous build number from apache.snapshots.https
[WARNING] *** CHECKSUM FAILED - Checksum failed on download: local = '7dd922a1aee16a9b0e5ad8e4de09e061e269219e';
remote = '2f20e545d1b27df951a4df535dbf03e38b0c18d6' - RETRYING
[WARNING] *** CHECKSUM FAILED - Checksum failed on download: local = '7dd922a1aee16a9b0e5ad8e4de09e061e269219e';
remote = '2f20e545d1b27df951a4df535dbf03e38b0c18d6' - IGNORING
Uploading: https://repository.apache.org/content/repositories/snapshots/org/apache/axis2/axis2-transport-sms/1.7.0-SNAPSHOT/axis2-transport-sms-1.7.0-20121022.025356-618.jar
45K uploaded  (axis2-transport-sms-1.7.0-20121022.025356-618.jar)
[INFO] Uploading project information for axis2-transport-sms 1.7.0-20121022.025356-618
[INFO] Retrieving previous metadata from apache.snapshots.https
[INFO] Uploading repository metadata for: 'artifact org.apache.axis2:axis2-transport-sms'
[INFO] Retrieving previous metadata from apache.snapshots.https
[WARNING] *** CHECKSUM FAILED - Checksum failed on download: local = '7dd922a1aee16a9b0e5ad8e4de09e061e269219e';
remote = '2f20e545d1b27df951a4df535dbf03e38b0c18d6' - RETRYING
[WARNING] *** CHECKSUM FAILED - Checksum failed on download: local = '7dd922a1aee16a9b0e5ad8e4de09e061e269219e';
remote = '2f20e545d1b27df951a4df535dbf03e38b0c18d6' - IGNORING
[INFO] Uploading repository metadata for: 'snapshot org.apache.axis2:axis2-transport-sms:1.7.0-SNAPSHOT'
[INFO] Retrieving previous build number from apache.snapshots.https
Uploading: https://repository.apache.org/content/repositories/snapshots/org/apache/axis2/axis2-transport-sms/1.7.0-SNAPSHOT/axis2-transport-sms-1.7.0-20121022.025356-618-sources.jar
40K uploaded  (axis2-transport-sms-1.7.0-20121022.025356-618-sources.jar)
[INFO] [bundle:deploy {execution: default-deploy}]
[INFO] Remote OBR update disabled (enable with -DremoteOBR)
[JENKINS] Archiving <https://builds.apache.org/job/axis2-transports-trunk/ws/transports/modules/sms/pom.xml>
to /home/hudson/hudson/jobs/axis2-transports-trunk/modules/org.apache.axis2$axis2-transport-sms/builds/2012-10-22_02-53-04/archive/org.apache.axis2/axis2-transport-sms/1.7.0-SNAPSHOT/axis2-transport-sms-1.7.0-SNAPSHOT.pom
[JENKINS] Archiving <https://builds.apache.org/job/axis2-transports-trunk/ws/transports/modules/sms/target/axis2-transport-sms-1.7.0-SNAPSHOT.jar>
to /home/hudson/hudson/jobs/axis2-transports-trunk/modules/org.apache.axis2$axis2-transport-sms/builds/2012-10-22_02-53-04/archive/org.apache.axis2/axis2-transport-sms/1.7.0-20121022.025356-618/axis2-transport-sms-1.7.0-20121022.025356-618.jar
[JENKINS] Archiving <https://builds.apache.org/job/axis2-transports-trunk/ws/transports/modules/sms/target/axis2-transport-sms-1.7.0-SNAPSHOT-sources.jar>
to /home/hudson/hudson/jobs/axis2-transports-trunk/modules/org.apache.axis2$axis2-transport-sms/builds/2012-10-22_02-53-04/archive/org.apache.axis2/axis2-transport-sms/1.7.0-20121022.025356-618/axis2-transport-sms-1.7.0-20121022.025356-618-sources.jar
[INFO] ------------------------------------------------------------------------
[INFO] Building Apache Axis2 - Transport - All
[INFO]    task-segment: [clean, deploy]
[INFO] ------------------------------------------------------------------------
[INFO] [clean:clean {execution: default-clean}]
[INFO] Deleting <https://builds.apache.org/job/axis2-transports-trunk/ws/transports/modules/all/target>
[INFO] [remote-resources:process {execution: default}]
[INFO] snapshot org.apache.axis2:axis2-transport-jms:1.7.0-SNAPSHOT: checking for updates
from apache.snapshots
[INFO] snapshot org.apache.axis2:axis2-transport-mail:1.7.0-SNAPSHOT: checking for updates
from apache.snapshots
[INFO] snapshot org.apache.axis2:axis2-transport-tcp:1.7.0-SNAPSHOT: checking for updates
from apache.snapshots
[INFO] snapshot org.apache.axis2:axis2-transport-sms:1.7.0-SNAPSHOT: checking for updates
from apache.snapshots
[INFO] snapshot org.apache.axis2:axis2-transport-xmpp:1.7.0-SNAPSHOT: checking for updates
from apache.snapshots
[INFO] snapshot org.apache.axis2:axis2-transport-udp:1.7.0-SNAPSHOT: checking for updates
from apache.snapshots
[INFO] [resources:resources {execution: default-resources}]
[INFO] Using 'UTF-8' encoding to copy filtered resources.
[INFO] Copying 0 resource
[INFO] Copying 3 resources
[INFO] [compiler:compile {execution: default-compile}]
[INFO] No sources to compile
[INFO] [resources:testResources {execution: default-testResources}]
[INFO] Using 'UTF-8' encoding to copy filtered resources.
[INFO] skip non existing resourceDirectory <https://builds.apache.org/job/axis2-transports-trunk/ws/transports/modules/all/src/test/resources>
[INFO] Copying 3 resources
[INFO] [compiler:testCompile {execution: default-testCompile}]
[INFO] No sources to compile
[INFO] [surefire:test {execution: default-test}]
[INFO] Surefire report directory: <https://builds.apache.org/job/axis2-transports-trunk/ws/transports/modules/all/target/surefire-reports>

-------------------------------------------------------
 T E S T S
-------------------------------------------------------

Results :

Tests run: 0, Failures: 0, Errors: 0, Skipped: 0

[JENKINS] Recording test results
Oct 22, 2012 2:58:48 AM hudson.remoting.SynchronousCommandTransport$ReaderThread run
SEVERE: I/O error in channel channel
java.io.StreamCorruptedException
	at java.io.ObjectInputStream.readObject0(ObjectInputStream.java:1332)
	at java.io.ObjectInputStream.readObject(ObjectInputStream.java:348)
	at hudson.remoting.Command.readFrom(Command.java:90)
	at hudson.remoting.ClassicCommandTransport.read(ClassicCommandTransport.java:59)
	at hudson.remoting.SynchronousCommandTransport$ReaderThread.run(SynchronousCommandTransport.java:48)
channel stopped
[INFO] ------------------------------------------------------------------------
[ERROR] FATAL ERROR
[INFO] ------------------------------------------------------------------------
[locks-and-latches] Releasing all the locks
[locks-and-latches] All the locks released
ERROR: Maven JVM terminated unexpectedly with exit code 0


---------------------------------------------------------------------
To unsubscribe, e-mail: java-dev-unsubscribe@axis.apache.org
For additional commands, e-mail: java-dev-help@axis.apache.org


Mime
View raw message