axis-java-dev mailing list archives

Site index · List index
Message view « Date » · « Thread »
Top « Date » · « Thread »
From Apache Jenkins Server <jenk...@builds.apache.org>
Subject Build failed in Jenkins: axis-trunk #168
Date Wed, 03 Oct 2012 17:12:24 GMT
See <https://builds.apache.org/job/axis-trunk/168/changes>

Changes:

[veithen] * Added more message exchanges to the interoperability mock service.
* Fixed an issue in the GET handling in the java.net HTTP transport.
* Fixed a build failure on Java 1.5.

------------------------------------------
[...truncated 5136 lines...]
mojoStarted org.apache.maven.plugins:maven-source-plugin:2.1.2(attach-sources)
[INFO] 
[INFO] --- maven-source-plugin:2.1.2:jar (attach-sources) @ interop-mock ---
[INFO] META-INF already added, skipping
[INFO] META-INF/LICENSE already added, skipping
[INFO] META-INF/NOTICE already added, skipping
[INFO] META-INF/DEPENDENCIES already added, skipping
[INFO] Building jar: <https://builds.apache.org/job/axis-trunk/ws/axis/interop-mock/target/interop-mock-1.4.1-SNAPSHOT-sources.jar>
[INFO] META-INF already added, skipping
[INFO] META-INF/LICENSE already added, skipping
[INFO] META-INF/NOTICE already added, skipping
[INFO] META-INF/DEPENDENCIES already added, skipping
mojoSucceeded org.apache.maven.plugins:maven-source-plugin:2.1.2(attach-sources)
mojoStarted org.apache.maven.plugins:maven-javadoc-plugin:2.5(attach-javadocs)
[INFO] 
[INFO] --- maven-javadoc-plugin:2.5:jar (attach-javadocs) @ interop-mock ---
Loading source files for package org.apache.axis.test.interop.mock...
3 errors
mojoFailed org.apache.maven.plugins:maven-javadoc-plugin:2.5(attach-javadocs)
projectFailed org.apache.axis:interop-mock:1.4.1-SNAPSHOT
sessionEnded
[INFO] ------------------------------------------------------------------------
[INFO] Reactor Summary:
[INFO] 
[INFO] Axis .............................................. SUCCESS [1:00.174s]
[INFO] Axis :: SAAJ ...................................... SUCCESS [19.447s]
[INFO] Axis :: JAX-RPC ................................... SUCCESS [14.614s]
[INFO] Axis :: Core ...................................... SUCCESS [1:04.064s]
[INFO] Test Utilities .................................... SUCCESS [7.862s]
[INFO] Axis :: Ant tasks ................................. SUCCESS [13.676s]
[INFO] Axis :: Maven ..................................... SUCCESS [3.165s]
[INFO] Maven plugin common classes ....................... SUCCESS [7.450s]
[INFO] Axis :: Maven :: maven-wsdl2java-plugin ........... SUCCESS [20.771s]
[INFO] Axis :: Maven :: maven-java2wsdl-plugin ........... SUCCESS [9.162s]
[INFO] Axis :: Maven :: maven-axis-server-plugin ......... SUCCESS [10.204s]
[INFO] Axis :: Stand-alone server ........................ SUCCESS [8.945s]
[INFO] Axis :: Castor support ............................ SUCCESS [8.746s]
[INFO] Interoperability mock services .................... FAILURE [5.772s]
[INFO] Axis :: java.net HTTP Transport ................... SKIPPED
[INFO] Axis :: JMS transport ............................. SKIPPED
[INFO] Axis :: Integration tests ......................... SKIPPED
[INFO] Axis :: WAR ....................................... SKIPPED
[INFO] Samples ........................................... SKIPPED
[INFO] Attachments Sample ................................ SKIPPED
[INFO] Bidbuy Sample ..................................... SKIPPED
[INFO] Echo Sample ....................................... SKIPPED
[INFO] Encoding Sample ................................... SKIPPED
[INFO] Faults Sample ..................................... SKIPPED
[INFO] Handler Sample .................................... SKIPPED
[INFO] Integration Guide Sample .......................... SKIPPED
[INFO] JAXM Sample ....................................... SKIPPED
[INFO] Stock Quote Sample ................................ SKIPPED
[INFO] JAX-RPC Sample .................................... SKIPPED
[INFO] Message Sample .................................... SKIPPED
[INFO] MTOM Stub Sample .................................. SKIPPED
[INFO] Misc Sample ....................................... SKIPPED
[INFO] Transport Sample .................................. SKIPPED
[INFO] Proxy Sample ...................................... SKIPPED
[INFO] Distribution ...................................... SKIPPED
[INFO] ------------------------------------------------------------------------
[INFO] BUILD FAILURE
[INFO] ------------------------------------------------------------------------
[INFO] Total time: 4:19.816s
[INFO] Finished at: Wed Oct 03 17:08:43 UTC 2012
[INFO] Final Memory: 45M/201M
[INFO] ------------------------------------------------------------------------
Projects to build: [MavenProject: org.apache.axis:axis-project:1.4.1-SNAPSHOT @ <https://builds.apache.org/job/axis-trunk/ws/axis/pom.xml,>
MavenProject: org.apache.axis:axis-saaj:1.4.1-SNAPSHOT @ <https://builds.apache.org/job/axis-trunk/ws/axis/axis-saaj/pom.xml,>
MavenProject: org.apache.axis:axis-jaxrpc:1.4.1-SNAPSHOT @ <https://builds.apache.org/job/axis-trunk/ws/axis/axis-jaxrpc/pom.xml,>
MavenProject: org.apache.axis:axis:1.4.1-SNAPSHOT @ <https://builds.apache.org/job/axis-trunk/ws/axis/axis/pom.xml,>
MavenProject: org.apache.axis:axis-testutils:1.4.1-SNAPSHOT @ <https://builds.apache.org/job/axis-trunk/ws/axis/axis-testutils/pom.xml,>
MavenProject: org.apache.axis:axis-ant:1.4.1-SNAPSHOT @ <https://builds.apache.org/job/axis-trunk/ws/axis/axis-ant/pom.xml,>
MavenProject: org.apache.axis:maven:1.4.1-SNAPSHOT @ <https://builds.apache.org/job/axis-trunk/ws/axis/maven/pom.xml,>
MavenProject: org.apache.axis:nsmap:1.4.1-SNAPSHOT @ <https://builds.apache.org/job/axis-trunk/ws/axis/maven/nsmap/pom.xml,>
MavenProject: org.apache.axis:maven-wsdl2java-plugin:1.4.1-SNAPSHOT @ <https://builds.apache.org/job/axis-trunk/ws/axis/maven/maven-wsdl2java-plugin/pom.xml,>
MavenProject: org.apache.axis:maven-java2wsdl-plugin:1.4.1-SNAPSHOT @ <https://builds.apache.org/job/axis-trunk/ws/axis/maven/maven-java2wsdl-plugin/pom.xml,>
MavenProject: org.apache.axis:maven-axis-server-plugin:1.4.1-SNAPSHOT @ <https://builds.apache.org/job/axis-trunk/ws/axis/maven/maven-axis-server-plugin/pom.xml,>
MavenProject: org.apache.axis:axis-standalone-server:1.4.1-SNAPSHOT @ <https://builds.apache.org/job/axis-trunk/ws/axis/axis-standalone-server/pom.xml,>
MavenProject: org.apache.axis:axis-castor:1.4.1-SNAPSHOT @ <https://builds.apache.org/job/axis-trunk/ws/axis/axis-castor/pom.xml,>
MavenProject: org.apache.axis:interop-mock:1.4.1-SNAPSHOT @ <https://builds.apache.org/job/axis-trunk/ws/axis/interop-mock/pom.xml,>
MavenProject: org.apache.axis:axis-rt-transports-http-javanet:1.4.1-SNAPSHOT @ <https://builds.apache.org/job/axis-trunk/ws/axis/axis-rt-transports-http-javanet/pom.xml,>
MavenProject: org.apache.axis:axis-jms:1.4.1-SNAPSHOT @ <https://builds.apache.org/job/axis-trunk/ws/axis/axis-jms/pom.xml,>
MavenProject: org.apache.axis:integration:1.4.1-SNAPSHOT @ <https://builds.apache.org/job/axis-trunk/ws/axis/integration/pom.xml,>
MavenProject: org.apache.axis:axis-war:1.4.1-SNAPSHOT @ <https://builds.apache.org/job/axis-trunk/ws/axis/axis-war/pom.xml,>
MavenProject: org.apache.axis:samples:1.4.1-SNAPSHOT @ <https://builds.apache.org/job/axis-trunk/ws/axis/samples/pom.xml,>
MavenProject: org.apache.axis:attachments-sample:1.4.1-SNAPSHOT @ <https://builds.apache.org/job/axis-trunk/ws/axis/samples/attachments-sample/pom.xml,>
MavenProject: org.apache.axis:bidbuy-sample:1.4.1-SNAPSHOT @ <https://builds.apache.org/job/axis-trunk/ws/axis/samples/bidbuy-sample/pom.xml,>
MavenProject: org.apache.axis:echo-sample:1.4.1-SNAPSHOT @ <https://builds.apache.org/job/axis-trunk/ws/axis/samples/echo-sample/pom.xml,>
MavenProject: org.apache.axis:encoding-sample:1.4.1-SNAPSHOT @ <https://builds.apache.org/job/axis-trunk/ws/axis/samples/encoding-sample/pom.xml,>
MavenProject: org.apache.axis:faults-sample:1.4.1-SNAPSHOT @ <https://builds.apache.org/job/axis-trunk/ws/axis/samples/faults-sample/pom.xml,>
MavenProject: org.apache.axis:handler-sample:1.4.1-SNAPSHOT @ <https://builds.apache.org/job/axis-trunk/ws/axis/samples/handler-sample/pom.xml,>
MavenProject: org.apache.axis:integrationguide-sample:1.4.1-SNAPSHOT @ <https://builds.apache.org/job/axis-trunk/ws/axis/samples/integrationguide-sample/pom.xml,>
MavenProject: org.apache.axis:jaxm-sample:1.4.1-SNAPSHOT @ <https://builds.apache.org/job/axis-trunk/ws/axis/samples/jaxm-sample/pom.xml,>
MavenProject: org.apache.axis:stock-sample:1.4.1-SNAPSHOT @ <https://builds.apache.org/job/axis-trunk/ws/axis/samples/stock-sample/pom.xml,>
MavenProject: org.apache.axis:jaxrpc-sample:1.4.1-SNAPSHOT @ <https://builds.apache.org/job/axis-trunk/ws/axis/samples/jaxrpc-sample/pom.xml,>
MavenProject: org.apache.axis:message-sample:1.4.1-SNAPSHOT @ <https://builds.apache.org/job/axis-trunk/ws/axis/samples/message-sample/pom.xml,>
MavenProject: org.apache.axis:mtomstub-sample:1.4.1-SNAPSHOT @ <https://builds.apache.org/job/axis-trunk/ws/axis/samples/mtomstub-sample/pom.xml,>
MavenProject: org.apache.axis:misc-sample:1.4.1-SNAPSHOT @ <https://builds.apache.org/job/axis-trunk/ws/axis/samples/misc-sample/pom.xml,>
MavenProject: org.apache.axis:transport-sample:1.4.1-SNAPSHOT @ <https://builds.apache.org/job/axis-trunk/ws/axis/samples/transport-sample/pom.xml,>
MavenProject: org.apache.axis:proxy-sample:1.4.1-SNAPSHOT @ <https://builds.apache.org/job/axis-trunk/ws/axis/samples/proxy-sample/pom.xml,>
MavenProject: org.apache.axis:distribution:1.4.1-SNAPSHOT @ <https://builds.apache.org/job/axis-trunk/ws/axis/distribution/pom.xml]>
[JENKINS] Archiving <https://builds.apache.org/job/axis-trunk/ws/axis/samples/jaxrpc-sample/pom.xml>
to /home/hudson/hudson/jobs/axis-trunk/modules/org.apache.axis$jaxrpc-sample/builds/2012-10-03_17-04-06/archive/org.apache.axis/jaxrpc-sample/1.4.1-SNAPSHOT/jaxrpc-sample-1.4.1-SNAPSHOT.pom
[JENKINS] Archiving <https://builds.apache.org/job/axis-trunk/ws/axis/samples/integrationguide-sample/pom.xml>
to /home/hudson/hudson/jobs/axis-trunk/modules/org.apache.axis$integrationguide-sample/builds/2012-10-03_17-04-06/archive/org.apache.axis/integrationguide-sample/1.4.1-SNAPSHOT/integrationguide-sample-1.4.1-SNAPSHOT.pom
[JENKINS] Archiving <https://builds.apache.org/job/axis-trunk/ws/axis/samples/handler-sample/pom.xml>
to /home/hudson/hudson/jobs/axis-trunk/modules/org.apache.axis$handler-sample/builds/2012-10-03_17-04-06/archive/org.apache.axis/handler-sample/1.4.1-SNAPSHOT/handler-sample-1.4.1-SNAPSHOT.pom
[JENKINS] Archiving <https://builds.apache.org/job/axis-trunk/ws/axis/interop-mock/pom.xml>
to /home/hudson/hudson/jobs/axis-trunk/modules/org.apache.axis$interop-mock/builds/2012-10-03_17-04-04/archive/org.apache.axis/interop-mock/1.4.1-SNAPSHOT/interop-mock-1.4.1-SNAPSHOT.pom
[JENKINS] Archiving <https://builds.apache.org/job/axis-trunk/ws/axis/interop-mock/target/interop-mock-1.4.1-SNAPSHOT.war>
to /home/hudson/hudson/jobs/axis-trunk/modules/org.apache.axis$interop-mock/builds/2012-10-03_17-04-04/archive/org.apache.axis/interop-mock/1.4.1-SNAPSHOT/interop-mock-1.4.1-SNAPSHOT.war
[JENKINS] Archiving <https://builds.apache.org/job/axis-trunk/ws/axis/interop-mock/target/interop-mock-1.4.1-SNAPSHOT-sources.jar>
to /home/hudson/hudson/jobs/axis-trunk/modules/org.apache.axis$interop-mock/builds/2012-10-03_17-04-04/archive/org.apache.axis/interop-mock/1.4.1-SNAPSHOT/interop-mock-1.4.1-SNAPSHOT-sources.jar
[JENKINS] Archiving <https://builds.apache.org/job/axis-trunk/ws/axis/samples/proxy-sample/pom.xml>
to /home/hudson/hudson/jobs/axis-trunk/modules/org.apache.axis$proxy-sample/builds/2012-10-03_17-04-07/archive/org.apache.axis/proxy-sample/1.4.1-SNAPSHOT/proxy-sample-1.4.1-SNAPSHOT.pom
[JENKINS] Archiving <https://builds.apache.org/job/axis-trunk/ws/axis/integration/pom.xml>
to /home/hudson/hudson/jobs/axis-trunk/modules/org.apache.axis$integration/builds/2012-10-03_17-04-04/archive/org.apache.axis/integration/1.4.1-SNAPSHOT/integration-1.4.1-SNAPSHOT.pom
[JENKINS] Archiving <https://builds.apache.org/job/axis-trunk/ws/axis/samples/encoding-sample/pom.xml>
to /home/hudson/hudson/jobs/axis-trunk/modules/org.apache.axis$encoding-sample/builds/2012-10-03_17-04-05/archive/org.apache.axis/encoding-sample/1.4.1-SNAPSHOT/encoding-sample-1.4.1-SNAPSHOT.pom
[JENKINS] Archiving <https://builds.apache.org/job/axis-trunk/ws/axis/samples/pom.xml>
to /home/hudson/hudson/jobs/axis-trunk/modules/org.apache.axis$samples/builds/2012-10-03_17-04-04/archive/org.apache.axis/samples/1.4.1-SNAPSHOT/samples-1.4.1-SNAPSHOT.pom
[JENKINS] Archiving <https://builds.apache.org/job/axis-trunk/ws/axis/distribution/pom.xml>
to /home/hudson/hudson/jobs/axis-trunk/modules/org.apache.axis$distribution/builds/2012-10-03_17-04-07/archive/org.apache.axis/distribution/1.4.1-SNAPSHOT/distribution-1.4.1-SNAPSHOT.pom
[JENKINS] Archiving <https://builds.apache.org/job/axis-trunk/ws/axis/pom.xml> to /home/hudson/hudson/jobs/axis-trunk/modules/org.apache.axis$axis-project/builds/2012-10-03_17-04-01/archive/org.apache.axis/axis-project/1.4.1-SNAPSHOT/axis-project-1.4.1-SNAPSHOT.pom
[JENKINS] Archiving <https://builds.apache.org/job/axis-trunk/ws/axis/target/axis-project-1.4.1-SNAPSHOT-source-release.zip>
to /home/hudson/hudson/jobs/axis-trunk/modules/org.apache.axis$axis-project/builds/2012-10-03_17-04-01/archive/org.apache.axis/axis-project/1.4.1-20121003.170520-164/axis-project-1.4.1-20121003.170520-164-source-release.zip
[JENKINS] Archiving <https://builds.apache.org/job/axis-trunk/ws/axis/samples/faults-sample/pom.xml>
to /home/hudson/hudson/jobs/axis-trunk/modules/org.apache.axis$faults-sample/builds/2012-10-03_17-04-05/archive/org.apache.axis/faults-sample/1.4.1-SNAPSHOT/faults-sample-1.4.1-SNAPSHOT.pom
[JENKINS] Archiving <https://builds.apache.org/job/axis-trunk/ws/axis/samples/stock-sample/pom.xml>
to /home/hudson/hudson/jobs/axis-trunk/modules/org.apache.axis$stock-sample/builds/2012-10-03_17-04-07/archive/org.apache.axis/stock-sample/1.4.1-SNAPSHOT/stock-sample-1.4.1-SNAPSHOT.pom
[JENKINS] Archiving <https://builds.apache.org/job/axis-trunk/ws/axis/samples/echo-sample/pom.xml>
to /home/hudson/hudson/jobs/axis-trunk/modules/org.apache.axis$echo-sample/builds/2012-10-03_17-04-05/archive/org.apache.axis/echo-sample/1.4.1-SNAPSHOT/echo-sample-1.4.1-SNAPSHOT.pom
[JENKINS] Archiving <https://builds.apache.org/job/axis-trunk/ws/axis/samples/attachments-sample/pom.xml>
to /home/hudson/hudson/jobs/axis-trunk/modules/org.apache.axis$attachments-sample/builds/2012-10-03_17-04-05/archive/org.apache.axis/attachments-sample/1.4.1-SNAPSHOT/attachments-sample-1.4.1-SNAPSHOT.pom
[JENKINS] Archiving <https://builds.apache.org/job/axis-trunk/ws/axis/maven/maven-wsdl2java-plugin/pom.xml>
to /home/hudson/hudson/jobs/axis-trunk/modules/org.apache.axis$maven-wsdl2java-plugin/builds/2012-10-03_17-04-02/archive/org.apache.axis/maven-wsdl2java-plugin/1.4.1-SNAPSHOT/maven-wsdl2java-plugin-1.4.1-SNAPSHOT.pom
[JENKINS] Archiving <https://builds.apache.org/job/axis-trunk/ws/axis/maven/maven-wsdl2java-plugin/target/maven-wsdl2java-plugin-1.4.1-SNAPSHOT.jar>
to /home/hudson/hudson/jobs/axis-trunk/modules/org.apache.axis$maven-wsdl2java-plugin/builds/2012-10-03_17-04-02/archive/org.apache.axis/maven-wsdl2java-plugin/1.4.1-20121003.170755-70/maven-wsdl2java-plugin-1.4.1-20121003.170755-70.jar
[JENKINS] Archiving <https://builds.apache.org/job/axis-trunk/ws/axis/maven/maven-wsdl2java-plugin/target/maven-wsdl2java-plugin-1.4.1-SNAPSHOT-sources.jar>
to /home/hudson/hudson/jobs/axis-trunk/modules/org.apache.axis$maven-wsdl2java-plugin/builds/2012-10-03_17-04-02/archive/org.apache.axis/maven-wsdl2java-plugin/1.4.1-20121003.170755-70/maven-wsdl2java-plugin-1.4.1-20121003.170755-70-sources.jar
[JENKINS] Archiving <https://builds.apache.org/job/axis-trunk/ws/axis/maven/maven-wsdl2java-plugin/target/maven-wsdl2java-plugin-1.4.1-SNAPSHOT-javadoc.jar>
to /home/hudson/hudson/jobs/axis-trunk/modules/org.apache.axis$maven-wsdl2java-plugin/builds/2012-10-03_17-04-02/archive/org.apache.axis/maven-wsdl2java-plugin/1.4.1-20121003.170755-70/maven-wsdl2java-plugin-1.4.1-20121003.170755-70-javadoc.jar
[JENKINS] Archiving <https://builds.apache.org/job/axis-trunk/ws/axis/axis-jaxrpc/pom.xml>
to /home/hudson/hudson/jobs/axis-trunk/modules/org.apache.axis$axis-jaxrpc/builds/2012-10-03_17-04-02/archive/org.apache.axis/axis-jaxrpc/1.4.1-SNAPSHOT/axis-jaxrpc-1.4.1-SNAPSHOT.pom
[JENKINS] Archiving <https://builds.apache.org/job/axis-trunk/ws/axis/axis-jaxrpc/target/axis-jaxrpc-1.4.1-SNAPSHOT.jar>
to /home/hudson/hudson/jobs/axis-trunk/modules/org.apache.axis$axis-jaxrpc/builds/2012-10-03_17-04-02/archive/org.apache.axis/axis-jaxrpc/1.4.1-20121003.170556-162/axis-jaxrpc-1.4.1-20121003.170556-162.jar
[JENKINS] Archiving <https://builds.apache.org/job/axis-trunk/ws/axis/axis-jaxrpc/target/axis-jaxrpc-1.4.1-SNAPSHOT-sources.jar>
to /home/hudson/hudson/jobs/axis-trunk/modules/org.apache.axis$axis-jaxrpc/builds/2012-10-03_17-04-02/archive/org.apache.axis/axis-jaxrpc/1.4.1-20121003.170556-162/axis-jaxrpc-1.4.1-20121003.170556-162-sources.jar
[JENKINS] Archiving <https://builds.apache.org/job/axis-trunk/ws/axis/axis-jaxrpc/target/axis-jaxrpc-1.4.1-SNAPSHOT-javadoc.jar>
to /home/hudson/hudson/jobs/axis-trunk/modules/org.apache.axis$axis-jaxrpc/builds/2012-10-03_17-04-02/archive/org.apache.axis/axis-jaxrpc/1.4.1-20121003.170556-162/axis-jaxrpc-1.4.1-20121003.170556-162-javadoc.jar
[JENKINS] Archiving <https://builds.apache.org/job/axis-trunk/ws/axis/samples/bidbuy-sample/pom.xml>
to /home/hudson/hudson/jobs/axis-trunk/modules/org.apache.axis$bidbuy-sample/builds/2012-10-03_17-04-05/archive/org.apache.axis/bidbuy-sample/1.4.1-SNAPSHOT/bidbuy-sample-1.4.1-SNAPSHOT.pom
[JENKINS] Archiving <https://builds.apache.org/job/axis-trunk/ws/axis/axis/pom.xml>
to /home/hudson/hudson/jobs/axis-trunk/modules/org.apache.axis$axis/builds/2012-10-03_17-04-02/archive/org.apache.axis/axis/1.4.1-SNAPSHOT/axis-1.4.1-SNAPSHOT.pom
[JENKINS] Archiving <https://builds.apache.org/job/axis-trunk/ws/axis/axis/target/axis-1.4.1-SNAPSHOT.jar>
to /home/hudson/hudson/jobs/axis-trunk/modules/org.apache.axis$axis/builds/2012-10-03_17-04-02/archive/org.apache.axis/axis/1.4.1-20121003.170657-158/axis-1.4.1-20121003.170657-158.jar
[JENKINS] Archiving <https://builds.apache.org/job/axis-trunk/ws/axis/axis/target/axis-1.4.1-SNAPSHOT-sources.jar>
to /home/hudson/hudson/jobs/axis-trunk/modules/org.apache.axis$axis/builds/2012-10-03_17-04-02/archive/org.apache.axis/axis/1.4.1-20121003.170657-158/axis-1.4.1-20121003.170657-158-sources.jar
[JENKINS] Archiving <https://builds.apache.org/job/axis-trunk/ws/axis/axis/target/axis-1.4.1-SNAPSHOT-javadoc.jar>
to /home/hudson/hudson/jobs/axis-trunk/modules/org.apache.axis$axis/builds/2012-10-03_17-04-02/archive/org.apache.axis/axis/1.4.1-20121003.170657-158/axis-1.4.1-20121003.170657-158-javadoc.jar
[JENKINS] Archiving <https://builds.apache.org/job/axis-trunk/ws/axis/samples/jaxm-sample/pom.xml>
to /home/hudson/hudson/jobs/axis-trunk/modules/org.apache.axis$jaxm-sample/builds/2012-10-03_17-04-06/archive/org.apache.axis/jaxm-sample/1.4.1-SNAPSHOT/jaxm-sample-1.4.1-SNAPSHOT.pom
[JENKINS] Archiving <https://builds.apache.org/job/axis-trunk/ws/axis/axis-standalone-server/pom.xml>
to /home/hudson/hudson/jobs/axis-trunk/modules/org.apache.axis$axis-standalone-server/builds/2012-10-03_17-04-03/archive/org.apache.axis/axis-standalone-server/1.4.1-SNAPSHOT/axis-standalone-server-1.4.1-SNAPSHOT.pom
[JENKINS] Archiving <https://builds.apache.org/job/axis-trunk/ws/axis/axis-standalone-server/target/axis-standalone-server-1.4.1-SNAPSHOT.jar>
to /home/hudson/hudson/jobs/axis-trunk/modules/org.apache.axis$axis-standalone-server/builds/2012-10-03_17-04-03/archive/org.apache.axis/axis-standalone-server/1.4.1-20121003.170825-116/axis-standalone-server-1.4.1-20121003.170825-116.jar
[JENKINS] Archiving <https://builds.apache.org/job/axis-trunk/ws/axis/axis-standalone-server/target/axis-standalone-server-1.4.1-SNAPSHOT-sources.jar>
to /home/hudson/hudson/jobs/axis-trunk/modules/org.apache.axis$axis-standalone-server/builds/2012-10-03_17-04-03/archive/org.apache.axis/axis-standalone-server/1.4.1-20121003.170825-116/axis-standalone-server-1.4.1-20121003.170825-116-sources.jar
[JENKINS] Archiving <https://builds.apache.org/job/axis-trunk/ws/axis/axis-standalone-server/target/axis-standalone-server-1.4.1-SNAPSHOT-javadoc.jar>
to /home/hudson/hudson/jobs/axis-trunk/modules/org.apache.axis$axis-standalone-server/builds/2012-10-03_17-04-03/archive/org.apache.axis/axis-standalone-server/1.4.1-20121003.170825-116/axis-standalone-server-1.4.1-20121003.170825-116-javadoc.jar
[JENKINS] Archiving <https://builds.apache.org/job/axis-trunk/ws/axis/maven/maven-axis-server-plugin/pom.xml>
to /home/hudson/hudson/jobs/axis-trunk/modules/org.apache.axis$maven-axis-server-plugin/builds/2012-10-03_17-04-03/archive/org.apache.axis/maven-axis-server-plugin/1.4.1-SNAPSHOT/maven-axis-server-plugin-1.4.1-SNAPSHOT.pom
[JENKINS] Archiving <https://builds.apache.org/job/axis-trunk/ws/axis/maven/maven-axis-server-plugin/target/maven-axis-server-plugin-1.4.1-SNAPSHOT.jar>
to /home/hudson/hudson/jobs/axis-trunk/modules/org.apache.axis$maven-axis-server-plugin/builds/2012-10-03_17-04-03/archive/org.apache.axis/maven-axis-server-plugin/1.4.1-20121003.170815-70/maven-axis-server-plugin-1.4.1-20121003.170815-70.jar
[JENKINS] Archiving <https://builds.apache.org/job/axis-trunk/ws/axis/maven/maven-axis-server-plugin/target/maven-axis-server-plugin-1.4.1-SNAPSHOT-sources.jar>
to /home/hudson/hudson/jobs/axis-trunk/modules/org.apache.axis$maven-axis-server-plugin/builds/2012-10-03_17-04-03/archive/org.apache.axis/maven-axis-server-plugin/1.4.1-20121003.170815-70/maven-axis-server-plugin-1.4.1-20121003.170815-70-sources.jar
[JENKINS] Archiving <https://builds.apache.org/job/axis-trunk/ws/axis/maven/maven-axis-server-plugin/target/maven-axis-server-plugin-1.4.1-SNAPSHOT-javadoc.jar>
to /home/hudson/hudson/jobs/axis-trunk/modules/org.apache.axis$maven-axis-server-plugin/builds/2012-10-03_17-04-03/archive/org.apache.axis/maven-axis-server-plugin/1.4.1-20121003.170815-70/maven-axis-server-plugin-1.4.1-20121003.170815-70-javadoc.jar
[JENKINS] Archiving <https://builds.apache.org/job/axis-trunk/ws/axis/axis-ant/pom.xml>
to /home/hudson/hudson/jobs/axis-trunk/modules/org.apache.axis$axis-ant/builds/2012-10-03_17-04-02/archive/org.apache.axis/axis-ant/1.4.1-SNAPSHOT/axis-ant-1.4.1-SNAPSHOT.pom
[JENKINS] Archiving <https://builds.apache.org/job/axis-trunk/ws/axis/axis-ant/target/axis-ant-1.4.1-SNAPSHOT.jar>
to /home/hudson/hudson/jobs/axis-trunk/modules/org.apache.axis$axis-ant/builds/2012-10-03_17-04-02/archive/org.apache.axis/axis-ant/1.4.1-20121003.170723-152/axis-ant-1.4.1-20121003.170723-152.jar
[JENKINS] Archiving <https://builds.apache.org/job/axis-trunk/ws/axis/axis-ant/target/axis-ant-1.4.1-SNAPSHOT-sources.jar>
to /home/hudson/hudson/jobs/axis-trunk/modules/org.apache.axis$axis-ant/builds/2012-10-03_17-04-02/archive/org.apache.axis/axis-ant/1.4.1-20121003.170723-152/axis-ant-1.4.1-20121003.170723-152-sources.jar
[JENKINS] Archiving <https://builds.apache.org/job/axis-trunk/ws/axis/axis-ant/target/axis-ant-1.4.1-SNAPSHOT-javadoc.jar>
to /home/hudson/hudson/jobs/axis-trunk/modules/org.apache.axis$axis-ant/builds/2012-10-03_17-04-02/archive/org.apache.axis/axis-ant/1.4.1-20121003.170723-152/axis-ant-1.4.1-20121003.170723-152-javadoc.jar
[JENKINS] Archiving <https://builds.apache.org/job/axis-trunk/ws/axis/axis-castor/pom.xml>
to /home/hudson/hudson/jobs/axis-trunk/modules/org.apache.axis$axis-castor/builds/2012-10-03_17-04-03/archive/org.apache.axis/axis-castor/1.4.1-SNAPSHOT/axis-castor-1.4.1-SNAPSHOT.pom
[JENKINS] Archiving <https://builds.apache.org/job/axis-trunk/ws/axis/axis-castor/target/axis-castor-1.4.1-SNAPSHOT.jar>
to /home/hudson/hudson/jobs/axis-trunk/modules/org.apache.axis$axis-castor/builds/2012-10-03_17-04-03/archive/org.apache.axis/axis-castor/1.4.1-20121003.170834-112/axis-castor-1.4.1-20121003.170834-112.jar
[JENKINS] Archiving <https://builds.apache.org/job/axis-trunk/ws/axis/axis-castor/target/axis-castor-1.4.1-SNAPSHOT-sources.jar>
to /home/hudson/hudson/jobs/axis-trunk/modules/org.apache.axis$axis-castor/builds/2012-10-03_17-04-03/archive/org.apache.axis/axis-castor/1.4.1-20121003.170834-112/axis-castor-1.4.1-20121003.170834-112-sources.jar
[JENKINS] Archiving <https://builds.apache.org/job/axis-trunk/ws/axis/axis-castor/target/axis-castor-1.4.1-SNAPSHOT-javadoc.jar>
to /home/hudson/hudson/jobs/axis-trunk/modules/org.apache.axis$axis-castor/builds/2012-10-03_17-04-03/archive/org.apache.axis/axis-castor/1.4.1-20121003.170834-112/axis-castor-1.4.1-20121003.170834-112-javadoc.jar
[JENKINS] Archiving <https://builds.apache.org/job/axis-trunk/ws/axis/axis-war/pom.xml>
to /home/hudson/hudson/jobs/axis-trunk/modules/org.apache.axis$axis-war/builds/2012-10-03_17-04-04/archive/org.apache.axis/axis-war/1.4.1-SNAPSHOT/axis-war-1.4.1-SNAPSHOT.pom
[JENKINS] Archiving <https://builds.apache.org/job/axis-trunk/ws/axis/maven/maven-java2wsdl-plugin/pom.xml>
to /home/hudson/hudson/jobs/axis-trunk/modules/org.apache.axis$maven-java2wsdl-plugin/builds/2012-10-03_17-04-03/archive/org.apache.axis/maven-java2wsdl-plugin/1.4.1-SNAPSHOT/maven-java2wsdl-plugin-1.4.1-SNAPSHOT.pom
[JENKINS] Archiving <https://builds.apache.org/job/axis-trunk/ws/axis/maven/maven-java2wsdl-plugin/target/maven-java2wsdl-plugin-1.4.1-SNAPSHOT.jar>
to /home/hudson/hudson/jobs/axis-trunk/modules/org.apache.axis$maven-java2wsdl-plugin/builds/2012-10-03_17-04-03/archive/org.apache.axis/maven-java2wsdl-plugin/1.4.1-20121003.170804-59/maven-java2wsdl-plugin-1.4.1-20121003.170804-59.jar
[JENKINS] Archiving <https://builds.apache.org/job/axis-trunk/ws/axis/maven/maven-java2wsdl-plugin/target/maven-java2wsdl-plugin-1.4.1-SNAPSHOT-sources.jar>
to /home/hudson/hudson/jobs/axis-trunk/modules/org.apache.axis$maven-java2wsdl-plugin/builds/2012-10-03_17-04-03/archive/org.apache.axis/maven-java2wsdl-plugin/1.4.1-20121003.170804-59/maven-java2wsdl-plugin-1.4.1-20121003.170804-59-sources.jar
[JENKINS] Archiving <https://builds.apache.org/job/axis-trunk/ws/axis/maven/maven-java2wsdl-plugin/target/maven-java2wsdl-plugin-1.4.1-SNAPSHOT-javadoc.jar>
to /home/hudson/hudson/jobs/axis-trunk/modules/org.apache.axis$maven-java2wsdl-plugin/builds/2012-10-03_17-04-03/archive/org.apache.axis/maven-java2wsdl-plugin/1.4.1-20121003.170804-59/maven-java2wsdl-plugin-1.4.1-20121003.170804-59-javadoc.jar
[JENKINS] Archiving <https://builds.apache.org/job/axis-trunk/ws/axis/samples/mtomstub-sample/pom.xml>
to /home/hudson/hudson/jobs/axis-trunk/modules/org.apache.axis$mtomstub-sample/builds/2012-10-03_17-04-06/archive/org.apache.axis/mtomstub-sample/1.4.1-SNAPSHOT/mtomstub-sample-1.4.1-SNAPSHOT.pom
[JENKINS] Archiving <https://builds.apache.org/job/axis-trunk/ws/axis/axis-jms/pom.xml>
to /home/hudson/hudson/jobs/axis-trunk/modules/org.apache.axis$axis-jms/builds/2012-10-03_17-04-04/archive/org.apache.axis/axis-jms/1.4.1-SNAPSHOT/axis-jms-1.4.1-SNAPSHOT.pom
[JENKINS] Archiving <https://builds.apache.org/job/axis-trunk/ws/axis/samples/transport-sample/pom.xml>
to /home/hudson/hudson/jobs/axis-trunk/modules/org.apache.axis$transport-sample/builds/2012-10-03_17-04-07/archive/org.apache.axis/transport-sample/1.4.1-SNAPSHOT/transport-sample-1.4.1-SNAPSHOT.pom
[JENKINS] Archiving <https://builds.apache.org/job/axis-trunk/ws/axis/samples/message-sample/pom.xml>
to /home/hudson/hudson/jobs/axis-trunk/modules/org.apache.axis$message-sample/builds/2012-10-03_17-04-06/archive/org.apache.axis/message-sample/1.4.1-SNAPSHOT/message-sample-1.4.1-SNAPSHOT.pom
[JENKINS] Archiving <https://builds.apache.org/job/axis-trunk/ws/axis/samples/misc-sample/pom.xml>
to /home/hudson/hudson/jobs/axis-trunk/modules/org.apache.axis$misc-sample/builds/2012-10-03_17-04-06/archive/org.apache.axis/misc-sample/1.4.1-SNAPSHOT/misc-sample-1.4.1-SNAPSHOT.pom
[JENKINS] Archiving <https://builds.apache.org/job/axis-trunk/ws/axis/maven/nsmap/pom.xml>
to /home/hudson/hudson/jobs/axis-trunk/modules/org.apache.axis$nsmap/builds/2012-10-03_17-04-02/archive/org.apache.axis/nsmap/1.4.1-SNAPSHOT/nsmap-1.4.1-SNAPSHOT.pom
[JENKINS] Archiving <https://builds.apache.org/job/axis-trunk/ws/axis/maven/nsmap/target/nsmap-1.4.1-SNAPSHOT.jar>
to /home/hudson/hudson/jobs/axis-trunk/modules/org.apache.axis$nsmap/builds/2012-10-03_17-04-02/archive/org.apache.axis/nsmap/1.4.1-20121003.170735-61/nsmap-1.4.1-20121003.170735-61.jar
[JENKINS] Archiving <https://builds.apache.org/job/axis-trunk/ws/axis/maven/nsmap/target/nsmap-1.4.1-SNAPSHOT-sources.jar>
to /home/hudson/hudson/jobs/axis-trunk/modules/org.apache.axis$nsmap/builds/2012-10-03_17-04-02/archive/org.apache.axis/nsmap/1.4.1-20121003.170735-61/nsmap-1.4.1-20121003.170735-61-sources.jar
[JENKINS] Archiving <https://builds.apache.org/job/axis-trunk/ws/axis/maven/nsmap/target/nsmap-1.4.1-SNAPSHOT-javadoc.jar>
to /home/hudson/hudson/jobs/axis-trunk/modules/org.apache.axis$nsmap/builds/2012-10-03_17-04-02/archive/org.apache.axis/nsmap/1.4.1-20121003.170735-61/nsmap-1.4.1-20121003.170735-61-javadoc.jar
[JENKINS] Archiving <https://builds.apache.org/job/axis-trunk/ws/axis/axis-saaj/pom.xml>
to /home/hudson/hudson/jobs/axis-trunk/modules/org.apache.axis$axis-saaj/builds/2012-10-03_17-04-02/archive/org.apache.axis/axis-saaj/1.4.1-SNAPSHOT/axis-saaj-1.4.1-SNAPSHOT.pom
[JENKINS] Archiving <https://builds.apache.org/job/axis-trunk/ws/axis/axis-saaj/target/axis-saaj-1.4.1-SNAPSHOT.jar>
to /home/hudson/hudson/jobs/axis-trunk/modules/org.apache.axis$axis-saaj/builds/2012-10-03_17-04-02/archive/org.apache.axis/axis-saaj/1.4.1-20121003.170542-162/axis-saaj-1.4.1-20121003.170542-162.jar
[JENKINS] Archiving <https://builds.apache.org/job/axis-trunk/ws/axis/axis-saaj/target/axis-saaj-1.4.1-SNAPSHOT-sources.jar>
to /home/hudson/hudson/jobs/axis-trunk/modules/org.apache.axis$axis-saaj/builds/2012-10-03_17-04-02/archive/org.apache.axis/axis-saaj/1.4.1-20121003.170542-162/axis-saaj-1.4.1-20121003.170542-162-sources.jar
[JENKINS] Archiving <https://builds.apache.org/job/axis-trunk/ws/axis/axis-saaj/target/axis-saaj-1.4.1-SNAPSHOT-javadoc.jar>
to /home/hudson/hudson/jobs/axis-trunk/modules/org.apache.axis$axis-saaj/builds/2012-10-03_17-04-02/archive/org.apache.axis/axis-saaj/1.4.1-20121003.170542-162/axis-saaj-1.4.1-20121003.170542-162-javadoc.jar
[JENKINS] Archiving <https://builds.apache.org/job/axis-trunk/ws/axis/axis-rt-transports-http-javanet/pom.xml>
to /home/hudson/hudson/jobs/axis-trunk/modules/org.apache.axis$axis-rt-transports-http-javanet/builds/2012-10-03_17-04-03/archive/org.apache.axis/axis-rt-transports-http-javanet/1.4.1-SNAPSHOT/axis-rt-transports-http-javanet-1.4.1-SNAPSHOT.pom
[JENKINS] Archiving <https://builds.apache.org/job/axis-trunk/ws/axis/axis-testutils/pom.xml>
to /home/hudson/hudson/jobs/axis-trunk/modules/org.apache.axis$axis-testutils/builds/2012-10-03_17-04-04/archive/org.apache.axis/axis-testutils/1.4.1-SNAPSHOT/axis-testutils-1.4.1-SNAPSHOT.pom
[JENKINS] Archiving <https://builds.apache.org/job/axis-trunk/ws/axis/axis-testutils/target/axis-testutils-1.4.1-SNAPSHOT.jar>
to /home/hudson/hudson/jobs/axis-trunk/modules/org.apache.axis$axis-testutils/builds/2012-10-03_17-04-04/archive/org.apache.axis/axis-testutils/1.4.1-20121003.170710-17/axis-testutils-1.4.1-20121003.170710-17.jar
[JENKINS] Archiving <https://builds.apache.org/job/axis-trunk/ws/axis/axis-testutils/target/axis-testutils-1.4.1-SNAPSHOT-sources.jar>
to /home/hudson/hudson/jobs/axis-trunk/modules/org.apache.axis$axis-testutils/builds/2012-10-03_17-04-04/archive/org.apache.axis/axis-testutils/1.4.1-20121003.170710-17/axis-testutils-1.4.1-20121003.170710-17-sources.jar
[JENKINS] Archiving <https://builds.apache.org/job/axis-trunk/ws/axis/axis-testutils/target/axis-testutils-1.4.1-SNAPSHOT-javadoc.jar>
to /home/hudson/hudson/jobs/axis-trunk/modules/org.apache.axis$axis-testutils/builds/2012-10-03_17-04-04/archive/org.apache.axis/axis-testutils/1.4.1-20121003.170710-17/axis-testutils-1.4.1-20121003.170710-17-javadoc.jar
[JENKINS] Archiving <https://builds.apache.org/job/axis-trunk/ws/axis/maven/pom.xml>
to /home/hudson/hudson/jobs/axis-trunk/modules/org.apache.axis$maven/builds/2012-10-03_17-04-02/archive/org.apache.axis/maven/1.4.1-SNAPSHOT/maven-1.4.1-SNAPSHOT.pom
Waiting for Jenkins to finish collecting data
mavenExecutionResult exceptions not empty
message : Failed to execute goal org.apache.maven.plugins:maven-javadoc-plugin:2.5:jar (attach-javadocs)
on project interop-mock: MavenReportException: Error while creating archive:Exit code: 1 -
<https://builds.apache.org/job/axis-trunk/ws/axis/interop-mock/src/main/java/org/apache/axis/test/interop/mock/MockPostHandler.java>:49:
generics are not supported in -source 1.4
(try -source 1.5 to enable generics)
    private List<Exchange> exchanges;
                ^
<https://builds.apache.org/job/axis-trunk/ws/axis/interop-mock/src/main/java/org/apache/axis/test/interop/mock/MockPostHandler.java>:95:
for-each loops are not supported in -source 1.4
(try -source 1.5 to enable for-each loops)
        for (Exchange exchange : exchanges) {
                               ^
<https://builds.apache.org/job/axis-trunk/ws/axis/interop-mock/src/main/java/org/apache/axis/test/interop/mock/Exchange.java>:69:
generics are not supported in -source 1.4
(try -source 1.5 to enable generics)
        Map<String,String> inferredVariables = new HashMap<String,String>();
           ^

Command line was:/home/jenkins/tools/java/jdk1.5.0_22-32/jre/../bin/javadoc @options @packages
cause : MavenReportException: Error while creating archive:Exit code: 1 - <https://builds.apache.org/job/axis-trunk/ws/axis/interop-mock/src/main/java/org/apache/axis/test/interop/mock/MockPostHandler.java>:49:
generics are not supported in -source 1.4
(try -source 1.5 to enable generics)
    private List<Exchange> exchanges;
                ^
<https://builds.apache.org/job/axis-trunk/ws/axis/interop-mock/src/main/java/org/apache/axis/test/interop/mock/MockPostHandler.java>:95:
for-each loops are not supported in -source 1.4
(try -source 1.5 to enable for-each loops)
        for (Exchange exchange : exchanges) {
                               ^
<https://builds.apache.org/job/axis-trunk/ws/axis/interop-mock/src/main/java/org/apache/axis/test/interop/mock/Exchange.java>:69:
generics are not supported in -source 1.4
(try -source 1.5 to enable generics)
        Map<String,String> inferredVariables = new HashMap<String,String>();
           ^

Command line was:/home/jenkins/tools/java/jdk1.5.0_22-32/jre/../bin/javadoc @options @packages
Stack trace : 
org.apache.maven.lifecycle.LifecycleExecutionException: Failed to execute goal org.apache.maven.plugins:maven-javadoc-plugin:2.5:jar
(attach-javadocs) on project interop-mock: MavenReportException: Error while creating archive:Exit
code: 1 - <https://builds.apache.org/job/axis-trunk/ws/axis/interop-mock/src/main/java/org/apache/axis/test/interop/mock/MockPostHandler.java>:49:
generics are not supported in -source 1.4
(try -source 1.5 to enable generics)
    private List<Exchange> exchanges;
                ^
<https://builds.apache.org/job/axis-trunk/ws/axis/interop-mock/src/main/java/org/apache/axis/test/interop/mock/MockPostHandler.java>:95:
for-each loops are not supported in -source 1.4
(try -source 1.5 to enable for-each loops)
        for (Exchange exchange : exchanges) {
                               ^
<https://builds.apache.org/job/axis-trunk/ws/axis/interop-mock/src/main/java/org/apache/axis/test/interop/mock/Exchange.java>:69:
generics are not supported in -source 1.4
(try -source 1.5 to enable generics)
        Map<String,String> inferredVariables = new HashMap<String,String>();
           ^

Command line was:/home/jenkins/tools/java/jdk1.5.0_22-32/jre/../bin/javadoc @options @packages
	at org.apache.maven.lifecycle.internal.MojoExecutor.execute(MojoExecutor.java:217)
	at org.apache.maven.lifecycle.internal.MojoExecutor.execute(MojoExecutor.java:153)
	at org.apache.maven.lifecycle.internal.MojoExecutor.execute(MojoExecutor.java:145)
	at org.apache.maven.lifecycle.internal.LifecycleModuleBuilder.buildProject(LifecycleModuleBuilder.java:84)
	at org.apache.maven.lifecycle.internal.LifecycleModuleBuilder.buildProject(LifecycleModuleBuilder.java:59)
	at org.apache.maven.lifecycle.internal.LifecycleStarter.singleThreadedBuild(LifecycleStarter.java:183)
	at org.apache.maven.lifecycle.internal.LifecycleStarter.execute(LifecycleStarter.java:161)
	at org.apache.maven.DefaultMaven.doExecute(DefaultMaven.java:320)
	at org.apache.maven.DefaultMaven.execute(DefaultMaven.java:156)
	at org.jvnet.hudson.maven3.launcher.Maven3Launcher.main(Maven3Launcher.java:79)
	at sun.reflect.NativeMethodAccessorImpl.invoke0(Native Method)
	at sun.reflect.NativeMethodAccessorImpl.invoke(NativeMethodAccessorImpl.java:39)
	at sun.reflect.DelegatingMethodAccessorImpl.invoke(DelegatingMethodAccessorImpl.java:25)
	at java.lang.reflect.Method.invoke(Method.java:592)
	at org.codehaus.plexus.classworlds.launcher.Launcher.launchStandard(Launcher.java:329)
	at org.codehaus.plexus.classworlds.launcher.Launcher.launch(Launcher.java:239)
	at org.jvnet.hudson.maven3.agent.Maven3Main.launch(Maven3Main.java:158)
	at hudson.maven.Maven3Builder.call(Maven3Builder.java:98)
	at hudson.maven.Maven3Builder.call(Maven3Builder.java:64)
	at hudson.remoting.UserRequest.perform(UserRequest.java:118)
	at hudson.remoting.UserRequest.perform(UserRequest.java:48)
	at hudson.remoting.Request$2.run(Request.java:326)
	at hudson.remoting.InterceptingExecutorService$1.call(InterceptingExecutorService.java:72)
	at java.util.concurrent.FutureTask$Sync.innerRun(FutureTask.java:269)
	at java.util.concurrent.FutureTask.run(FutureTask.java:123)
	at java.util.concurrent.ThreadPoolExecutor$Worker.runTask(ThreadPoolExecutor.java:651)
	at java.util.concurrent.ThreadPoolExecutor$Worker.run(ThreadPoolExecutor.java:676)
	at java.lang.Thread.run(Thread.java:595)
Caused by: org.apache.maven.plugin.MojoExecutionException: MavenReportException: Error while
creating archive:Exit code: 1 - <https://builds.apache.org/job/axis-trunk/ws/axis/interop-mock/src/main/java/org/apache/axis/test/interop/mock/MockPostHandler.java>:49:
generics are not supported in -source 1.4
(try -source 1.5 to enable generics)
    private List<Exchange> exchanges;
                ^
<https://builds.apache.org/job/axis-trunk/ws/axis/interop-mock/src/main/java/org/apache/axis/test/interop/mock/MockPostHandler.java>:95:
for-each loops are not supported in -source 1.4
(try -source 1.5 to enable for-each loops)
        for (Exchange exchange : exchanges) {
                               ^
<https://builds.apache.org/job/axis-trunk/ws/axis/interop-mock/src/main/java/org/apache/axis/test/interop/mock/Exchange.java>:69:
generics are not supported in -source 1.4
(try -source 1.5 to enable generics)
        Map<String,String> inferredVariables = new HashMap<String,String>();
           ^

Command line was:/home/jenkins/tools/java/jdk1.5.0_22-32/jre/../bin/javadoc @options @packages
	at org.apache.maven.plugin.javadoc.JavadocJar.execute(JavadocJar.java:226)
	at org.apache.maven.plugin.DefaultBuildPluginManager.executeMojo(DefaultBuildPluginManager.java:101)
	at org.apache.maven.lifecycle.internal.MojoExecutor.execute(MojoExecutor.java:209)
	... 27 more
Caused by: org.apache.maven.reporting.MavenReportException: Exit code: 1 - <https://builds.apache.org/job/axis-trunk/ws/axis/interop-mock/src/main/java/org/apache/axis/test/interop/mock/MockPostHandler.java>:49:
generics are not supported in -source 1.4
(try -source 1.5 to enable generics)
    private List<Exchange> exchanges;
                ^
<https://builds.apache.org/job/axis-trunk/ws/axis/interop-mock/src/main/java/org/apache/axis/test/interop/mock/MockPostHandler.java>:95:
for-each loops are not supported in -source 1.4
(try -source 1.5 to enable for-each loops)
        for (Exchange exchange : exchanges) {
                               ^
<https://builds.apache.org/job/axis-trunk/ws/axis/interop-mock/src/main/java/org/apache/axis/test/interop/mock/Exchange.java>:69:
generics are not supported in -source 1.4
(try -source 1.5 to enable generics)
        Map<String,String> inferredVariables = new HashMap<String,String>();
           ^

Command line was:/home/jenkins/tools/java/jdk1.5.0_22-32/jre/../bin/javadoc @options @packages
	at org.apache.maven.plugin.javadoc.AbstractJavadocMojo.executeJavadocCommandLine(AbstractJavadocMojo.java:4013)
	at org.apache.maven.plugin.javadoc.AbstractJavadocMojo.executeReport(AbstractJavadocMojo.java:1593)
	at org.apache.maven.plugin.javadoc.JavadocJar.execute(JavadocJar.java:182)
	... 29 more
Sending e-mails to: java-dev@axis.apache.org andreas.veithen@gmail.com
channel stopped

---------------------------------------------------------------------
To unsubscribe, e-mail: java-dev-unsubscribe@axis.apache.org
For additional commands, e-mail: java-dev-help@axis.apache.org


Mime
View raw message