axis-java-dev mailing list archives

Site index · List index
Message view « Date » · « Thread »
Top « Date » · « Thread »
From Apache Jenkins Server <jenk...@builds.apache.org>
Subject Build failed in Jenkins: Axis2 » Apache Axis2 - SAAJ #1629
Date Wed, 11 Jul 2012 10:22:03 GMT
See <https://builds.apache.org/job/Axis2/org.apache.axis2$axis2-saaj/1629/>

------------------------------------------
[INFO] ------------------------------------------------------------------------
[INFO] Building Apache Axis2 - SAAJ
[INFO]    task-segment: [clean, deploy]
[INFO] ------------------------------------------------------------------------
[INFO] [clean:clean {execution: default-clean}]
[INFO] Deleting directory <https://builds.apache.org/job/Axis2/org.apache.axis2$axis2-saaj/ws/target>
[INFO] [remote-resources:process {execution: default}]
[INFO] [resources:resources {execution: default-resources}]
[INFO] Using 'UTF-8' encoding to copy filtered resources.
[INFO] Copying 4 resources
[INFO] Copying 2 resources
[INFO] [compiler:compile {execution: default-compile}]
[INFO] Compiling 27 source files to <https://builds.apache.org/job/Axis2/org.apache.axis2$axis2-saaj/ws/target/classes>
[INFO] [resources:testResources {execution: default-testResources}]
[INFO] Using 'UTF-8' encoding to copy filtered resources.
[INFO] Copying 13 resources
[INFO] Copying 2 resources
[INFO] [compiler:testCompile {execution: default-testCompile}]
[INFO] Compiling 24 source files to <https://builds.apache.org/job/Axis2/org.apache.axis2$axis2-saaj/ws/target/test-classes>
[INFO] -------------------------------------------------------------
[ERROR] COMPILATION ERROR : 
[INFO] -------------------------------------------------------------
[ERROR] <https://builds.apache.org/job/Axis2/org.apache.axis2$axis2-saaj/ws/test/org/apache/axis2/saaj/SOAPPartTest.java>:[227,59]
cannot find symbol
symbol  : method createSOAPMessage(org.apache.axiom.soap.SOAPEnvelope,<nulltype>)
location: class org.apache.axiom.soap.impl.dom.soap11.SOAP11Factory

[INFO] 1error
[INFO] -------------------------------------------------------------
[JENKINS] Archiving <https://builds.apache.org/job/Axis2/org.apache.axis2$axis2-saaj/ws/pom.xml>
to /home/hudson/hudson/jobs/Axis2/modules/org.apache.axis2$axis2-saaj/builds/2012-07-11_10-17-32/archive/org.apache.axis2/axis2-saaj/1.7.0-SNAPSHOT/axis2-saaj-1.7.0-SNAPSHOT.pom
[INFO] ------------------------------------------------------------------------
[ERROR] BUILD FAILURE
[INFO] ------------------------------------------------------------------------
[INFO] Compilation failure
<https://builds.apache.org/job/Axis2/org.apache.axis2$axis2-saaj/ws/test/org/apache/axis2/saaj/SOAPPartTest.java>:[227,59]
cannot find symbol
symbol  : method createSOAPMessage(org.apache.axiom.soap.SOAPEnvelope,<nulltype>)
location: class org.apache.axiom.soap.impl.dom.soap11.SOAP11Factory


[INFO] ------------------------------------------------------------------------
[INFO] For more information, run Maven with the -e switch
[INFO] ------------------------------------------------------------------------
[INFO] Total time: 4 minutes 23 seconds
[INFO] Finished at: Wed Jul 11 10:22:02 GMT 2012
[INFO] Final Memory: 94M/240M
[INFO] ------------------------------------------------------------------------
Maven failed with error.

---------------------------------------------------------------------
To unsubscribe, e-mail: java-dev-unsubscribe@axis.apache.org
For additional commands, e-mail: java-dev-help@axis.apache.org


Mime
View raw message