axis-java-dev mailing list archives

Site index · List index
Message view « Date » · « Thread »
Top « Date » · « Thread »
From Apache Jenkins Server <jenk...@builds.apache.org>
Subject Build failed in Jenkins: Axis2 #1632
Date Thu, 12 Jul 2012 02:45:27 GMT
See <https://builds.apache.org/job/Axis2/1632/>

------------------------------------------
[...truncated 16682 lines...]
Running org.apache.axis2.engine.MessageContextTest
Tests run: 1, Failures: 0, Errors: 0, Skipped: 0, Time elapsed: 0.018 sec
Running org.apache.axis2.engine.ObjectSaveTest
Tests run: 5, Failures: 0, Errors: 0, Skipped: 0, Time elapsed: 0.045 sec
Running org.apache.axis2.mtom.EchoRawMTOMFileCacheTest
Running org.apache.axis2.engine.EchoRawXMLOnTwoChannelsTest
Running org.apache.axis2.engine.CharactersetEncodingTest

Results :

Tests run: 283, Failures: 0, Errors: 0, Skipped: 0

[JENKINS] Recording test results
[INFO] [jar:jar {execution: default-jar}]
[INFO] Building jar: <https://builds.apache.org/job/Axis2/ws/axis2/modules/integration/target/axis2-integration-1.7.0-SNAPSHOT.jar>
[INFO] [assembly:single {execution: source-release-assembly}]
[INFO] Skipping the assembly in this project because it's not the Execution Root
[INFO] Preparing source:jar
[WARNING] Removing: jar from forked lifecycle, to prevent recursive invocation.
[INFO] No goals needed for project - skipping
[INFO] [source:jar {execution: attach-sources}]
[INFO] Building jar: <https://builds.apache.org/job/Axis2/ws/axis2/modules/integration/target/axis2-integration-1.7.0-SNAPSHOT-sources.jar>
[INFO] [javadoc:jar {execution: attach-javadocs}]
[INFO] [gpg:sign {execution: default}]
[INFO] [install:install {execution: default-install}]
[INFO] Installing <https://builds.apache.org/job/Axis2/ws/axis2/modules/integration/target/axis2-integration-1.7.0-SNAPSHOT.jar>
to <https://builds.apache.org/job/Axis2/ws/.repository/org/apache/axis2/axis2-integration/1.7.0-SNAPSHOT/axis2-integration-1.7.0-SNAPSHOT.jar>
[INFO] Installing <https://builds.apache.org/job/Axis2/ws/axis2/modules/integration/target/axis2-integration-1.7.0-SNAPSHOT-sources.jar>
to <https://builds.apache.org/job/Axis2/ws/.repository/org/apache/axis2/axis2-integration/1.7.0-SNAPSHOT/axis2-integration-1.7.0-SNAPSHOT-sources.jar>
[INFO] [deploy:deploy {execution: default-deploy}]
[INFO] Retrieving previous build number from apache.snapshots.https
Uploading: https://repository.apache.org/content/repositories/snapshots/org/apache/axis2/axis2-integration/1.7.0-SNAPSHOT/axis2-integration-1.7.0-20120712.021045-827.jar
11K uploaded  (axis2-integration-1.7.0-20120712.021045-827.jar)
[INFO] Retrieving previous metadata from apache.snapshots.https
[INFO] Uploading repository metadata for: 'artifact org.apache.axis2:axis2-integration'
[INFO] Retrieving previous metadata from apache.snapshots.https
[INFO] Uploading repository metadata for: 'snapshot org.apache.axis2:axis2-integration:1.7.0-SNAPSHOT'
[INFO] Uploading project information for axis2-integration 1.7.0-20120712.021045-827
[INFO] Retrieving previous build number from apache.snapshots.https
Uploading: https://repository.apache.org/content/repositories/snapshots/org/apache/axis2/axis2-integration/1.7.0-SNAPSHOT/axis2-integration-1.7.0-20120712.021045-827-sources.jar
6K uploaded  (axis2-integration-1.7.0-20120712.021045-827-sources.jar)
[JENKINS] Archiving <https://builds.apache.org/job/Axis2/ws/axis2/modules/integration/pom.xml>
to /home/hudson/hudson/jobs/Axis2/modules/org.apache.axis2$axis2-integration/builds/2012-07-12_02-09-39/archive/org.apache.axis2/axis2-integration/1.7.0-SNAPSHOT/axis2-integration-1.7.0-SNAPSHOT.pom
[JENKINS] Archiving <https://builds.apache.org/job/Axis2/ws/axis2/modules/integration/target/axis2-integration-1.7.0-SNAPSHOT.jar>
to /home/hudson/hudson/jobs/Axis2/modules/org.apache.axis2$axis2-integration/builds/2012-07-12_02-09-39/archive/org.apache.axis2/axis2-integration/1.7.0-20120712.021045-827/axis2-integration-1.7.0-20120712.021045-827.jar
[JENKINS] Archiving <https://builds.apache.org/job/Axis2/ws/axis2/modules/integration/target/axis2-integration-1.7.0-SNAPSHOT-sources.jar>
to /home/hudson/hudson/jobs/Axis2/modules/org.apache.axis2$axis2-integration/builds/2012-07-12_02-09-39/archive/org.apache.axis2/axis2-integration/1.7.0-20120712.021045-827/axis2-integration-1.7.0-20120712.021045-827-sources.jar
[INFO] ------------------------------------------------------------------------
[INFO] Building Apache Axis2 - JiBX Data Binding
[INFO]    task-segment: [clean, deploy]
[INFO] ------------------------------------------------------------------------
[INFO] [clean:clean {execution: default-clean}]
[INFO] [remote-resources:process {execution: default}]
Downloading: http://repo1.maven.org/maven2/org/jibx/jibx-bind/1.2/jibx-bind-1.2.pom
2K downloaded  (jibx-bind-1.2.pom)
Downloading: http://jibx.sf.net/maven2/org/jibx/jibx-run/1.2/jibx-run-1.2.pom
1K downloaded  (jibx-run-1.2.pom)
Downloading: http://jibx.sf.net/maven2/bcel/bcel/5.1/bcel-5.1.pom
[INFO] Unable to find resource 'bcel:bcel:pom:5.1' in repository jibx.sf.net (http://jibx.sf.net/maven2)
Downloading: http://repo1.maven.org/maven2/bcel/bcel/5.1/bcel-5.1.pom
310b downloaded  (bcel-5.1.pom)
Downloading: http://jibx.sf.net/maven2/regexp/regexp/1.2/regexp-1.2.pom
[INFO] Unable to find resource 'regexp:regexp:pom:1.2' in repository jibx.sf.net (http://jibx.sf.net/maven2)
Downloading: http://repo1.maven.org/maven2/regexp/regexp/1.2/regexp-1.2.pom
145b downloaded  (regexp-1.2.pom)
Downloading: http://jibx.sf.net/maven2/bcel/bcel/5.1/bcel-5.1.jar
Downloading: http://jibx.sf.net/maven2/regexp/regexp/1.2/regexp-1.2.jar
Downloading: http://repo1.maven.org/maven2/org/jibx/jibx-bind/1.2/jibx-bind-1.2.jar
398K downloaded  (jibx-bind-1.2.jar)
Downloading: http://repo1.maven.org/maven2/org/jibx/jibx-run/1.2/jibx-run-1.2.jar
125K downloaded  (jibx-run-1.2.jar)
[INFO] Unable to find resource 'bcel:bcel:jar:5.1' in repository jibx.sf.net (http://jibx.sf.net/maven2)
Downloading: http://repo1.maven.org/maven2/bcel/bcel/5.1/bcel-5.1.jar
[INFO] Unable to find resource 'regexp:regexp:jar:1.2' in repository jibx.sf.net (http://jibx.sf.net/maven2)
Downloading: http://repo1.maven.org/maven2/regexp/regexp/1.2/regexp-1.2.jar
29K downloaded  (regexp-1.2.jar)
503K downloaded  (bcel-5.1.jar)
[INFO] [resources:resources {execution: default-resources}]
[INFO] Using 'UTF-8' encoding to copy filtered resources.
[INFO] Copying 1 resource
[INFO] Copying 2 resources
[INFO] [compiler:compile {execution: default-compile}]
[INFO] Compiling 3 source files to <https://builds.apache.org/job/Axis2/ws/axis2/modules/jibx/target/classes>
[INFO] [antrun:run {execution: wsdl2java}]
[INFO] Executing tasks
     [java] Retrieving document at 'src/test/wsdl/library.wsdl'.
     [java] Retrieving document at 'src/test/wsdl/library.wsdl'.
     [java] Retrieving document at 'src/test/wsdl/library.wsdl'.
     [java] Retrieving document at 'src/test/wsdl/library.wsdl'.
     [java] Retrieving document at 'src/test/wsdl/customer-echo.wsdl'.
     [java] Retrieving schema at 'customer.xsd', relative to '<https://builds.apache.org/job/Axis2/ws/axis2/modules/jibx/src/test/wsdl/customer-echo.wsdl'.>
[INFO] Executed tasks
[INFO] [build-helper:add-test-source {execution: default}]
[INFO] Test Source directory: <https://builds.apache.org/job/Axis2/ws/axis2/modules/jibx/target/gen/library-unwrapped/src>
added.
[INFO] Test Source directory: <https://builds.apache.org/job/Axis2/ws/axis2/modules/jibx/target/gen/library-wrapped/src>
added.
[INFO] Test Source directory: <https://builds.apache.org/job/Axis2/ws/axis2/modules/jibx/target/gen/customer-echo/src>
added.
[INFO] [resources:copy-resources {execution: library-unwrapped-repo}]
[INFO] Using 'UTF-8' encoding to copy filtered resources.
[INFO] Copying 1 resource
[INFO] Copying 2 resources to services/library.aar/META-INF
[INFO] [resources:copy-resources {execution: library-wrapped-repo}]
[INFO] Using 'UTF-8' encoding to copy filtered resources.
[INFO] Copying 1 resource
[INFO] Copying 2 resources to services/library.aar/META-INF
[INFO] [resources:testResources {execution: default-testResources}]
[INFO] Using 'UTF-8' encoding to copy filtered resources.
[INFO] Copying 1 resource
[INFO] Copying 2 resources
[INFO] [compiler:testCompile {execution: default-testCompile}]
[INFO] Compiling 36 source files to <https://builds.apache.org/job/Axis2/ws/axis2/modules/jibx/target/test-classes>
[INFO] [antrun:run {execution: compile}]
[INFO] Executing tasks
[INFO] Executed tasks
[INFO] [surefire:test {execution: default-test}]
[INFO] Surefire report directory: <https://builds.apache.org/job/Axis2/ws/axis2/modules/jibx/target/surefire-reports>

-------------------------------------------------------
 T E S T S
-------------------------------------------------------
Running org.apache.axis2.jibx.library.wrapped.LibraryTest
[JENKINS] Recording test results
[INFO] [jar:jar {execution: default-jar}]
[INFO] Building jar: <https://builds.apache.org/job/Axis2/ws/axis2/modules/jibx/target/axis2-jibx-1.7.0-SNAPSHOT.jar>
[INFO] [assembly:single {execution: source-release-assembly}]
[INFO] Skipping the assembly in this project because it's not the Execution Root
[INFO] Preparing source:jar
[WARNING] Removing: jar from forked lifecycle, to prevent recursive invocation.
[INFO] No goals needed for project - skipping
[INFO] [source:jar {execution: attach-sources}]
[INFO] Building jar: <https://builds.apache.org/job/Axis2/ws/axis2/modules/jibx/target/axis2-jibx-1.7.0-SNAPSHOT-sources.jar>
[INFO] [javadoc:jar {execution: attach-javadocs}]
Loading source files for package org.apache.axis2.jibx...
Constructing Javadoc information...
Standard Doclet version 1.5.0_22
Building tree for all the packages and classes...
Generating <https://builds.apache.org/job/Axis2/ws/axis2/modules/jibx/target/apidocs/org/apache/axis2/jibx//CodeGenerationUtility.html...>
Generating <https://builds.apache.org/job/Axis2/ws/axis2/modules/jibx/target/apidocs/org/apache/axis2/jibx//JiBXDataSource.html...>
Generating <https://builds.apache.org/job/Axis2/ws/axis2/modules/jibx/target/apidocs/org/apache/axis2/jibx//NullBindingFactory.html...>
Generating <https://builds.apache.org/job/Axis2/ws/axis2/modules/jibx/target/apidocs/org/apache/axis2/jibx//package-frame.html...>
Generating <https://builds.apache.org/job/Axis2/ws/axis2/modules/jibx/target/apidocs/org/apache/axis2/jibx//package-summary.html...>
Generating <https://builds.apache.org/job/Axis2/ws/axis2/modules/jibx/target/apidocs/org/apache/axis2/jibx//package-tree.html...>
Generating <https://builds.apache.org/job/Axis2/ws/axis2/modules/jibx/target/apidocs/constant-values.html...>
Generating <https://builds.apache.org/job/Axis2/ws/axis2/modules/jibx/target/apidocs/org/apache/axis2/jibx/class-use//NullBindingFactory.html...>
Generating <https://builds.apache.org/job/Axis2/ws/axis2/modules/jibx/target/apidocs/org/apache/axis2/jibx/class-use//JiBXDataSource.html...>
Generating <https://builds.apache.org/job/Axis2/ws/axis2/modules/jibx/target/apidocs/org/apache/axis2/jibx/class-use//CodeGenerationUtility.html...>
Generating <https://builds.apache.org/job/Axis2/ws/axis2/modules/jibx/target/apidocs/org/apache/axis2/jibx//package-use.html...>
Building index for all the packages and classes...
Generating <https://builds.apache.org/job/Axis2/ws/axis2/modules/jibx/target/apidocs/overview-tree.html...>
Generating <https://builds.apache.org/job/Axis2/ws/axis2/modules/jibx/target/apidocs/index-all.html...>
Generating <https://builds.apache.org/job/Axis2/ws/axis2/modules/jibx/target/apidocs/deprecated-list.html...>
Building index for all classes...
Generating <https://builds.apache.org/job/Axis2/ws/axis2/modules/jibx/target/apidocs/allclasses-frame.html...>
Generating <https://builds.apache.org/job/Axis2/ws/axis2/modules/jibx/target/apidocs/allclasses-noframe.html...>
Generating <https://builds.apache.org/job/Axis2/ws/axis2/modules/jibx/target/apidocs/index.html...>
Generating <https://builds.apache.org/job/Axis2/ws/axis2/modules/jibx/target/apidocs/help-doc.html...>
Generating <https://builds.apache.org/job/Axis2/ws/axis2/modules/jibx/target/apidocs/stylesheet.css...>
[INFO] Building jar: <https://builds.apache.org/job/Axis2/ws/axis2/modules/jibx/target/axis2-jibx-1.7.0-SNAPSHOT-javadoc.jar>
[INFO] [gpg:sign {execution: default}]
[INFO] [install:install {execution: default-install}]
[INFO] Installing <https://builds.apache.org/job/Axis2/ws/axis2/modules/jibx/target/axis2-jibx-1.7.0-SNAPSHOT.jar>
to <https://builds.apache.org/job/Axis2/ws/.repository/org/apache/axis2/axis2-jibx/1.7.0-SNAPSHOT/axis2-jibx-1.7.0-SNAPSHOT.jar>
[INFO] Installing <https://builds.apache.org/job/Axis2/ws/axis2/modules/jibx/target/axis2-jibx-1.7.0-SNAPSHOT-sources.jar>
to <https://builds.apache.org/job/Axis2/ws/.repository/org/apache/axis2/axis2-jibx/1.7.0-SNAPSHOT/axis2-jibx-1.7.0-SNAPSHOT-sources.jar>
[INFO] Installing <https://builds.apache.org/job/Axis2/ws/axis2/modules/jibx/target/axis2-jibx-1.7.0-SNAPSHOT-javadoc.jar>
to <https://builds.apache.org/job/Axis2/ws/.repository/org/apache/axis2/axis2-jibx/1.7.0-SNAPSHOT/axis2-jibx-1.7.0-SNAPSHOT-javadoc.jar>
[INFO] [deploy:deploy {execution: default-deploy}]
[INFO] Retrieving previous build number from apache.snapshots.https
Uploading: https://repository.apache.org/content/repositories/snapshots/org/apache/axis2/axis2-jibx/1.7.0-SNAPSHOT/axis2-jibx-1.7.0-20120712.021045-835.jar
35K uploaded  (axis2-jibx-1.7.0-20120712.021045-835.jar)
[INFO] Retrieving previous metadata from apache.snapshots.https
[INFO] Uploading repository metadata for: 'snapshot org.apache.axis2:axis2-jibx:1.7.0-SNAPSHOT'
[INFO] Uploading project information for axis2-jibx 1.7.0-20120712.021045-835
[INFO] Retrieving previous metadata from apache.snapshots.https
[INFO] Uploading repository metadata for: 'artifact org.apache.axis2:axis2-jibx'
[INFO] Retrieving previous build number from apache.snapshots.https
Uploading: https://repository.apache.org/content/repositories/snapshots/org/apache/axis2/axis2-jibx/1.7.0-SNAPSHOT/axis2-jibx-1.7.0-20120712.021045-835-sources.jar
28K uploaded  (axis2-jibx-1.7.0-20120712.021045-835-sources.jar)
[INFO] Retrieving previous build number from apache.snapshots.https
Uploading: https://repository.apache.org/content/repositories/snapshots/org/apache/axis2/axis2-jibx/1.7.0-SNAPSHOT/axis2-jibx-1.7.0-20120712.021045-835-javadoc.jar
36K uploaded  (axis2-jibx-1.7.0-20120712.021045-835-javadoc.jar)
[JENKINS] Archiving <https://builds.apache.org/job/Axis2/ws/axis2/modules/jibx/pom.xml>
to /home/hudson/hudson/jobs/Axis2/modules/org.apache.axis2$axis2-jibx/builds/2012-07-12_02-09-39/archive/org.apache.axis2/axis2-jibx/1.7.0-SNAPSHOT/axis2-jibx-1.7.0-SNAPSHOT.pom
[JENKINS] Archiving <https://builds.apache.org/job/Axis2/ws/axis2/modules/jibx/target/axis2-jibx-1.7.0-SNAPSHOT.jar>
to /home/hudson/hudson/jobs/Axis2/modules/org.apache.axis2$axis2-jibx/builds/2012-07-12_02-09-39/archive/org.apache.axis2/axis2-jibx/1.7.0-20120712.021045-835/axis2-jibx-1.7.0-20120712.021045-835.jar
[JENKINS] Archiving <https://builds.apache.org/job/Axis2/ws/axis2/modules/jibx/target/axis2-jibx-1.7.0-SNAPSHOT-sources.jar>
to /home/hudson/hudson/jobs/Axis2/modules/org.apache.axis2$axis2-jibx/builds/2012-07-12_02-09-39/archive/org.apache.axis2/axis2-jibx/1.7.0-20120712.021045-835/axis2-jibx-1.7.0-20120712.021045-835-sources.jar
[JENKINS] Archiving <https://builds.apache.org/job/Axis2/ws/axis2/modules/jibx/target/axis2-jibx-1.7.0-SNAPSHOT-javadoc.jar>
to /home/hudson/hudson/jobs/Axis2/modules/org.apache.axis2$axis2-jibx/builds/2012-07-12_02-09-39/archive/org.apache.axis2/axis2-jibx/1.7.0-20120712.021045-835/axis2-jibx-1.7.0-20120712.021045-835-javadoc.jar
[INFO] ------------------------------------------------------------------------
[INFO] Building Apache Axis2 - JSON
[INFO]    task-segment: [clean, deploy]
[INFO] ------------------------------------------------------------------------
[INFO] [clean:clean {execution: default-clean}]
[INFO] [remote-resources:process {execution: default}]
Downloading: http://repo1.maven.org/maven2/org/codehaus/jettison/jettison/1.3/jettison-1.3.pom
4K downloaded  (jettison-1.3.pom)
Downloading: http://repo1.maven.org/maven2/org/codehaus/codehaus-parent/3/codehaus-parent-3.pom
4K downloaded  (codehaus-parent-3.pom)
Downloading: http://repo1.maven.org/maven2/com/google/code/gson/gson/2.1/gson-2.1.pom
10K downloaded  (gson-2.1.pom)
Downloading: http://repo1.maven.org/maven2/org/sonatype/oss/oss-parent/5/oss-parent-5.pom
3K downloaded  (oss-parent-5.pom)
Downloading: http://repo1.maven.org/maven2/org/codehaus/jettison/jettison/1.3/jettison-1.3.jar
Downloading: http://repo1.maven.org/maven2/com/google/code/gson/gson/2.1/gson-2.1.jar
70K downloaded  (jettison-1.3.jar)
175K downloaded  (gson-2.1.jar)
[INFO] [resources:resources {execution: default-resources}]
[INFO] Using 'UTF-8' encoding to copy filtered resources.
[INFO] skip non existing resourceDirectory <https://builds.apache.org/job/Axis2/ws/axis2/modules/json/src/main/resources>
[INFO] Copying 2 resources
[INFO] [compiler:compile {execution: default-compile}]
[INFO] Compiling 16 source files to <https://builds.apache.org/job/Axis2/ws/axis2/modules/json/target/classes>
[INFO] -------------------------------------------------------------
[ERROR] COMPILATION ERROR : 
[INFO] -------------------------------------------------------------
[ERROR] <https://builds.apache.org/job/Axis2/ws/axis2/modules/json/src/org/apache/axis2/json/impl/JsonBuilder.java>:[34,5]
method does not override a method from its superclass

[ERROR] <https://builds.apache.org/job/Axis2/ws/axis2/modules/json/src/org/apache/axis2/json/impl/JsonFormatter.java>:[44,5]
method does not override a method from its superclass

[ERROR] <https://builds.apache.org/job/Axis2/ws/axis2/modules/json/src/org/apache/axis2/json/impl/JsonFormatter.java>:[49,5]
method does not override a method from its superclass

[ERROR] <https://builds.apache.org/job/Axis2/ws/axis2/modules/json/src/org/apache/axis2/json/impl/JsonFormatter.java>:[78,5]
method does not override a method from its superclass

[ERROR] <https://builds.apache.org/job/Axis2/ws/axis2/modules/json/src/org/apache/axis2/json/impl/JsonFormatter.java>:[85,5]
method does not override a method from its superclass

[ERROR] <https://builds.apache.org/job/Axis2/ws/axis2/modules/json/src/org/apache/axis2/json/impl/JsonFormatter.java>:[90,5]
method does not override a method from its superclass

[INFO] 6 errors 
[INFO] -------------------------------------------------------------
[JENKINS] Archiving <https://builds.apache.org/job/Axis2/ws/axis2/modules/json/pom.xml>
to /home/hudson/hudson/jobs/Axis2/modules/org.apache.axis2$axis2-json/builds/2012-07-12_02-09-39/archive/org.apache.axis2/axis2-json/1.7.0-SNAPSHOT/axis2-json-1.7.0-SNAPSHOT.pom
[INFO] ------------------------------------------------------------------------
[ERROR] BUILD FAILURE
[INFO] ------------------------------------------------------------------------
[INFO] Compilation failure

<https://builds.apache.org/job/Axis2/ws/axis2/modules/json/src/org/apache/axis2/json/impl/JsonBuilder.java>:[34,5]
method does not override a method from its superclass

<https://builds.apache.org/job/Axis2/ws/axis2/modules/json/src/org/apache/axis2/json/impl/JsonFormatter.java>:[44,5]
method does not override a method from its superclass

<https://builds.apache.org/job/Axis2/ws/axis2/modules/json/src/org/apache/axis2/json/impl/JsonFormatter.java>:[49,5]
method does not override a method from its superclass

<https://builds.apache.org/job/Axis2/ws/axis2/modules/json/src/org/apache/axis2/json/impl/JsonFormatter.java>:[78,5]
method does not override a method from its superclass

<https://builds.apache.org/job/Axis2/ws/axis2/modules/json/src/org/apache/axis2/json/impl/JsonFormatter.java>:[85,5]
method does not override a method from its superclass

<https://builds.apache.org/job/Axis2/ws/axis2/modules/json/src/org/apache/axis2/json/impl/JsonFormatter.java>:[90,5]
method does not override a method from its superclass


[INFO] ------------------------------------------------------------------------
[INFO] For more information, run Maven with the -e switch
[INFO] ------------------------------------------------------------------------
[INFO] Total time: 35 minutes 14 seconds
[INFO] Finished at: Thu Jul 12 02:45:24 UTC 2012
[INFO] Final Memory: 84M/246M
[INFO] ------------------------------------------------------------------------
Maven failed with error.
Sending e-mails to: java-dev@axis.apache.org
Sending e-mails to: java-dev@axis.apache.org
channel stopped
[locks-and-latches] Releasing all the locks
[locks-and-latches] All the locks released

---------------------------------------------------------------------
To unsubscribe, e-mail: java-dev-unsubscribe@axis.apache.org
For additional commands, e-mail: java-dev-help@axis.apache.org


Mime
View raw message