axis-java-dev mailing list archives

Site index · List index
Message view « Date » · « Thread »
Top « Date » · « Thread »
From Apache Jenkins Server <jenk...@builds.apache.org>
Subject Build failed in Jenkins: Axis2 #1635
Date Mon, 16 Jul 2012 01:37:29 GMT
See <https://builds.apache.org/job/Axis2/1635/>

------------------------------------------
[...truncated 8720 lines...]
Tests run: 1, Failures: 0, Errors: 0, Skipped: 0, Time elapsed: 0.139 sec
Running org.apache.axis2.engine.map.MapServiceTest
Tests run: 2, Failures: 0, Errors: 0, Skipped: 0, Time elapsed: 6.514 sec
Running org.apache.axis2.engine.ServiceCreateTest
Running org.apache.axis2.engine.CommonsHTTPEchoRawXMLTest
Running org.apache.axis2.faults.SendingResponseFaultTest
Tests run: 1, Failures: 0, Errors: 0, Skipped: 0, Time elapsed: 0.306 sec
Running org.apache.axis2.engine.MessageContextSaveCTest
Tests run: 2, Failures: 0, Errors: 0, Skipped: 0, Time elapsed: 0.158 sec
Running org.apache.axis2.engine.HandlerFailureTest
Tests run: 1, Failures: 0, Errors: 0, Skipped: 0, Time elapsed: 0.264 sec
Running org.apache.axis2.engine.UsingTransportTest
Tests run: 2, Failures: 0, Errors: 0, Skipped: 0, Time elapsed: 0.28 sec
Running org.apache.axis2.transport.http.TransportHeadersTest
Tests run: 3, Failures: 0, Errors: 0, Skipped: 0, Time elapsed: 0.017 sec
Running org.apache.axis2.engine.MessageSaveAndRestoreTest
Running org.apache.axis2.jaxrs.PojoTest
Running org.apache.axis2.engine.ServiceDispatchingTest
Tests run: 3, Failures: 0, Errors: 0, Skipped: 0, Time elapsed: 0.321 sec
Running org.apache.axis2.engine.MessageContextTest
Tests run: 1, Failures: 0, Errors: 0, Skipped: 0, Time elapsed: 0.014 sec
Running org.apache.axis2.engine.ObjectSaveTest
Tests run: 5, Failures: 0, Errors: 0, Skipped: 0, Time elapsed: 0.035 sec
Running org.apache.axis2.mtom.EchoRawMTOMFileCacheTest
Running org.apache.axis2.engine.EchoRawXMLOnTwoChannelsTest
Running org.apache.axis2.engine.CharactersetEncodingTest

Results :

Tests run: 283, Failures: 0, Errors: 0, Skipped: 0

[JENKINS] Recording test results
[INFO] [jar:jar {execution: default-jar}]
[INFO] Building jar: <https://builds.apache.org/job/Axis2/ws/axis2/modules/integration/target/axis2-integration-1.7.0-SNAPSHOT.jar>
[INFO] [assembly:single {execution: source-release-assembly}]
[INFO] Skipping the assembly in this project because it's not the Execution Root
[INFO] Preparing source:jar
[WARNING] Removing: jar from forked lifecycle, to prevent recursive invocation.
[INFO] No goals needed for project - skipping
[INFO] [source:jar {execution: attach-sources}]
[INFO] Building jar: <https://builds.apache.org/job/Axis2/ws/axis2/modules/integration/target/axis2-integration-1.7.0-SNAPSHOT-sources.jar>
[INFO] [javadoc:jar {execution: attach-javadocs}]
[INFO] [gpg:sign {execution: default}]
[INFO] [install:install {execution: default-install}]
[INFO] Installing <https://builds.apache.org/job/Axis2/ws/axis2/modules/integration/target/axis2-integration-1.7.0-SNAPSHOT.jar>
to <https://builds.apache.org/job/Axis2/ws/.repository/org/apache/axis2/axis2-integration/1.7.0-SNAPSHOT/axis2-integration-1.7.0-SNAPSHOT.jar>
[INFO] Installing <https://builds.apache.org/job/Axis2/ws/axis2/modules/integration/target/axis2-integration-1.7.0-SNAPSHOT-sources.jar>
to <https://builds.apache.org/job/Axis2/ws/.repository/org/apache/axis2/axis2-integration/1.7.0-SNAPSHOT/axis2-integration-1.7.0-SNAPSHOT-sources.jar>
[INFO] [deploy:deploy {execution: default-deploy}]
[INFO] Retrieving previous build number from apache.snapshots.https
[WARNING] *** CHECKSUM FAILED - Checksum failed on download: local = '1bcadc63b605067ccdefc1cd002c4d3bf11e2497';
remote = '81e4c5cc2ed5c924bd2dd6109a66b3ff1be2dbd9' - RETRYING
[WARNING] *** CHECKSUM FAILED - Checksum failed on download: local = '1bcadc63b605067ccdefc1cd002c4d3bf11e2497';
remote = '81e4c5cc2ed5c924bd2dd6109a66b3ff1be2dbd9' - IGNORING
Uploading: https://repository.apache.org/content/repositories/snapshots/org/apache/axis2/axis2-integration/1.7.0-SNAPSHOT/axis2-integration-1.7.0-20120716.010813-830.jar
11K uploaded  (axis2-integration-1.7.0-20120716.010813-830.jar)
[INFO] Retrieving previous metadata from apache.snapshots.https
[WARNING] *** CHECKSUM FAILED - Checksum failed on download: local = '7ec99da17768575a6b33dfecf51a973b7c94c905';
remote = 'adfb895d3a8b8443f1e072c9d07bd2514eaeb8cc' - RETRYING
[WARNING] *** CHECKSUM FAILED - Checksum failed on download: local = '7ec99da17768575a6b33dfecf51a973b7c94c905';
remote = 'adfb895d3a8b8443f1e072c9d07bd2514eaeb8cc' - IGNORING
[INFO] Uploading repository metadata for: 'artifact org.apache.axis2:axis2-integration'
[INFO] Retrieving previous metadata from apache.snapshots.https
[WARNING] *** CHECKSUM FAILED - Checksum failed on download: local = '1bcadc63b605067ccdefc1cd002c4d3bf11e2497';
remote = '81e4c5cc2ed5c924bd2dd6109a66b3ff1be2dbd9' - RETRYING
[WARNING] *** CHECKSUM FAILED - Checksum failed on download: local = '1bcadc63b605067ccdefc1cd002c4d3bf11e2497';
remote = '81e4c5cc2ed5c924bd2dd6109a66b3ff1be2dbd9' - IGNORING
[INFO] Uploading repository metadata for: 'snapshot org.apache.axis2:axis2-integration:1.7.0-SNAPSHOT'
[INFO] Uploading project information for axis2-integration 1.7.0-20120716.010813-830
[INFO] Retrieving previous build number from apache.snapshots.https
Uploading: https://repository.apache.org/content/repositories/snapshots/org/apache/axis2/axis2-integration/1.7.0-SNAPSHOT/axis2-integration-1.7.0-20120716.010813-830-sources.jar
6K uploaded  (axis2-integration-1.7.0-20120716.010813-830-sources.jar)
[JENKINS] Archiving <https://builds.apache.org/job/Axis2/ws/axis2/modules/integration/pom.xml>
to /home/hudson/hudson/jobs/Axis2/modules/org.apache.axis2$axis2-integration/builds/2012-07-16_01-07-55/archive/org.apache.axis2/axis2-integration/1.7.0-SNAPSHOT/axis2-integration-1.7.0-SNAPSHOT.pom
[JENKINS] Archiving <https://builds.apache.org/job/Axis2/ws/axis2/modules/integration/target/axis2-integration-1.7.0-SNAPSHOT.jar>
to /home/hudson/hudson/jobs/Axis2/modules/org.apache.axis2$axis2-integration/builds/2012-07-16_01-07-55/archive/org.apache.axis2/axis2-integration/1.7.0-20120716.010813-830/axis2-integration-1.7.0-20120716.010813-830.jar
[JENKINS] Archiving <https://builds.apache.org/job/Axis2/ws/axis2/modules/integration/target/axis2-integration-1.7.0-SNAPSHOT-sources.jar>
to /home/hudson/hudson/jobs/Axis2/modules/org.apache.axis2$axis2-integration/builds/2012-07-16_01-07-55/archive/org.apache.axis2/axis2-integration/1.7.0-20120716.010813-830/axis2-integration-1.7.0-20120716.010813-830-sources.jar
[INFO] ------------------------------------------------------------------------
[INFO] Building Apache Axis2 - JiBX Data Binding
[INFO]    task-segment: [clean, deploy]
[INFO] ------------------------------------------------------------------------
[INFO] [clean:clean {execution: default-clean}]
[INFO] Deleting directory <https://builds.apache.org/job/Axis2/ws/axis2/modules/jibx/target>
[INFO] [remote-resources:process {execution: default}]
[INFO] [resources:resources {execution: default-resources}]
[INFO] Using 'UTF-8' encoding to copy filtered resources.
[INFO] Copying 1 resource
[INFO] Copying 2 resources
[INFO] [compiler:compile {execution: default-compile}]
[INFO] Compiling 3 source files to <https://builds.apache.org/job/Axis2/ws/axis2/modules/jibx/target/classes>
[INFO] [antrun:run {execution: wsdl2java}]
[INFO] Executing tasks
     [java] Retrieving document at 'src/test/wsdl/library.wsdl'.
     [java] Retrieving document at 'src/test/wsdl/library.wsdl'.
     [java] Retrieving document at 'src/test/wsdl/library.wsdl'.
     [java] Retrieving document at 'src/test/wsdl/library.wsdl'.
     [java] Retrieving document at 'src/test/wsdl/customer-echo.wsdl'.
     [java] Retrieving schema at 'customer.xsd', relative to 'file:/x1/jenkins/jenkins-slave/workspace/Axis2/axis2/modules/jibx/src/test/wsdl/customer-echo.wsdl'.
[INFO] Executed tasks
[INFO] [build-helper:add-test-source {execution: default}]
[INFO] Test Source directory: <https://builds.apache.org/job/Axis2/ws/axis2/modules/jibx/target/gen/library-unwrapped/src>
added.
[INFO] Test Source directory: <https://builds.apache.org/job/Axis2/ws/axis2/modules/jibx/target/gen/library-wrapped/src>
added.
[INFO] Test Source directory: <https://builds.apache.org/job/Axis2/ws/axis2/modules/jibx/target/gen/customer-echo/src>
added.
[INFO] [resources:copy-resources {execution: library-unwrapped-repo}]
[INFO] Using 'UTF-8' encoding to copy filtered resources.
[INFO] Copying 1 resource
[INFO] Copying 2 resources to services/library.aar/META-INF
[INFO] [resources:copy-resources {execution: library-wrapped-repo}]
[INFO] Using 'UTF-8' encoding to copy filtered resources.
[INFO] Copying 1 resource
[INFO] Copying 2 resources to services/library.aar/META-INF
[INFO] [resources:testResources {execution: default-testResources}]
[INFO] Using 'UTF-8' encoding to copy filtered resources.
[INFO] Copying 1 resource
[INFO] Copying 2 resources
[INFO] [compiler:testCompile {execution: default-testCompile}]
[INFO] Compiling 36 source files to <https://builds.apache.org/job/Axis2/ws/axis2/modules/jibx/target/test-classes>
[INFO] [antrun:run {execution: compile}]
[INFO] Executing tasks
[INFO] Executed tasks
[INFO] [surefire:test {execution: default-test}]
[INFO] Surefire report directory: <https://builds.apache.org/job/Axis2/ws/axis2/modules/jibx/target/surefire-reports>

-------------------------------------------------------
 T E S T S
-------------------------------------------------------
Running org.apache.axis2.jibx.library.wrapped.LibraryTest
[JENKINS] Recording test results
[INFO] [jar:jar {execution: default-jar}]
[INFO] Building jar: <https://builds.apache.org/job/Axis2/ws/axis2/modules/jibx/target/axis2-jibx-1.7.0-SNAPSHOT.jar>
[INFO] [assembly:single {execution: source-release-assembly}]
[INFO] Skipping the assembly in this project because it's not the Execution Root
[INFO] Preparing source:jar
[WARNING] Removing: jar from forked lifecycle, to prevent recursive invocation.
[INFO] No goals needed for project - skipping
[INFO] [source:jar {execution: attach-sources}]
[INFO] Building jar: <https://builds.apache.org/job/Axis2/ws/axis2/modules/jibx/target/axis2-jibx-1.7.0-SNAPSHOT-sources.jar>
[INFO] [javadoc:jar {execution: attach-javadocs}]
Loading source files for package org.apache.axis2.jibx...
Constructing Javadoc information...
Standard Doclet version 1.5.0_22
Building tree for all the packages and classes...
Generating <https://builds.apache.org/job/Axis2/ws/axis2/modules/jibx/target/apidocs/org/apache/axis2/jibx//CodeGenerationUtility.html...>
Generating <https://builds.apache.org/job/Axis2/ws/axis2/modules/jibx/target/apidocs/org/apache/axis2/jibx//JiBXDataSource.html...>
Generating <https://builds.apache.org/job/Axis2/ws/axis2/modules/jibx/target/apidocs/org/apache/axis2/jibx//NullBindingFactory.html...>
Generating <https://builds.apache.org/job/Axis2/ws/axis2/modules/jibx/target/apidocs/org/apache/axis2/jibx//package-frame.html...>
Generating <https://builds.apache.org/job/Axis2/ws/axis2/modules/jibx/target/apidocs/org/apache/axis2/jibx//package-summary.html...>
Generating <https://builds.apache.org/job/Axis2/ws/axis2/modules/jibx/target/apidocs/org/apache/axis2/jibx//package-tree.html...>
Generating <https://builds.apache.org/job/Axis2/ws/axis2/modules/jibx/target/apidocs/constant-values.html...>
Generating <https://builds.apache.org/job/Axis2/ws/axis2/modules/jibx/target/apidocs/org/apache/axis2/jibx/class-use//CodeGenerationUtility.html...>
Generating <https://builds.apache.org/job/Axis2/ws/axis2/modules/jibx/target/apidocs/org/apache/axis2/jibx/class-use//JiBXDataSource.html...>
Generating <https://builds.apache.org/job/Axis2/ws/axis2/modules/jibx/target/apidocs/org/apache/axis2/jibx/class-use//NullBindingFactory.html...>
Generating <https://builds.apache.org/job/Axis2/ws/axis2/modules/jibx/target/apidocs/org/apache/axis2/jibx//package-use.html...>
Building index for all the packages and classes...
Generating <https://builds.apache.org/job/Axis2/ws/axis2/modules/jibx/target/apidocs/overview-tree.html...>
Generating <https://builds.apache.org/job/Axis2/ws/axis2/modules/jibx/target/apidocs/index-all.html...>
Generating <https://builds.apache.org/job/Axis2/ws/axis2/modules/jibx/target/apidocs/deprecated-list.html...>
Building index for all classes...
Generating <https://builds.apache.org/job/Axis2/ws/axis2/modules/jibx/target/apidocs/allclasses-frame.html...>
Generating <https://builds.apache.org/job/Axis2/ws/axis2/modules/jibx/target/apidocs/allclasses-noframe.html...>
Generating <https://builds.apache.org/job/Axis2/ws/axis2/modules/jibx/target/apidocs/index.html...>
Generating <https://builds.apache.org/job/Axis2/ws/axis2/modules/jibx/target/apidocs/help-doc.html...>
Generating <https://builds.apache.org/job/Axis2/ws/axis2/modules/jibx/target/apidocs/stylesheet.css...>
[INFO] Building jar: <https://builds.apache.org/job/Axis2/ws/axis2/modules/jibx/target/axis2-jibx-1.7.0-SNAPSHOT-javadoc.jar>
[INFO] [gpg:sign {execution: default}]
[INFO] [install:install {execution: default-install}]
[INFO] Installing <https://builds.apache.org/job/Axis2/ws/axis2/modules/jibx/target/axis2-jibx-1.7.0-SNAPSHOT.jar>
to <https://builds.apache.org/job/Axis2/ws/.repository/org/apache/axis2/axis2-jibx/1.7.0-SNAPSHOT/axis2-jibx-1.7.0-SNAPSHOT.jar>
[INFO] Installing <https://builds.apache.org/job/Axis2/ws/axis2/modules/jibx/target/axis2-jibx-1.7.0-SNAPSHOT-sources.jar>
to <https://builds.apache.org/job/Axis2/ws/.repository/org/apache/axis2/axis2-jibx/1.7.0-SNAPSHOT/axis2-jibx-1.7.0-SNAPSHOT-sources.jar>
[INFO] Installing <https://builds.apache.org/job/Axis2/ws/axis2/modules/jibx/target/axis2-jibx-1.7.0-SNAPSHOT-javadoc.jar>
to <https://builds.apache.org/job/Axis2/ws/.repository/org/apache/axis2/axis2-jibx/1.7.0-SNAPSHOT/axis2-jibx-1.7.0-SNAPSHOT-javadoc.jar>
[INFO] [deploy:deploy {execution: default-deploy}]
[INFO] Retrieving previous build number from apache.snapshots.https
[WARNING] *** CHECKSUM FAILED - Checksum failed on download: local = '2d81e7eb895db38e4d60324c6469d644fc2181d7';
remote = '172492ce2c39f0c89fea7128588aacee27c3b76b' - RETRYING
[WARNING] *** CHECKSUM FAILED - Checksum failed on download: local = '2d81e7eb895db38e4d60324c6469d644fc2181d7';
remote = '172492ce2c39f0c89fea7128588aacee27c3b76b' - IGNORING
Uploading: https://repository.apache.org/content/repositories/snapshots/org/apache/axis2/axis2-jibx/1.7.0-SNAPSHOT/axis2-jibx-1.7.0-20120716.010813-838.jar
35K uploaded  (axis2-jibx-1.7.0-20120716.010813-838.jar)
[INFO] Retrieving previous metadata from apache.snapshots.https
[WARNING] *** CHECKSUM FAILED - Checksum failed on download: local = '2d81e7eb895db38e4d60324c6469d644fc2181d7';
remote = '172492ce2c39f0c89fea7128588aacee27c3b76b' - RETRYING
[WARNING] *** CHECKSUM FAILED - Checksum failed on download: local = '2d81e7eb895db38e4d60324c6469d644fc2181d7';
remote = '172492ce2c39f0c89fea7128588aacee27c3b76b' - IGNORING
[INFO] Uploading repository metadata for: 'snapshot org.apache.axis2:axis2-jibx:1.7.0-SNAPSHOT'
[INFO] Uploading project information for axis2-jibx 1.7.0-20120716.010813-838
[INFO] Retrieving previous metadata from apache.snapshots.https
[WARNING] *** CHECKSUM FAILED - Checksum failed on download: local = '20a946631425c01a2bcabb54a6442cc4bc9725fb';
remote = '3e99d7fbff206b6b71ed53575666dd92c7c96264' - RETRYING
[WARNING] *** CHECKSUM FAILED - Checksum failed on download: local = '20a946631425c01a2bcabb54a6442cc4bc9725fb';
remote = '3e99d7fbff206b6b71ed53575666dd92c7c96264' - IGNORING
[INFO] Uploading repository metadata for: 'artifact org.apache.axis2:axis2-jibx'
[INFO] Retrieving previous build number from apache.snapshots.https
Uploading: https://repository.apache.org/content/repositories/snapshots/org/apache/axis2/axis2-jibx/1.7.0-SNAPSHOT/axis2-jibx-1.7.0-20120716.010813-838-sources.jar
28K uploaded  (axis2-jibx-1.7.0-20120716.010813-838-sources.jar)
[INFO] Retrieving previous build number from apache.snapshots.https
Uploading: https://repository.apache.org/content/repositories/snapshots/org/apache/axis2/axis2-jibx/1.7.0-SNAPSHOT/axis2-jibx-1.7.0-20120716.010813-838-javadoc.jar
36K uploaded  (axis2-jibx-1.7.0-20120716.010813-838-javadoc.jar)
[JENKINS] Archiving <https://builds.apache.org/job/Axis2/ws/axis2/modules/jibx/pom.xml>
to /home/hudson/hudson/jobs/Axis2/modules/org.apache.axis2$axis2-jibx/builds/2012-07-16_01-07-55/archive/org.apache.axis2/axis2-jibx/1.7.0-SNAPSHOT/axis2-jibx-1.7.0-SNAPSHOT.pom
[JENKINS] Archiving <https://builds.apache.org/job/Axis2/ws/axis2/modules/jibx/target/axis2-jibx-1.7.0-SNAPSHOT.jar>
to /home/hudson/hudson/jobs/Axis2/modules/org.apache.axis2$axis2-jibx/builds/2012-07-16_01-07-55/archive/org.apache.axis2/axis2-jibx/1.7.0-20120716.010813-838/axis2-jibx-1.7.0-20120716.010813-838.jar
[JENKINS] Archiving <https://builds.apache.org/job/Axis2/ws/axis2/modules/jibx/target/axis2-jibx-1.7.0-SNAPSHOT-sources.jar>
to /home/hudson/hudson/jobs/Axis2/modules/org.apache.axis2$axis2-jibx/builds/2012-07-16_01-07-55/archive/org.apache.axis2/axis2-jibx/1.7.0-20120716.010813-838/axis2-jibx-1.7.0-20120716.010813-838-sources.jar
[JENKINS] Archiving <https://builds.apache.org/job/Axis2/ws/axis2/modules/jibx/target/axis2-jibx-1.7.0-SNAPSHOT-javadoc.jar>
to /home/hudson/hudson/jobs/Axis2/modules/org.apache.axis2$axis2-jibx/builds/2012-07-16_01-07-55/archive/org.apache.axis2/axis2-jibx/1.7.0-20120716.010813-838/axis2-jibx-1.7.0-20120716.010813-838-javadoc.jar
[INFO] ------------------------------------------------------------------------
[INFO] Building Apache Axis2 - JSON
[INFO]    task-segment: [clean, deploy]
[INFO] ------------------------------------------------------------------------
[INFO] [clean:clean {execution: default-clean}]
[INFO] Deleting directory <https://builds.apache.org/job/Axis2/ws/axis2/modules/json/target>
[INFO] [remote-resources:process {execution: default}]
[INFO] [resources:resources {execution: default-resources}]
[INFO] Using 'UTF-8' encoding to copy filtered resources.
[INFO] skip non existing resourceDirectory <https://builds.apache.org/job/Axis2/ws/axis2/modules/json/src/main/resources>
[INFO] Copying 2 resources
[INFO] [compiler:compile {execution: default-compile}]
[INFO] Compiling 16 source files to <https://builds.apache.org/job/Axis2/ws/axis2/modules/json/target/classes>
[INFO] -------------------------------------------------------------
[ERROR] COMPILATION ERROR : 
[INFO] -------------------------------------------------------------
[ERROR] <https://builds.apache.org/job/Axis2/ws/axis2/modules/json/src/org/apache/axis2/json/impl/JsonFormatter.java>:[44,5]
method does not override a method from its superclass

[ERROR] <https://builds.apache.org/job/Axis2/ws/axis2/modules/json/src/org/apache/axis2/json/impl/JsonFormatter.java>:[49,5]
method does not override a method from its superclass

[ERROR] <https://builds.apache.org/job/Axis2/ws/axis2/modules/json/src/org/apache/axis2/json/impl/JsonFormatter.java>:[78,5]
method does not override a method from its superclass

[ERROR] <https://builds.apache.org/job/Axis2/ws/axis2/modules/json/src/org/apache/axis2/json/impl/JsonFormatter.java>:[85,5]
method does not override a method from its superclass

[ERROR] <https://builds.apache.org/job/Axis2/ws/axis2/modules/json/src/org/apache/axis2/json/impl/JsonFormatter.java>:[90,5]
method does not override a method from its superclass

[ERROR] <https://builds.apache.org/job/Axis2/ws/axis2/modules/json/src/org/apache/axis2/json/impl/JsonBuilder.java>:[34,5]
method does not override a method from its superclass

[INFO] 6 errors 
[INFO] -------------------------------------------------------------
[JENKINS] Archiving <https://builds.apache.org/job/Axis2/ws/axis2/modules/json/pom.xml>
to /home/hudson/hudson/jobs/Axis2/modules/org.apache.axis2$axis2-json/builds/2012-07-16_01-07-55/archive/org.apache.axis2/axis2-json/1.7.0-SNAPSHOT/axis2-json-1.7.0-SNAPSHOT.pom
[INFO] ------------------------------------------------------------------------
[ERROR] BUILD FAILURE
[INFO] ------------------------------------------------------------------------
[INFO] Compilation failure

<https://builds.apache.org/job/Axis2/ws/axis2/modules/json/src/org/apache/axis2/json/impl/JsonFormatter.java>:[44,5]
method does not override a method from its superclass

<https://builds.apache.org/job/Axis2/ws/axis2/modules/json/src/org/apache/axis2/json/impl/JsonFormatter.java>:[49,5]
method does not override a method from its superclass

<https://builds.apache.org/job/Axis2/ws/axis2/modules/json/src/org/apache/axis2/json/impl/JsonFormatter.java>:[78,5]
method does not override a method from its superclass

<https://builds.apache.org/job/Axis2/ws/axis2/modules/json/src/org/apache/axis2/json/impl/JsonFormatter.java>:[85,5]
method does not override a method from its superclass

<https://builds.apache.org/job/Axis2/ws/axis2/modules/json/src/org/apache/axis2/json/impl/JsonFormatter.java>:[90,5]
method does not override a method from its superclass

<https://builds.apache.org/job/Axis2/ws/axis2/modules/json/src/org/apache/axis2/json/impl/JsonBuilder.java>:[34,5]
method does not override a method from its superclass


[INFO] ------------------------------------------------------------------------
[INFO] For more information, run Maven with the -e switch
[INFO] ------------------------------------------------------------------------
[INFO] Total time: 29 minutes 25 seconds
[INFO] Finished at: Mon Jul 16 01:37:27 GMT 2012
[INFO] Final Memory: 84M/245M
[INFO] ------------------------------------------------------------------------
Waiting for Jenkins to finish collecting data
Maven failed with error.
Sending e-mails to: java-dev@axis.apache.org
Sending e-mails to: java-dev@axis.apache.org
Sending e-mails to: java-dev@axis.apache.org
Sending e-mails to: java-dev@axis.apache.org
channel stopped
[locks-and-latches] Releasing all the locks
[locks-and-latches] All the locks released

---------------------------------------------------------------------
To unsubscribe, e-mail: java-dev-unsubscribe@axis.apache.org
For additional commands, e-mail: java-dev-help@axis.apache.org


Mime
View raw message