axis-java-dev mailing list archives

Site index · List index
Message view « Date » · « Thread »
Top « Date » · « Thread »
From Apache Jenkins Server <jenk...@builds.apache.org>
Subject Build failed in Jenkins: Axis2 » Apache Axis2 - Transport - HTTP #1566
Date Fri, 15 Jun 2012 11:16:28 GMT
See <https://builds.apache.org/job/Axis2/org.apache.axis2$axis2-transport-http/1566/>

------------------------------------------
[INFO] ------------------------------------------------------------------------
[INFO] Building Apache Axis2 - Transport - HTTP
[INFO]    task-segment: [clean, deploy]
[INFO] ------------------------------------------------------------------------
[INFO] [clean:clean {execution: default-clean}]
[INFO] Deleting directory <https://builds.apache.org/job/Axis2/org.apache.axis2$axis2-transport-http/ws/target>
[INFO] [remote-resources:process {execution: default}]
[INFO] [resources:resources {execution: default-resources}]
[INFO] Using 'UTF-8' encoding to copy filtered resources.
[INFO] skip non existing resourceDirectory <https://builds.apache.org/job/Axis2/org.apache.axis2$axis2-transport-http/ws/conf>
[INFO] Copying 0 resource
[INFO] Copying 2 resources
[INFO] [compiler:compile {execution: default-compile}]
[INFO] Compiling 67 source files to <https://builds.apache.org/job/Axis2/org.apache.axis2$axis2-transport-http/ws/target/classes>
[INFO] -------------------------------------------------------------
[ERROR] COMPILATION ERROR : 
[INFO] -------------------------------------------------------------
[ERROR] <https://builds.apache.org/job/Axis2/org.apache.axis2$axis2-transport-http/ws/src/org/apache/axis2/transport/http/HTTPTransportReceiver.java>:[169,62]
cannot find symbol
symbol  : method getServiceDescription()
location: class org.apache.axis2.description.AxisService

[INFO] 1error
[INFO] -------------------------------------------------------------
[JENKINS] Archiving <https://builds.apache.org/job/Axis2/org.apache.axis2$axis2-transport-http/ws/pom.xml>
to /home/hudson/hudson/jobs/Axis2/modules/org.apache.axis2$axis2-transport-http/builds/2012-06-15_11-13-29/archive/org.apache.axis2/axis2-transport-http/1.7.0-SNAPSHOT/axis2-transport-http-1.7.0-SNAPSHOT.pom
[INFO] ------------------------------------------------------------------------
[ERROR] BUILD FAILURE
[INFO] ------------------------------------------------------------------------
[INFO] Compilation failure
<https://builds.apache.org/job/Axis2/org.apache.axis2$axis2-transport-http/ws/src/org/apache/axis2/transport/http/HTTPTransportReceiver.java>:[169,62]
cannot find symbol
symbol  : method getServiceDescription()
location: class org.apache.axis2.description.AxisService


[INFO] ------------------------------------------------------------------------
[INFO] For more information, run Maven with the -e switch
[INFO] ------------------------------------------------------------------------
[INFO] Total time: 2 minutes 34 seconds
[INFO] Finished at: Fri Jun 15 11:16:27 UTC 2012
[INFO] Final Memory: 71M/217M
[INFO] ------------------------------------------------------------------------

---------------------------------------------------------------------
To unsubscribe, e-mail: java-dev-unsubscribe@axis.apache.org
For additional commands, e-mail: java-dev-help@axis.apache.org


Mime
View raw message