axis-java-dev mailing list archives

Site index · List index
Message view « Date » · « Thread »
Top « Date » · « Thread »
From Apache Jenkins Server <jenk...@builds.apache.org>
Subject Build failed in Jenkins: Rampart #1007
Date Sat, 30 Jun 2012 12:49:46 GMT
See <https://builds.apache.org/job/Rampart/1007/>

------------------------------------------
[...truncated 81 lines...]
Downloaded: http://repository.apache.org/snapshots/org/apache/ws/commons/axiom/axiom-api/1.2.14-SNAPSHOT/axiom-api-1.2.14-20120630.110933-210.pom
(15 KB at 623.3 KB/sec)
Downloading: http://shibboleth.internet2.edu/downloads/maven2/org/apache/ws/commons/axiom/axiom-parent/1.2.14-SNAPSHOT/maven-metadata.xml
Downloading: http://repository.apache.org/snapshots/org/apache/ws/commons/axiom/axiom-parent/1.2.14-SNAPSHOT/maven-metadata.xml
Downloaded: http://repository.apache.org/snapshots/org/apache/ws/commons/axiom/axiom-parent/1.2.14-SNAPSHOT/maven-metadata.xml
(622 B at 25.3 KB/sec)
[WARNING] Checksum validation failed, expected <!DOCTYPE but is 2b52583a26dc455eebec16f29ab9480344f2c5a4
for http://shibboleth.internet2.edu/downloads/maven2/org/apache/ws/commons/axiom/axiom-parent/1.2.14-SNAPSHOT/maven-metadata.xml
[WARNING] Checksum validation failed, expected <!DOCTYPE but is 2b52583a26dc455eebec16f29ab9480344f2c5a4
for http://shibboleth.internet2.edu/downloads/maven2/org/apache/ws/commons/axiom/axiom-parent/1.2.14-SNAPSHOT/maven-metadata.xml
Downloaded: http://shibboleth.internet2.edu/downloads/maven2/org/apache/ws/commons/axiom/axiom-parent/1.2.14-SNAPSHOT/maven-metadata.xml
(10 KB at 5.5 KB/sec)
[WARNING] The metadata <https://builds.apache.org/job/Rampart/ws/.repository/org/apache/ws/commons/axiom/axiom-parent/1.2.14-SNAPSHOT/maven-metadata-open-saml.xml>
is invalid: entity reference name can not contain character =' (position: END_TAG seen ...afile
= \'/includes/php/parser/index-confluence.php?limit=3&doDesc=... @32:74) 
Downloading: http://repository.apache.org/snapshots/org/apache/ws/commons/axiom/axiom-parent/1.2.14-SNAPSHOT/axiom-parent-1.2.14-20120630.110506-215.pom
Downloaded: http://repository.apache.org/snapshots/org/apache/ws/commons/axiom/axiom-parent/1.2.14-SNAPSHOT/axiom-parent-1.2.14-20120630.110506-215.pom
(20 KB at 733.8 KB/sec)
Downloading: http://shibboleth.internet2.edu/downloads/maven2/org/apache/james/apache-mime4j-core/0.8-SNAPSHOT/maven-metadata.xml
Downloading: http://repository.apache.org/snapshots/org/apache/james/apache-mime4j-core/0.8-SNAPSHOT/maven-metadata.xml
Downloaded: http://repository.apache.org/snapshots/org/apache/james/apache-mime4j-core/0.8-SNAPSHOT/maven-metadata.xml
(2 KB at 16.2 KB/sec)
[WARNING] Checksum validation failed, expected <!DOCTYPE but is 2b52583a26dc455eebec16f29ab9480344f2c5a4
for http://shibboleth.internet2.edu/downloads/maven2/org/apache/james/apache-mime4j-core/0.8-SNAPSHOT/maven-metadata.xml
[WARNING] Checksum validation failed, expected <!DOCTYPE but is 2b52583a26dc455eebec16f29ab9480344f2c5a4
for http://shibboleth.internet2.edu/downloads/maven2/org/apache/james/apache-mime4j-core/0.8-SNAPSHOT/maven-metadata.xml
Downloaded: http://shibboleth.internet2.edu/downloads/maven2/org/apache/james/apache-mime4j-core/0.8-SNAPSHOT/maven-metadata.xml
(10 KB at 5.5 KB/sec)
[WARNING] The metadata <https://builds.apache.org/job/Rampart/ws/.repository/org/apache/james/apache-mime4j-core/0.8-SNAPSHOT/maven-metadata-open-saml.xml>
is invalid: entity reference name can not contain character =' (position: END_TAG seen ...afile
= \'/includes/php/parser/index-confluence.php?limit=3&doDesc=... @32:74) 
Downloading: http://repository.apache.org/snapshots/org/apache/james/apache-mime4j-core/0.8-SNAPSHOT/apache-mime4j-core-0.8-20120630.003755-311.pom
Downloaded: http://repository.apache.org/snapshots/org/apache/james/apache-mime4j-core/0.8-SNAPSHOT/apache-mime4j-core-0.8-20120630.003755-311.pom
(3 KB at 84.2 KB/sec)
Downloading: http://shibboleth.internet2.edu/downloads/maven2/org/apache/james/apache-mime4j-project/0.8-SNAPSHOT/maven-metadata.xml
Downloading: http://repository.apache.org/snapshots/org/apache/james/apache-mime4j-project/0.8-SNAPSHOT/maven-metadata.xml
Downloaded: http://repository.apache.org/snapshots/org/apache/james/apache-mime4j-project/0.8-SNAPSHOT/maven-metadata.xml
(825 B at 33.6 KB/sec)
[WARNING] Checksum validation failed, expected <!DOCTYPE but is 2b52583a26dc455eebec16f29ab9480344f2c5a4
for http://shibboleth.internet2.edu/downloads/maven2/org/apache/james/apache-mime4j-project/0.8-SNAPSHOT/maven-metadata.xml
[WARNING] Checksum validation failed, expected <!DOCTYPE but is 2b52583a26dc455eebec16f29ab9480344f2c5a4
for http://shibboleth.internet2.edu/downloads/maven2/org/apache/james/apache-mime4j-project/0.8-SNAPSHOT/maven-metadata.xml
Downloaded: http://shibboleth.internet2.edu/downloads/maven2/org/apache/james/apache-mime4j-project/0.8-SNAPSHOT/maven-metadata.xml
(10 KB at 5.5 KB/sec)
[WARNING] The metadata <https://builds.apache.org/job/Rampart/ws/.repository/org/apache/james/apache-mime4j-project/0.8-SNAPSHOT/maven-metadata-open-saml.xml>
is invalid: entity reference name can not contain character =' (position: END_TAG seen ...afile
= \'/includes/php/parser/index-confluence.php?limit=3&doDesc=... @32:74) 
Downloading: http://repository.apache.org/snapshots/org/apache/james/apache-mime4j-project/0.8-SNAPSHOT/apache-mime4j-project-0.8-20120630.003715-339.pom
Downloaded: http://repository.apache.org/snapshots/org/apache/james/apache-mime4j-project/0.8-SNAPSHOT/apache-mime4j-project-0.8-20120630.003715-339.pom
(10 KB at 469.4 KB/sec)
Downloading: http://shibboleth.internet2.edu/downloads/maven2/org/apache/ws/commons/axiom/axiom-impl/1.2.14-SNAPSHOT/maven-metadata.xml
Downloading: http://repository.apache.org/snapshots/org/apache/ws/commons/axiom/axiom-impl/1.2.14-SNAPSHOT/maven-metadata.xml
Downloaded: http://repository.apache.org/snapshots/org/apache/ws/commons/axiom/axiom-impl/1.2.14-SNAPSHOT/maven-metadata.xml
(2 KB at 54.3 KB/sec)
[WARNING] Checksum validation failed, expected <!DOCTYPE but is 2b52583a26dc455eebec16f29ab9480344f2c5a4
for http://shibboleth.internet2.edu/downloads/maven2/org/apache/ws/commons/axiom/axiom-impl/1.2.14-SNAPSHOT/maven-metadata.xml
[WARNING] Checksum validation failed, expected <!DOCTYPE but is 2b52583a26dc455eebec16f29ab9480344f2c5a4
for http://shibboleth.internet2.edu/downloads/maven2/org/apache/ws/commons/axiom/axiom-impl/1.2.14-SNAPSHOT/maven-metadata.xml
Downloaded: http://shibboleth.internet2.edu/downloads/maven2/org/apache/ws/commons/axiom/axiom-impl/1.2.14-SNAPSHOT/maven-metadata.xml
(10 KB at 5.5 KB/sec)
[WARNING] The metadata <https://builds.apache.org/job/Rampart/ws/.repository/org/apache/ws/commons/axiom/axiom-impl/1.2.14-SNAPSHOT/maven-metadata-open-saml.xml>
is invalid: entity reference name can not contain character =' (position: END_TAG seen ...afile
= \'/includes/php/parser/index-confluence.php?limit=3&doDesc=... @32:74) 
Downloading: http://repository.apache.org/snapshots/org/apache/ws/commons/axiom/axiom-impl/1.2.14-SNAPSHOT/axiom-impl-1.2.14-20120630.111541-210.pom
Downloaded: http://repository.apache.org/snapshots/org/apache/ws/commons/axiom/axiom-impl/1.2.14-SNAPSHOT/axiom-impl-1.2.14-20120630.111541-210.pom
(8 KB at 239.5 KB/sec)
Downloading: http://shibboleth.internet2.edu/downloads/maven2/org/apache/ws/commons/schema/XmlSchema/1.4.8-SNAPSHOT/maven-metadata.xml
Downloading: http://repository.apache.org/snapshots/org/apache/ws/commons/schema/XmlSchema/1.4.8-SNAPSHOT/maven-metadata.xml
Downloaded: http://repository.apache.org/snapshots/org/apache/ws/commons/schema/XmlSchema/1.4.8-SNAPSHOT/maven-metadata.xml
(283 B at 11.1 KB/sec)
[WARNING] Checksum validation failed, expected <!DOCTYPE but is 2b52583a26dc455eebec16f29ab9480344f2c5a4
for http://shibboleth.internet2.edu/downloads/maven2/org/apache/ws/commons/schema/XmlSchema/1.4.8-SNAPSHOT/maven-metadata.xml
[WARNING] Checksum validation failed, expected <!DOCTYPE but is 2b52583a26dc455eebec16f29ab9480344f2c5a4
for http://shibboleth.internet2.edu/downloads/maven2/org/apache/ws/commons/schema/XmlSchema/1.4.8-SNAPSHOT/maven-metadata.xml
Downloaded: http://shibboleth.internet2.edu/downloads/maven2/org/apache/ws/commons/schema/XmlSchema/1.4.8-SNAPSHOT/maven-metadata.xml
(10 KB at 5.5 KB/sec)
[WARNING] The metadata <https://builds.apache.org/job/Rampart/ws/.repository/org/apache/ws/commons/schema/XmlSchema/1.4.8-SNAPSHOT/maven-metadata-open-saml.xml>
is invalid: entity reference name can not contain character =' (position: END_TAG seen ...afile
= \'/includes/php/parser/index-confluence.php?limit=3&doDesc=... @32:74) 
Downloading: http://shibboleth.internet2.edu/downloads/maven2/org/apache/ws/commons/schema/XmlSchema/1.4.8-SNAPSHOT/XmlSchema-1.4.8-SNAPSHOT.pom
[WARNING] Checksum validation failed, expected <!DOCTYPE but is 2b52583a26dc455eebec16f29ab9480344f2c5a4
for http://shibboleth.internet2.edu/downloads/maven2/org/apache/ws/commons/schema/XmlSchema/1.4.8-SNAPSHOT/XmlSchema-1.4.8-SNAPSHOT.pom
[WARNING] Checksum validation failed, expected <!DOCTYPE but is 2b52583a26dc455eebec16f29ab9480344f2c5a4
for http://shibboleth.internet2.edu/downloads/maven2/org/apache/ws/commons/schema/XmlSchema/1.4.8-SNAPSHOT/XmlSchema-1.4.8-SNAPSHOT.pom
Downloaded: http://shibboleth.internet2.edu/downloads/maven2/org/apache/ws/commons/schema/XmlSchema/1.4.8-SNAPSHOT/XmlSchema-1.4.8-SNAPSHOT.pom
(10 KB at 5.5 KB/sec)
[WARNING] Invalid POM for org.apache.ws.commons.schema:XmlSchema:jar:1.4.8-SNAPSHOT, transitive
dependencies (if any) will not be available, enable debug logging for more details
Downloading: http://repository.apache.org/snapshots/org/apache/neethi/neethi/3.0.3-SNAPSHOT/maven-metadata.xml
Downloading: http://shibboleth.internet2.edu/downloads/maven2/org/apache/neethi/neethi/3.0.3-SNAPSHOT/maven-metadata.xml
Downloaded: http://repository.apache.org/snapshots/org/apache/neethi/neethi/3.0.3-SNAPSHOT/maven-metadata.xml
(361 B at 11.4 KB/sec)
[WARNING] Checksum validation failed, expected <!DOCTYPE but is 2b52583a26dc455eebec16f29ab9480344f2c5a4
for http://shibboleth.internet2.edu/downloads/maven2/org/apache/neethi/neethi/3.0.3-SNAPSHOT/maven-metadata.xml
[WARNING] Checksum validation failed, expected <!DOCTYPE but is 2b52583a26dc455eebec16f29ab9480344f2c5a4
for http://shibboleth.internet2.edu/downloads/maven2/org/apache/neethi/neethi/3.0.3-SNAPSHOT/maven-metadata.xml
Downloaded: http://shibboleth.internet2.edu/downloads/maven2/org/apache/neethi/neethi/3.0.3-SNAPSHOT/maven-metadata.xml
(10 KB at 5.5 KB/sec)
[WARNING] The metadata <https://builds.apache.org/job/Rampart/ws/.repository/org/apache/neethi/neethi/3.0.3-SNAPSHOT/maven-metadata-open-saml.xml>
is invalid: entity reference name can not contain character =' (position: END_TAG seen ...afile
= \'/includes/php/parser/index-confluence.php?limit=3&doDesc=... @32:74) 
Downloading: http://repository.apache.org/snapshots/org/apache/neethi/neethi/3.0.3-SNAPSHOT/neethi-3.0.3-20120630.112727-178.pom
Downloaded: http://repository.apache.org/snapshots/org/apache/neethi/neethi/3.0.3-SNAPSHOT/neethi-3.0.3-20120630.112727-178.pom
(14 KB at 513.1 KB/sec)
Downloading: http://shibboleth.internet2.edu/downloads/maven2/org/apache/woden/woden-core/1.0-SNAPSHOT/maven-metadata.xml
Downloading: http://repository.apache.org/snapshots/org/apache/woden/woden-core/1.0-SNAPSHOT/maven-metadata.xml
Downloaded: http://repository.apache.org/snapshots/org/apache/woden/woden-core/1.0-SNAPSHOT/maven-metadata.xml
(770 B at 17.1 KB/sec)
[WARNING] Checksum validation failed, expected <!DOCTYPE but is 2b52583a26dc455eebec16f29ab9480344f2c5a4
for http://shibboleth.internet2.edu/downloads/maven2/org/apache/woden/woden-core/1.0-SNAPSHOT/maven-metadata.xml
[WARNING] Checksum validation failed, expected <!DOCTYPE but is 2b52583a26dc455eebec16f29ab9480344f2c5a4
for http://shibboleth.internet2.edu/downloads/maven2/org/apache/woden/woden-core/1.0-SNAPSHOT/maven-metadata.xml
Downloaded: http://shibboleth.internet2.edu/downloads/maven2/org/apache/woden/woden-core/1.0-SNAPSHOT/maven-metadata.xml
(10 KB at 5.5 KB/sec)
[WARNING] The metadata <https://builds.apache.org/job/Rampart/ws/.repository/org/apache/woden/woden-core/1.0-SNAPSHOT/maven-metadata-open-saml.xml>
is invalid: entity reference name can not contain character =' (position: END_TAG seen ...afile
= \'/includes/php/parser/index-confluence.php?limit=3&doDesc=... @32:74) 
Downloading: http://repository.apache.org/snapshots/org/apache/woden/woden-core/1.0-SNAPSHOT/woden-core-1.0-20120628.162815-3.pom
Downloaded: http://repository.apache.org/snapshots/org/apache/woden/woden-core/1.0-SNAPSHOT/woden-core-1.0-20120628.162815-3.pom
(5 KB at 193.0 KB/sec)
Downloading: http://shibboleth.internet2.edu/downloads/maven2/org/apache/woden/woden/1.0-SNAPSHOT/maven-metadata.xml
Downloading: http://repository.apache.org/snapshots/org/apache/woden/woden/1.0-SNAPSHOT/maven-metadata.xml
Downloaded: http://repository.apache.org/snapshots/org/apache/woden/woden/1.0-SNAPSHOT/maven-metadata.xml
(598 B at 25.4 KB/sec)
[WARNING] Checksum validation failed, expected <!DOCTYPE but is 2b52583a26dc455eebec16f29ab9480344f2c5a4
for http://shibboleth.internet2.edu/downloads/maven2/org/apache/woden/woden/1.0-SNAPSHOT/maven-metadata.xml
[WARNING] Checksum validation failed, expected <!DOCTYPE but is 2b52583a26dc455eebec16f29ab9480344f2c5a4
for http://shibboleth.internet2.edu/downloads/maven2/org/apache/woden/woden/1.0-SNAPSHOT/maven-metadata.xml
Downloaded: http://shibboleth.internet2.edu/downloads/maven2/org/apache/woden/woden/1.0-SNAPSHOT/maven-metadata.xml
(10 KB at 5.5 KB/sec)
[WARNING] The metadata <https://builds.apache.org/job/Rampart/ws/.repository/org/apache/woden/woden/1.0-SNAPSHOT/maven-metadata-open-saml.xml>
is invalid: entity reference name can not contain character =' (position: END_TAG seen ...afile
= \'/includes/php/parser/index-confluence.php?limit=3&doDesc=... @32:74) 
Downloading: http://repository.apache.org/snapshots/org/apache/woden/woden/1.0-SNAPSHOT/woden-1.0-20120628.162812-419.pom
Downloaded: http://repository.apache.org/snapshots/org/apache/woden/woden/1.0-SNAPSHOT/woden-1.0-20120628.162812-419.pom
(13 KB at 444.7 KB/sec)
Downloading: http://shibboleth.internet2.edu/downloads/maven2/org/apache/axis2/mex/1.7.0-SNAPSHOT/maven-metadata.xml
Downloading: http://repository.apache.org/snapshots/org/apache/axis2/mex/1.7.0-SNAPSHOT/maven-metadata.xml
Downloaded: http://repository.apache.org/snapshots/org/apache/axis2/mex/1.7.0-SNAPSHOT/maven-metadata.xml
(357 B at 9.7 KB/sec)
[WARNING] Checksum validation failed, expected <!DOCTYPE but is 2b52583a26dc455eebec16f29ab9480344f2c5a4
for http://shibboleth.internet2.edu/downloads/maven2/org/apache/axis2/mex/1.7.0-SNAPSHOT/maven-metadata.xml
[WARNING] Checksum validation failed, expected <!DOCTYPE but is 2b52583a26dc455eebec16f29ab9480344f2c5a4
for http://shibboleth.internet2.edu/downloads/maven2/org/apache/axis2/mex/1.7.0-SNAPSHOT/maven-metadata.xml
Downloaded: http://shibboleth.internet2.edu/downloads/maven2/org/apache/axis2/mex/1.7.0-SNAPSHOT/maven-metadata.xml
(10 KB at 5.5 KB/sec)
[WARNING] The metadata <https://builds.apache.org/job/Rampart/ws/.repository/org/apache/axis2/mex/1.7.0-SNAPSHOT/maven-metadata-open-saml.xml>
is invalid: entity reference name can not contain character =' (position: END_TAG seen ...afile
= \'/includes/php/parser/index-confluence.php?limit=3&doDesc=... @32:74) 
Downloading: http://repository.apache.org/snapshots/org/apache/axis2/mex/1.7.0-SNAPSHOT/mex-1.7.0-20120630.121207-817.pom
Downloaded: http://repository.apache.org/snapshots/org/apache/axis2/mex/1.7.0-SNAPSHOT/mex-1.7.0-20120630.121207-817.pom
(6 KB at 241.7 KB/sec)
Downloading: http://shibboleth.internet2.edu/downloads/maven2/org/apache/axis2/axis2-mtompolicy/1.7.0-SNAPSHOT/maven-metadata.xml
Downloading: http://repository.apache.org/snapshots/org/apache/axis2/axis2-mtompolicy/1.7.0-SNAPSHOT/maven-metadata.xml
Downloaded: http://repository.apache.org/snapshots/org/apache/axis2/axis2-mtompolicy/1.7.0-SNAPSHOT/maven-metadata.xml
(370 B at 1.9 KB/sec)
[WARNING] Checksum validation failed, expected <!DOCTYPE but is 2b52583a26dc455eebec16f29ab9480344f2c5a4
for http://shibboleth.internet2.edu/downloads/maven2/org/apache/axis2/axis2-mtompolicy/1.7.0-SNAPSHOT/maven-metadata.xml
[WARNING] Checksum validation failed, expected <!DOCTYPE but is 2b52583a26dc455eebec16f29ab9480344f2c5a4
for http://shibboleth.internet2.edu/downloads/maven2/org/apache/axis2/axis2-mtompolicy/1.7.0-SNAPSHOT/maven-metadata.xml
Downloaded: http://shibboleth.internet2.edu/downloads/maven2/org/apache/axis2/axis2-mtompolicy/1.7.0-SNAPSHOT/maven-metadata.xml
(10 KB at 5.5 KB/sec)
[WARNING] The metadata <https://builds.apache.org/job/Rampart/ws/.repository/org/apache/axis2/axis2-mtompolicy/1.7.0-SNAPSHOT/maven-metadata-open-saml.xml>
is invalid: entity reference name can not contain character =' (position: END_TAG seen ...afile
= \'/includes/php/parser/index-confluence.php?limit=3&doDesc=... @32:74) 
Downloading: http://repository.apache.org/snapshots/org/apache/axis2/axis2-mtompolicy/1.7.0-SNAPSHOT/axis2-mtompolicy-1.7.0-20120630.121207-825.pom
Downloaded: http://repository.apache.org/snapshots/org/apache/axis2/axis2-mtompolicy/1.7.0-SNAPSHOT/axis2-mtompolicy-1.7.0-20120630.121207-825.pom
(4 KB at 169.4 KB/sec)
Downloading: http://shibboleth.internet2.edu/downloads/maven2/org/apache/axis2/addressing/1.7.0-SNAPSHOT/maven-metadata.xml
Downloading: http://repository.apache.org/snapshots/org/apache/axis2/addressing/1.7.0-SNAPSHOT/maven-metadata.xml
Downloaded: http://repository.apache.org/snapshots/org/apache/axis2/addressing/1.7.0-SNAPSHOT/maven-metadata.xml
(364 B at 9.6 KB/sec)
[WARNING] Checksum validation failed, expected <!DOCTYPE but is 2b52583a26dc455eebec16f29ab9480344f2c5a4
for http://shibboleth.internet2.edu/downloads/maven2/org/apache/axis2/addressing/1.7.0-SNAPSHOT/maven-metadata.xml
[WARNING] Checksum validation failed, expected <!DOCTYPE but is 2b52583a26dc455eebec16f29ab9480344f2c5a4
for http://shibboleth.internet2.edu/downloads/maven2/org/apache/axis2/addressing/1.7.0-SNAPSHOT/maven-metadata.xml
Downloaded: http://shibboleth.internet2.edu/downloads/maven2/org/apache/axis2/addressing/1.7.0-SNAPSHOT/maven-metadata.xml
(10 KB at 5.5 KB/sec)
[WARNING] The metadata <https://builds.apache.org/job/Rampart/ws/.repository/org/apache/axis2/addressing/1.7.0-SNAPSHOT/maven-metadata-open-saml.xml>
is invalid: entity reference name can not contain character =' (position: END_TAG seen ...afile
= \'/includes/php/parser/index-confluence.php?limit=3&doDesc=... @32:74) 
Downloading: http://repository.apache.org/snapshots/org/apache/axis2/addressing/1.7.0-SNAPSHOT/addressing-1.7.0-20120630.121207-876.pom
Downloaded: http://repository.apache.org/snapshots/org/apache/axis2/addressing/1.7.0-SNAPSHOT/addressing-1.7.0-20120630.121207-876.pom
(5 KB at 226.0 KB/sec)
[WARNING] The metadata <https://builds.apache.org/job/Rampart/ws/.repository/org/apache/axis2/axis2-kernel/1.7.0-SNAPSHOT/maven-metadata-open-saml.xml>
is invalid: entity reference name can not contain character =' (position: END_TAG seen ...afile
= \'/includes/php/parser/index-confluence.php?limit=3&doDesc=... @32:74) 
[WARNING] The metadata <https://builds.apache.org/job/Rampart/ws/.repository/org/apache/ws/commons/axiom/axiom-api/1.2.14-SNAPSHOT/maven-metadata-open-saml.xml>
is invalid: entity reference name can not contain character =' (position: END_TAG seen ...afile
= \'/includes/php/parser/index-confluence.php?limit=3&doDesc=... @32:74) 
[WARNING] Downloading: http://repository.apache.org/snapshots/org/apache/axis2/axis2-kernel/1.7.0-SNAPSHOT/axis2-kernel-1.7.0-20120630.121207-895.jar
The metadata <https://builds.apache.org/job/Rampart/ws/.repository/org/apache/ws/commons/axiom/axiom-impl/1.2.14-SNAPSHOT/maven-metadata-open-saml.xml>
is invalid: entity reference name can not contain character =' (position: END_TAG seen ...afile
= \'/includes/php/parser/index-confluence.php?limit=3&doDesc=... @32:74) 
[WARNING] The metadata <https://builds.apache.org/job/Rampart/ws/.repository/org/apache/james/apache-mime4j-core/0.8-SNAPSHOT/maven-metadata-open-saml.xml>
is invalid: entity reference name can not contain character =' (position: END_TAG seen ...afile
= \'/includes/php/parser/index-confluence.php?limit=3&doDesc=... @32:74) 
Downloading: http://repository.apache.org/snapshots/org/apache/ws/commons/axiom/axiom-api/1.2.14-SNAPSHOT/axiom-api-1.2.14-20120630.110933-210.jar
Downloading: http://repository.apache.org/snapshots/org/apache/ws/commons/axiom/axiom-impl/1.2.14-SNAPSHOT/axiom-impl-1.2.14-20120630.111541-210.jar
Downloading: http://repository.apache.org/snapshots/org/apache/james/apache-mime4j-core/0.8-SNAPSHOT/apache-mime4j-core-0.8-20120630.003755-311.jar
[WARNING] The metadata <https://builds.apache.org/job/Rampart/ws/.repository/org/apache/ws/commons/schema/XmlSchema/1.4.8-SNAPSHOT/maven-metadata-open-saml.xml>
is invalid: entity reference name can not contain character =' (position: END_TAG seen ...afile
= \'/includes/php/parser/index-confluence.php?limit=3&doDesc=... @32:74) 
Downloading: http://shibboleth.internet2.edu/downloads/maven2/org/apache/ws/commons/schema/XmlSchema/1.4.8-SNAPSHOT/XmlSchema-1.4.8-SNAPSHOT.jar
Downloaded: http://repository.apache.org/snapshots/org/apache/james/apache-mime4j-core/0.8-SNAPSHOT/apache-mime4j-core-0.8-20120630.003755-311.jar
(94 KB at 1445.3 KB/sec)
Downloaded: http://repository.apache.org/snapshots/org/apache/ws/commons/axiom/axiom-impl/1.2.14-SNAPSHOT/axiom-impl-1.2.14-20120630.111541-210.jar
(158 KB at 2094.0 KB/sec)
[WARNING] The metadata <https://builds.apache.org/job/Rampart/ws/.repository/org/apache/neethi/neethi/3.0.3-SNAPSHOT/maven-metadata-open-saml.xml>
is invalid: entity reference name can not contain character =' (position: END_TAG seen ...afile
= \'/includes/php/parser/index-confluence.php?limit=3&doDesc=... @32:74) 
Downloading: http://repository.apache.org/snapshots/org/apache/neethi/neethi/3.0.3-SNAPSHOT/neethi-3.0.3-20120630.112727-178.jar
[WARNING] The metadata <https://builds.apache.org/job/Rampart/ws/.repository/org/apache/woden/woden-core/1.0-SNAPSHOT/maven-metadata-open-saml.xml>
is invalid: entity reference name can not contain character =' (position: END_TAG seen ...afile
= \'/includes/php/parser/index-confluence.php?limit=3&doDesc=... @32:74) 
Downloading: http://repository.apache.org/snapshots/org/apache/woden/woden-core/1.0-SNAPSHOT/woden-core-1.0-20120628.162815-3.jar
Downloaded: http://repository.apache.org/snapshots/org/apache/ws/commons/axiom/axiom-api/1.2.14-SNAPSHOT/axiom-api-1.2.14-20120630.110933-210.jar
(404 KB at 3998.0 KB/sec)
Downloaded: http://repository.apache.org/snapshots/org/apache/neethi/neethi/3.0.3-SNAPSHOT/neethi-3.0.3-20120630.112727-178.jar
(70 KB at 2787.9 KB/sec)
[WARNING] The metadata <https://builds.apache.org/job/Rampart/ws/.repository/org/apache/axis2/mex/1.7.0-SNAPSHOT/maven-metadata-open-saml.xml>
is invalid: entity reference name can not contain character =' (position: END_TAG seen ...afile
= \'/includes/php/parser/index-confluence.php?limit=3&doDesc=... @32:74) 
[WARNING] The metadata <https://builds.apache.org/job/Rampart/ws/.repository/org/apache/axis2/axis2-mtompolicy/1.7.0-SNAPSHOT/maven-metadata-open-saml.xml>
is invalid: entity reference name can not contain character =' (position: END_TAG seen ...afile
= \'/includes/php/parser/index-confluence.php?limit=3&doDesc=... @32:74) 
Downloading: http://repository.apache.org/snapshots/org/apache/axis2/mex/1.7.0-SNAPSHOT/mex-1.7.0-20120630.121207-817-impl.jar
Downloading: http://repository.apache.org/snapshots/org/apache/axis2/axis2-mtompolicy/1.7.0-SNAPSHOT/axis2-mtompolicy-1.7.0-20120630.121207-825.jar
Downloaded: http://repository.apache.org/snapshots/org/apache/axis2/axis2-kernel/1.7.0-SNAPSHOT/axis2-kernel-1.7.0-20120630.121207-895.jar
(1018 KB at 8008.3 KB/sec)
Downloaded: http://repository.apache.org/snapshots/org/apache/woden/woden-core/1.0-SNAPSHOT/woden-core-1.0-20120628.162815-3.jar
(364 KB at 7734.2 KB/sec)
[WARNING] The metadata <https://builds.apache.org/job/Rampart/ws/.repository/org/apache/axis2/addressing/1.7.0-SNAPSHOT/maven-metadata-open-saml.xml>
is invalid: entity reference name can not contain character =' (position: END_TAG seen ...afile
= \'/includes/php/parser/index-confluence.php?limit=3&doDesc=... @32:74) 
Downloading: http://repository.apache.org/snapshots/org/apache/axis2/addressing/1.7.0-SNAPSHOT/addressing-1.7.0-20120630.121207-876.mar
Downloaded: http://repository.apache.org/snapshots/org/apache/axis2/mex/1.7.0-SNAPSHOT/mex-1.7.0-20120630.121207-817-impl.jar
(33 KB at 1121.3 KB/sec)
Downloaded: http://repository.apache.org/snapshots/org/apache/axis2/axis2-mtompolicy/1.7.0-SNAPSHOT/axis2-mtompolicy-1.7.0-20120630.121207-825.jar
(14 KB at 414.8 KB/sec)
Downloaded: http://repository.apache.org/snapshots/org/apache/axis2/addressing/1.7.0-SNAPSHOT/addressing-1.7.0-20120630.121207-876.mar
(31 KB at 1227.3 KB/sec)
[WARNING] Checksum validation failed, expected <!DOCTYPE but is 2b52583a26dc455eebec16f29ab9480344f2c5a4
for http://shibboleth.internet2.edu/downloads/maven2/org/apache/ws/commons/schema/XmlSchema/1.4.8-SNAPSHOT/XmlSchema-1.4.8-SNAPSHOT.jar
[WARNING] Checksum validation failed, expected <!DOCTYPE but is 2b52583a26dc455eebec16f29ab9480344f2c5a4
for http://shibboleth.internet2.edu/downloads/maven2/org/apache/ws/commons/schema/XmlSchema/1.4.8-SNAPSHOT/XmlSchema-1.4.8-SNAPSHOT.jar
Downloaded: http://shibboleth.internet2.edu/downloads/maven2/org/apache/ws/commons/schema/XmlSchema/1.4.8-SNAPSHOT/XmlSchema-1.4.8-SNAPSHOT.jar
(10 KB at 5.5 KB/sec)
[WARNING] Invalid project model for artifact [XmlSchema:org.apache.ws.commons.schema:1.4.8-SNAPSHOT].
It will be ignored by the remote resources Mojo.
mojoSucceeded org.apache.maven.plugins:maven-remote-resources-plugin:1.1(default)
mojoStarted org.apache.maven.plugins:maven-install-plugin:2.3(default-install)
[INFO] 
[INFO] --- maven-install-plugin:2.3:install (default-install) @ rampart-project ---
[INFO] Installing <https://builds.apache.org/job/Rampart/ws/trunk/pom.xml> to <https://builds.apache.org/job/Rampart/ws/.repository/org/apache/rampart/rampart-project/1.7.0-SNAPSHOT/rampart-project-1.7.0-SNAPSHOT.pom>
mojoSucceeded org.apache.maven.plugins:maven-install-plugin:2.3(default-install)
projectSucceeded org.apache.rampart:rampart-project:1.7.0-SNAPSHOT
projectStarted org.apache.rampart:rampart-policy:1.7.0-SNAPSHOT
[INFO]                                                                         
[INFO] ------------------------------------------------------------------------
[INFO] Building Rampart - Policy 1.7.0-SNAPSHOT
[INFO] ------------------------------------------------------------------------
[WARNING] The POM for org.apache.ws.commons.schema:XmlSchema:jar:1.4.8-SNAPSHOT is invalid,
transitive dependencies (if any) will not be available, enable debug logging for more details
mojoStarted org.apache.maven.plugins:maven-clean-plugin:2.4.1(default-clean)[INFO] Deleting
<https://builds.apache.org/job/Rampart/ws/trunk/modules/rampart-policy/target>

[INFO] 
[INFO] --- maven-clean-plugin:2.4.1:clean (default-clean) @ rampart-policy ---
mojoSucceeded org.apache.maven.plugins:maven-clean-plugin:2.4.1(default-clean)
mojoStarted org.apache.maven.plugins:maven-remote-resources-plugin:1.1(default)
[INFO] 
[INFO] --- maven-remote-resources-plugin:1.1:process (default) @ rampart-policy ---
[WARNING] Invalid project model for artifact [XmlSchema:org.apache.ws.commons.schema:1.4.8-SNAPSHOT].
It will be ignored by the remote resources Mojo.
mojoSucceeded org.apache.maven.plugins:maven-remote-resources-plugin:1.1(default)
mojoStarted org.apache.maven.plugins:maven-resources-plugin:2.4(default-resources)
[INFO] 
[INFO] --- maven-resources-plugin:2.4:resources (default-resources) @ rampart-policy ---
[INFO] Using 'UTF-8' encoding to copy filtered resources.
[INFO] Copying 1 resource
[INFO] Copying 3 resources
mojoSucceeded org.apache.maven.plugins:maven-resources-plugin:2.4(default-resources)
mojoStarted org.apache.maven.plugins:maven-compiler-plugin:2.0(default-compile)
[INFO] 
[INFO] --- maven-compiler-plugin:2.0:compile (default-compile) @ rampart-policy ---
Compiling 89 source files to <https://builds.apache.org/job/Rampart/ws/trunk/modules/rampart-policy/target/classes>
mojoFailed org.apache.maven.plugins:maven-compiler-plugin:2.0(default-compile)
projectFailed org.apache.rampart:rampart-policy:1.7.0-SNAPSHOT
sessionEnded
[INFO] ------------------------------------------------------------------------
[INFO] Reactor Summary:
[INFO] 
[INFO] Apache Rampart .................................... SUCCESS [33.946s]
[INFO] Rampart - Policy .................................. FAILURE [2.079s]
[INFO] Rampart - Trust ................................... SKIPPED
[INFO] Rampart - Core .................................... SKIPPED
[INFO] Rampart - Test Suite .............................. SKIPPED
[INFO] Rampart - Mar ..................................... SKIPPED
[INFO] Rampart - Trust-Mar ............................... SKIPPED
[INFO] Rampart - Integration ............................. SKIPPED
[INFO] Rampart - Samples ................................. SKIPPED
[INFO] Rampart - Documentation ........................... SKIPPED
[INFO] Rampart - Distribution ............................ SKIPPED
[INFO] ------------------------------------------------------------------------
[INFO] BUILD FAILURE
[INFO] ------------------------------------------------------------------------
[INFO] Total time: 36.944s
[INFO] Finished at: Sat Jun 30 12:49:42 UTC 2012
[INFO] Final Memory: 14M/83M
[INFO] ------------------------------------------------------------------------
Projects to build: [MavenProject: org.apache.rampart:rampart-project:1.7.0-SNAPSHOT @ <https://builds.apache.org/job/Rampart/ws/trunk/pom.xml,>
MavenProject: org.apache.rampart:rampart-policy:1.7.0-SNAPSHOT @ <https://builds.apache.org/job/Rampart/ws/trunk/modules/rampart-policy/pom.xml,>
MavenProject: org.apache.rampart:rampart-trust:1.7.0-SNAPSHOT @ <https://builds.apache.org/job/Rampart/ws/trunk/modules/rampart-trust/pom.xml,>
MavenProject: org.apache.rampart:rampart-core:1.7.0-SNAPSHOT @ <https://builds.apache.org/job/Rampart/ws/trunk/modules/rampart-core/pom.xml,>
MavenProject: org.apache.rampart:rampart-tests:1.7.0-SNAPSHOT @ <https://builds.apache.org/job/Rampart/ws/trunk/modules/rampart-tests/pom.xml,>
MavenProject: org.apache.rampart:rampart:1.7.0-SNAPSHOT @ <https://builds.apache.org/job/Rampart/ws/trunk/modules/rampart-mar/pom.xml,>
MavenProject: org.apache.rampart:rahas:1.7.0-SNAPSHOT @ <https://builds.apache.org/job/Rampart/ws/trunk/modules/rampart-trust-mar/pom.xml,>
MavenProject: org.apache.rampart:rampart-integration:1.7.0-SNAPSHOT @ <https://builds.apache.org/job/Rampart/ws/trunk/modules/rampart-integration/pom.xml,>
MavenProject: org.apache.rampart:rampart-sample:1.7.0-SNAPSHOT @ <https://builds.apache.org/job/Rampart/ws/trunk/modules/rampart-samples/pom.xml,>
MavenProject: org.apache.rampart:rampart-documentation:1.7.0-SNAPSHOT @ <https://builds.apache.org/job/Rampart/ws/trunk/modules/documentation/pom.xml,>
MavenProject: org.apache.rampart:rampart-dist:1.7.0-SNAPSHOT @ <https://builds.apache.org/job/Rampart/ws/trunk/modules/distribution/pom.xml]>
[JENKINS] Archiving <https://builds.apache.org/job/Rampart/ws/trunk/modules/rampart-core/pom.xml>
to /home/hudson/hudson/jobs/Rampart/modules/org.apache.rampart$rampart-core/builds/2012-06-30_12-49-01/archive/org.apache.rampart/rampart-core/1.7.0-SNAPSHOT/rampart-core-1.7.0-SNAPSHOT.pom
[JENKINS] Archiving <https://builds.apache.org/job/Rampart/ws/trunk/modules/rampart-tests/pom.xml>
to /home/hudson/hudson/jobs/Rampart/modules/org.apache.rampart$rampart-tests/builds/2012-06-30_12-49-01/archive/org.apache.rampart/rampart-tests/1.7.0-SNAPSHOT/rampart-tests-1.7.0-SNAPSHOT.pom
[JENKINS] Archiving <https://builds.apache.org/job/Rampart/ws/trunk/modules/documentation/pom.xml>
to /home/hudson/hudson/jobs/Rampart/modules/org.apache.rampart$rampart-documentation/builds/2012-06-30_12-49-01/archive/org.apache.rampart/rampart-documentation/1.7.0-SNAPSHOT/rampart-documentation-1.7.0-SNAPSHOT.pom
[JENKINS] Archiving <https://builds.apache.org/job/Rampart/ws/trunk/pom.xml> to /home/hudson/hudson/jobs/Rampart/modules/org.apache.rampart$rampart-project/builds/2012-06-30_12-49-01/archive/org.apache.rampart/rampart-project/1.7.0-SNAPSHOT/rampart-project-1.7.0-SNAPSHOT.pom
[JENKINS] Archiving <https://builds.apache.org/job/Rampart/ws/trunk/modules/rampart-trust-mar/pom.xml>
to /home/hudson/hudson/jobs/Rampart/modules/org.apache.rampart$rahas/builds/2012-06-30_12-49-01/archive/org.apache.rampart/rahas/1.7.0-SNAPSHOT/rahas-1.7.0-SNAPSHOT.pom
[JENKINS] Archiving <https://builds.apache.org/job/Rampart/ws/trunk/modules/rampart-integration/pom.xml>
to /home/hudson/hudson/jobs/Rampart/modules/org.apache.rampart$rampart-integration/builds/2012-06-30_12-49-01/archive/org.apache.rampart/rampart-integration/1.7.0-SNAPSHOT/rampart-integration-1.7.0-SNAPSHOT.pom
[JENKINS] Archiving <https://builds.apache.org/job/Rampart/ws/trunk/modules/rampart-samples/pom.xml>
to /home/hudson/hudson/jobs/Rampart/modules/org.apache.rampart$rampart-sample/builds/2012-06-30_12-49-01/archive/org.apache.rampart/rampart-sample/1.7.0-SNAPSHOT/rampart-sample-1.7.0-SNAPSHOT.pom
[JENKINS] Archiving <https://builds.apache.org/job/Rampart/ws/trunk/modules/rampart-mar/pom.xml>
to /home/hudson/hudson/jobs/Rampart/modules/org.apache.rampart$rampart/builds/2012-06-30_12-49-01/archive/org.apache.rampart/rampart/1.7.0-SNAPSHOT/rampart-1.7.0-SNAPSHOT.pom
[JENKINS] Archiving <https://builds.apache.org/job/Rampart/ws/trunk/modules/rampart-policy/pom.xml>
to /home/hudson/hudson/jobs/Rampart/modules/org.apache.rampart$rampart-policy/builds/2012-06-30_12-49-01/archive/org.apache.rampart/rampart-policy/1.7.0-SNAPSHOT/rampart-policy-1.7.0-SNAPSHOT.pom
[JENKINS] Archiving <https://builds.apache.org/job/Rampart/ws/trunk/modules/rampart-trust/pom.xml>
to /home/hudson/hudson/jobs/Rampart/modules/org.apache.rampart$rampart-trust/builds/2012-06-30_12-49-01/archive/org.apache.rampart/rampart-trust/1.7.0-SNAPSHOT/rampart-trust-1.7.0-SNAPSHOT.pom
[JENKINS] Archiving <https://builds.apache.org/job/Rampart/ws/trunk/modules/distribution/pom.xml>
to /home/hudson/hudson/jobs/Rampart/modules/org.apache.rampart$rampart-dist/builds/2012-06-30_12-49-01/archive/org.apache.rampart/rampart-dist/1.7.0-SNAPSHOT/rampart-dist-1.7.0-SNAPSHOT.pom
Waiting for Jenkins to finish collecting data
mavenExecutionResult exceptions not empty
message : Failed to execute goal org.apache.maven.plugins:maven-compiler-plugin:2.0:compile
(default-compile) on project rampart-policy: Compilation failure
cause : Compilation failure
Stack trace : 
org.apache.maven.lifecycle.LifecycleExecutionException: Failed to execute goal org.apache.maven.plugins:maven-compiler-plugin:2.0:compile
(default-compile) on project rampart-policy: Compilation failure
	at org.apache.maven.lifecycle.internal.MojoExecutor.execute(MojoExecutor.java:213)
	at org.apache.maven.lifecycle.internal.MojoExecutor.execute(MojoExecutor.java:153)
	at org.apache.maven.lifecycle.internal.MojoExecutor.execute(MojoExecutor.java:145)
	at org.apache.maven.lifecycle.internal.LifecycleModuleBuilder.buildProject(LifecycleModuleBuilder.java:84)
	at org.apache.maven.lifecycle.internal.LifecycleModuleBuilder.buildProject(LifecycleModuleBuilder.java:59)
	at org.apache.maven.lifecycle.internal.LifecycleStarter.singleThreadedBuild(LifecycleStarter.java:183)
	at org.apache.maven.lifecycle.internal.LifecycleStarter.execute(LifecycleStarter.java:161)
	at org.apache.maven.DefaultMaven.doExecute(DefaultMaven.java:319)
	at org.apache.maven.DefaultMaven.execute(DefaultMaven.java:156)
	at org.jvnet.hudson.maven3.launcher.Maven3Launcher.main(Maven3Launcher.java:79)
	at sun.reflect.NativeMethodAccessorImpl.invoke0(Native Method)
	at sun.reflect.NativeMethodAccessorImpl.invoke(NativeMethodAccessorImpl.java:39)
	at sun.reflect.DelegatingMethodAccessorImpl.invoke(DelegatingMethodAccessorImpl.java:25)
	at java.lang.reflect.Method.invoke(Method.java:597)
	at org.codehaus.plexus.classworlds.launcher.Launcher.launchStandard(Launcher.java:329)
	at org.codehaus.plexus.classworlds.launcher.Launcher.launch(Launcher.java:239)
	at org.jvnet.hudson.maven3.agent.Maven3Main.launch(Maven3Main.java:158)
	at hudson.maven.Maven3Builder.call(Maven3Builder.java:98)
	at hudson.maven.Maven3Builder.call(Maven3Builder.java:64)
	at hudson.remoting.UserRequest.perform(UserRequest.java:118)
	at hudson.remoting.UserRequest.perform(UserRequest.java:48)
	at hudson.remoting.Request$2.run(Request.java:287)
	at hudson.remoting.InterceptingExecutorService$1.call(InterceptingExecutorService.java:72)
	at java.util.concurrent.FutureTask$Sync.innerRun(FutureTask.java:303)
	at java.util.concurrent.FutureTask.run(FutureTask.java:138)
	at java.util.concurrent.ThreadPoolExecutor$Worker.runTask(ThreadPoolExecutor.java:886)
	at java.util.concurrent.ThreadPoolExecutor$Worker.run(ThreadPoolExecutor.java:908)
	at java.lang.Thread.run(Thread.java:662)
Caused by: org.apache.maven.plugin.CompilationFailureException: Compilation failure
	at org.apache.maven.plugin.AbstractCompilerMojo.execute(AbstractCompilerMojo.java:429)
	at org.apache.maven.plugin.CompilerMojo.execute(CompilerMojo.java:110)
	at org.apache.maven.plugin.DefaultBuildPluginManager.executeMojo(DefaultBuildPluginManager.java:101)
	at org.apache.maven.lifecycle.internal.MojoExecutor.execute(MojoExecutor.java:209)
	... 27 more
channel stopped
[locks-and-latches] Releasing all the locks
[locks-and-latches] All the locks released

---------------------------------------------------------------------
To unsubscribe, e-mail: java-dev-unsubscribe@axis.apache.org
For additional commands, e-mail: java-dev-help@axis.apache.org


Mime
View raw message