axis-java-dev mailing list archives

Site index · List index
Message view « Date » · « Thread »
Top « Date » · « Thread »
From Apache Jenkins Server <jenk...@builds.apache.org>
Subject Build failed in Jenkins: Axis2-trunk-java-1.6 #1000
Date Sat, 30 Jun 2012 11:53:03 GMT
See <https://builds.apache.org/job/Axis2-trunk-java-1.6/1000/>

------------------------------------------
[...truncated 3680 lines...]
jar:
     [copy] Copying 1 file to <https://builds.apache.org/job/Axis2-trunk-java-1.6/ws/axis2/modules/integration/test-resources/SOAP12Testing/SOAP12TestServiceB/build/classes/META-INF>
    [mkdir] Created dir: <https://builds.apache.org/job/Axis2-trunk-java-1.6/ws/axis2/modules/integration/target/Repository/services>
      [jar] Building jar: <https://builds.apache.org/job/Axis2-trunk-java-1.6/ws/axis2/modules/integration/target/Repository/services/SOAP12TestServiceB.jar>
   [delete] Deleting directory <https://builds.apache.org/job/Axis2-trunk-java-1.6/ws/axis2/modules/integration/test-resources/SOAP12Testing/SOAP12TestServiceB/build>

init:
     [echo] the files are up to date = ${jars.uptodate}

compile:
    [mkdir] Created dir: <https://builds.apache.org/job/Axis2-trunk-java-1.6/ws/axis2/modules/integration/test-resources/SOAP12Testing/SOAP12TestServiceC/build/classes>
    [mkdir] Created dir: <https://builds.apache.org/job/Axis2-trunk-java-1.6/ws/axis2/modules/integration/test-resources/SOAP12Testing/SOAP12TestServiceC/build/lib>
    [javac] Compiling 1 source file to <https://builds.apache.org/job/Axis2-trunk-java-1.6/ws/axis2/modules/integration/test-resources/SOAP12Testing/SOAP12TestServiceC/build/classes>

jar:
     [copy] Copying 1 file to <https://builds.apache.org/job/Axis2-trunk-java-1.6/ws/axis2/modules/integration/test-resources/SOAP12Testing/SOAP12TestServiceC/build/classes/META-INF>
      [jar] Building jar: <https://builds.apache.org/job/Axis2-trunk-java-1.6/ws/axis2/modules/integration/target/Repository/services/SOAP12TestServiceC.jar>
   [delete] Deleting directory <https://builds.apache.org/job/Axis2-trunk-java-1.6/ws/axis2/modules/integration/test-resources/SOAP12Testing/SOAP12TestServiceC/build>
[INFO] Executed tasks
mojoSucceeded org.apache.maven.plugins:maven-antrun-plugin:1.2(gen-ts)
mojoStarted org.apache.maven.plugins:maven-resources-plugin:2.4.2(default-testResources)[INFO]
Using 'UTF-8' encoding to copy filtered resources.
[INFO] Copying 3 resources

[INFO] 
[INFO] --- maven-resources-plugin:2.4.2:testResources (default-testResources) @ axis2-integration
---
[INFO] Copying 412 resources
[INFO] Copying 3 resources
mojoSucceeded org.apache.maven.plugins:maven-resources-plugin:2.4.2(default-testResources)
mojoStarted org.codehaus.mojo:build-helper-maven-plugin:1.4(add-test-source)[INFO] Test Source
directory: <https://builds.apache.org/job/Axis2-trunk-java-1.6/ws/axis2/modules/integration/target/wsdl/complexdatatype/src>
added.
[INFO] Test Source directory: <https://builds.apache.org/job/Axis2-trunk-java-1.6/ws/axis2/modules/integration/target/wsdl/complexdatatypebare/src>
added.
[INFO] Test Source directory: <https://builds.apache.org/job/Axis2-trunk-java-1.6/ws/axis2/modules/integration/target/xmlbeans/java>
added.

[INFO] 
[INFO] --- build-helper-maven-plugin:1.4:add-test-source (add-test-source) @ axis2-integration
---
mojoSucceeded org.codehaus.mojo:build-helper-maven-plugin:1.4(add-test-source)
mojoStarted org.apache.maven.plugins:maven-compiler-plugin:2.3.1(default-testCompile)
[INFO] 
[INFO] --- maven-compiler-plugin:2.3.1:testCompile (default-testCompile) @ axis2-integration
---
[INFO] Compiling 528 source files to <https://builds.apache.org/job/Axis2-trunk-java-1.6/ws/axis2/modules/integration/target/test-classes>
[INFO] -------------------------------------------------------------
[ERROR] COMPILATION ERROR : 
[INFO] -------------------------------------------------------------
[ERROR] <https://builds.apache.org/job/Axis2-trunk-java-1.6/ws/axis2/modules/integration/test/org/apache/axis2/swa/EchoRawSwATest.java>:[135,35]
cannot find symbol
symbol  : constructor OMTextImpl(javax.activation.DataHandler,boolean,<nulltype>)
location: class org.apache.axiom.om.impl.llom.OMTextImpl

[ERROR] <https://builds.apache.org/job/Axis2-trunk-java-1.6/ws/axis2/modules/integration/test/org/apache/axis2/swa/EchoRawSwATest.java>:[136,35]
cannot find symbol
symbol  : constructor OMTextImpl(javax.activation.DataHandler,boolean,<nulltype>)
location: class org.apache.axiom.om.impl.llom.OMTextImpl

[ERROR] <https://builds.apache.org/job/Axis2-trunk-java-1.6/ws/axis2/modules/integration/test/org/apache/axis2/mtom/EchoRawMTOMTest.java>:[101,27]
cannot find symbol
symbol  : constructor OMTextImpl(javax.activation.DataHandler,boolean,org.apache.axiom.om.OMFactory)
location: class org.apache.axiom.om.impl.llom.OMTextImpl

[ERROR] <https://builds.apache.org/job/Axis2-trunk-java-1.6/ws/axis2/modules/integration/test/org/apache/axis2/mtom/EchoRawMTOMLoadTest.java>:[99,23]
cannot find symbol
symbol  : constructor OMTextImpl(javax.activation.DataHandler,boolean,org.apache.axiom.om.OMFactory)
location: class org.apache.axiom.om.impl.llom.OMTextImpl

[ERROR] <https://builds.apache.org/job/Axis2-trunk-java-1.6/ws/axis2/modules/integration/test/org/apache/axis2/mtom/EchoRawMTOMToBase64Test.java>:[101,27]
cannot find symbol
symbol  : constructor OMTextImpl(javax.activation.DataHandler,boolean,org.apache.axiom.om.OMFactory)
location: class org.apache.axiom.om.impl.llom.OMTextImpl

[ERROR] <https://builds.apache.org/job/Axis2-trunk-java-1.6/ws/axis2/modules/integration/test/org/apache/axis2/mtom/MessageSaveAndRestoreWithMTOMTest.java>:[168,27]
cannot find symbol
symbol  : constructor OMTextImpl(javax.activation.DataHandler,boolean,org.apache.axiom.om.OMFactory)
location: class org.apache.axiom.om.impl.llom.OMTextImpl

[INFO] 6 errors 
[INFO] -------------------------------------------------------------
mojoFailed org.apache.maven.plugins:maven-compiler-plugin:2.3.1(default-testCompile)
projectFailed org.apache.axis2:axis2-integration:1.7.0-SNAPSHOT
sessionEnded
[INFO] ------------------------------------------------------------------------
[INFO] Reactor Summary:
[INFO] 
[INFO] Apache Axis2 - Parent ............................. SUCCESS [26.182s]
[INFO] Apache Axis2 - Resource bundle .................... SUCCESS [3.914s]
[INFO] Apache Axis2 - Kernel ............................. SUCCESS [40.911s]
[INFO] Apache Axis2 - Data Binding ....................... SUCCESS [14.848s]
[INFO] Apache Axis2 - Transport - Local .................. SUCCESS [7.436s]
[INFO] Apache Axis2 - Transport - HTTP ................... SUCCESS [11.255s]
[INFO] Apache Axis2 - Code Generation .................... SUCCESS [14.765s]
[INFO] Apache Axis2 - ADB Codegen ........................ SUCCESS [38.544s]
[INFO] Apache Axis2 - Addressing ......................... SUCCESS [7.995s]
[INFO] Apache Axis2 - Java2WSDL .......................... SUCCESS [14.868s]
[INFO] Apache Axis2 - tool - Repository Maven Plugin ..... SUCCESS [6.969s]
[INFO] Apache Axis2 - Fast Infoset ....................... SUCCESS [18.832s]
[INFO] Apache Axis2 - Clustering ......................... SUCCESS [1:14.069s]
[INFO] Apache Axis2 - Scripting .......................... SUCCESS [5.907s]
[INFO] Apache Axis2 - SAAJ ............................... SUCCESS [25.901s]
[INFO] Apache Axis2 - Metadata ........................... SUCCESS [20.786s]
[INFO] Apache Axis2 - JAXWS .............................. SUCCESS [1:04.210s]
[INFO] Apache Axis2 - Test Utilities ..................... SUCCESS [3.418s]
[INFO] Apache Axis2 - XMLBeans Data Binding .............. SUCCESS [59.172s]
[INFO] Apache Axis2 - tool - WSDL2Code Maven Plugin ...... SUCCESS [8.889s]
[INFO] Apache Axis2 - JAXWS Integration Tests ............ SUCCESS [14:13.534s]
[INFO] Apache Axis2 - MTOM Policy ........................ SUCCESS [4.804s]
[INFO] Apache Axis2 - spring ............................. SUCCESS [3.066s]
[INFO] Apache Axis2 - OSGi Integration ................... SUCCESS [5.398s]
[INFO] Apache Axis2 - Integration ........................ FAILURE [1:09.979s]
[INFO] Apache Axis2 - JiBX Data Binding .................. SKIPPED
[INFO] Apache Axis2 - JSON ............................... SKIPPED
[INFO] Apache Axis2 - MEX ................................ SKIPPED
[INFO] Apache Axis2 - MTOM Policy module ................. SKIPPED
[INFO] Apache Axis2 - Ping ............................... SKIPPED
[INFO] Apache Axis2 - Version Service .................... SKIPPED
[INFO] Apache Axis2 - SOAP Monitor Servlet ............... SKIPPED
[INFO] Apache Axis2 - SOAP Monitor Module ................ SKIPPED
[INFO] Apache Axis2 - tool - AAR Maven Plugin ............ SKIPPED
[INFO] Apache Axis2 - tool - Ant Plugin .................. SKIPPED
[INFO] Apache Axis2 - tool - Eclipse Codegen Plugin ...... SKIPPED
[INFO] Apache Axis2 - tool - Eclipse service Plugin ...... SKIPPED
[INFO] Apache Axis2 - tool - Intellij IDEA Plugin ........ SKIPPED
[INFO] Apache Axis2 - tool - Java2WSDL Maven Plugin ...... SKIPPED
[INFO] Apache Axis2 - tool - MAR Maven Plugin ............ SKIPPED
[INFO] Apache Axis2 Simple HTTP server Maven Plugin ...... SKIPPED
[INFO] Axis2 quickstart archetype ........................ SKIPPED
[INFO] Axis2 quickstart-web archetype .................... SKIPPED
[INFO] Apache Axis2 - JAXB-RI Data Binding ............... SKIPPED
[INFO] Apache Axis2 - CORBA .............................. SKIPPED
[INFO] Apache Axis2 - JAXWS (mar) ........................ SKIPPED
[INFO] Apache Axis2 - Web Application module ............. SKIPPED
[INFO] Apache Axis2 - Root ............................... SKIPPED
[INFO] ------------------------------------------------------------------------
[INFO] BUILD FAILURE
[INFO] ------------------------------------------------------------------------
[INFO] Total time: 23:35.065s
[INFO] Finished at: Sat Jun 30 11:52:08 UTC 2012
[INFO] Final Memory: 81M/702M
[INFO] ------------------------------------------------------------------------
Projects to build: [MavenProject: org.apache.axis2:axis2-parent:1.7.0-SNAPSHOT @ <https://builds.apache.org/job/Axis2-trunk-java-1.6/ws/axis2/modules/parent/pom.xml,>
MavenProject: org.apache.axis2:axis2-resource-bundle:1.7.0-SNAPSHOT @ <https://builds.apache.org/job/Axis2-trunk-java-1.6/ws/axis2/modules/resource-bundle/pom.xml,>
MavenProject: org.apache.axis2:axis2-kernel:1.7.0-SNAPSHOT @ <https://builds.apache.org/job/Axis2-trunk-java-1.6/ws/axis2/modules/kernel/pom.xml,>
MavenProject: org.apache.axis2:axis2-adb:1.7.0-SNAPSHOT @ <https://builds.apache.org/job/Axis2-trunk-java-1.6/ws/axis2/modules/adb/pom.xml,>
MavenProject: org.apache.axis2:axis2-transport-local:1.7.0-SNAPSHOT @ <https://builds.apache.org/job/Axis2-trunk-java-1.6/ws/axis2/modules/transport/local/pom.xml,>
MavenProject: org.apache.axis2:axis2-transport-http:1.7.0-SNAPSHOT @ <https://builds.apache.org/job/Axis2-trunk-java-1.6/ws/axis2/modules/transport/http/pom.xml,>
MavenProject: org.apache.axis2:axis2-codegen:1.7.0-SNAPSHOT @ <https://builds.apache.org/job/Axis2-trunk-java-1.6/ws/axis2/modules/codegen/pom.xml,>
MavenProject: org.apache.axis2:axis2-adb-codegen:1.7.0-SNAPSHOT @ <https://builds.apache.org/job/Axis2-trunk-java-1.6/ws/axis2/modules/adb-codegen/pom.xml,>
MavenProject: org.apache.axis2:addressing:1.7.0-SNAPSHOT @ <https://builds.apache.org/job/Axis2-trunk-java-1.6/ws/axis2/modules/addressing/pom.xml,>
MavenProject: org.apache.axis2:axis2-java2wsdl:1.7.0-SNAPSHOT @ <https://builds.apache.org/job/Axis2-trunk-java-1.6/ws/axis2/modules/java2wsdl/pom.xml,>
MavenProject: org.apache.axis2:axis2-repo-maven-plugin:1.7.0-SNAPSHOT @ <https://builds.apache.org/job/Axis2-trunk-java-1.6/ws/axis2/modules/tool/axis2-repo-maven-plugin/pom.xml,>
MavenProject: org.apache.axis2:axis2-fastinfoset:1.7.0-SNAPSHOT @ <https://builds.apache.org/job/Axis2-trunk-java-1.6/ws/axis2/modules/fastinfoset/pom.xml,>
MavenProject: org.apache.axis2:axis2-clustering:1.7.0-SNAPSHOT @ <https://builds.apache.org/job/Axis2-trunk-java-1.6/ws/axis2/modules/clustering/pom.xml,>
MavenProject: org.apache.axis2:scripting:1.7.0-SNAPSHOT @ <https://builds.apache.org/job/Axis2-trunk-java-1.6/ws/axis2/modules/scripting/pom.xml,>
MavenProject: org.apache.axis2:axis2-saaj:1.7.0-SNAPSHOT @ <https://builds.apache.org/job/Axis2-trunk-java-1.6/ws/axis2/modules/saaj/pom.xml,>
MavenProject: org.apache.axis2:axis2-metadata:1.7.0-SNAPSHOT @ <https://builds.apache.org/job/Axis2-trunk-java-1.6/ws/axis2/modules/metadata/pom.xml,>
MavenProject: org.apache.axis2:axis2-jaxws:1.7.0-SNAPSHOT @ <https://builds.apache.org/job/Axis2-trunk-java-1.6/ws/axis2/modules/jaxws/pom.xml,>
MavenProject: org.apache.axis2:axis2-testutils:1.7.0-SNAPSHOT @ <https://builds.apache.org/job/Axis2-trunk-java-1.6/ws/axis2/modules/testutils/pom.xml,>
MavenProject: org.apache.axis2:axis2-xmlbeans:1.7.0-SNAPSHOT @ <https://builds.apache.org/job/Axis2-trunk-java-1.6/ws/axis2/modules/xmlbeans/pom.xml,>
MavenProject: org.apache.axis2:axis2-wsdl2code-maven-plugin:1.7.0-SNAPSHOT @ <https://builds.apache.org/job/Axis2-trunk-java-1.6/ws/axis2/modules/tool/axis2-wsdl2code-maven-plugin/pom.xml,>
MavenProject: org.apache.axis2:axis2-jaxws-integration:1.7.0-SNAPSHOT @ <https://builds.apache.org/job/Axis2-trunk-java-1.6/ws/axis2/modules/jaxws-integration/pom.xml,>
MavenProject: org.apache.axis2:axis2-mtompolicy:1.7.0-SNAPSHOT @ <https://builds.apache.org/job/Axis2-trunk-java-1.6/ws/axis2/modules/mtompolicy/pom.xml,>
MavenProject: org.apache.axis2:axis2-spring:1.7.0-SNAPSHOT @ <https://builds.apache.org/job/Axis2-trunk-java-1.6/ws/axis2/modules/spring/pom.xml,>
MavenProject: org.apache.axis2:org.apache.axis2.osgi:1.7.0-SNAPSHOT @ <https://builds.apache.org/job/Axis2-trunk-java-1.6/ws/axis2/modules/osgi/pom.xml,>
MavenProject: org.apache.axis2:axis2-integration:1.7.0-SNAPSHOT @ <https://builds.apache.org/job/Axis2-trunk-java-1.6/ws/axis2/modules/integration/pom.xml,>
MavenProject: org.apache.axis2:axis2-jibx:1.7.0-SNAPSHOT @ <https://builds.apache.org/job/Axis2-trunk-java-1.6/ws/axis2/modules/jibx/pom.xml,>
MavenProject: org.apache.axis2:axis2-json:1.7.0-SNAPSHOT @ <https://builds.apache.org/job/Axis2-trunk-java-1.6/ws/axis2/modules/json/pom.xml,>
MavenProject: org.apache.axis2:mex:1.7.0-SNAPSHOT @ <https://builds.apache.org/job/Axis2-trunk-java-1.6/ws/axis2/modules/mex/pom.xml,>
MavenProject: org.apache.axis2:mtompolicy:1.7.0-SNAPSHOT @ <https://builds.apache.org/job/Axis2-trunk-java-1.6/ws/axis2/modules/mtompolicy-mar/pom.xml,>
MavenProject: org.apache.axis2:ping:1.7.0-SNAPSHOT @ <https://builds.apache.org/job/Axis2-trunk-java-1.6/ws/axis2/modules/ping/pom.xml,>
MavenProject: org.apache.axis2:version:1.7.0-SNAPSHOT @ <https://builds.apache.org/job/Axis2-trunk-java-1.6/ws/axis2/modules/samples/version/pom.xml,>
MavenProject: org.apache.axis2:axis2-soapmonitor-servlet:1.7.0-SNAPSHOT @ <https://builds.apache.org/job/Axis2-trunk-java-1.6/ws/axis2/modules/soapmonitor/servlet/pom.xml,>
MavenProject: org.apache.axis2:soapmonitor:1.7.0-SNAPSHOT @ <https://builds.apache.org/job/Axis2-trunk-java-1.6/ws/axis2/modules/soapmonitor/module/pom.xml,>
MavenProject: org.apache.axis2:axis2-aar-maven-plugin:1.7.0-SNAPSHOT @ <https://builds.apache.org/job/Axis2-trunk-java-1.6/ws/axis2/modules/tool/axis2-aar-maven-plugin/pom.xml,>
MavenProject: org.apache.axis2:axis2-ant-plugin:1.7.0-SNAPSHOT @ <https://builds.apache.org/job/Axis2-trunk-java-1.6/ws/axis2/modules/tool/axis2-ant-plugin/pom.xml,>
MavenProject: org.apache.axis2:axis2.eclipse.codegen.plugin:1.7.0-SNAPSHOT @ <https://builds.apache.org/job/Axis2-trunk-java-1.6/ws/axis2/modules/tool/axis2-eclipse-codegen-plugin/pom.xml,>
MavenProject: org.apache.axis2:axis2.eclipse.service.plugin:1.7.0-SNAPSHOT @ <https://builds.apache.org/job/Axis2-trunk-java-1.6/ws/axis2/modules/tool/axis2-eclipse-service-plugin/pom.xml,>
MavenProject: org.apache.axis2:axis2-idea-plugin:1.7.0-SNAPSHOT @ <https://builds.apache.org/job/Axis2-trunk-java-1.6/ws/axis2/modules/tool/axis2-idea-plugin/pom.xml,>
MavenProject: org.apache.axis2:axis2-java2wsdl-maven-plugin:1.7.0-SNAPSHOT @ <https://builds.apache.org/job/Axis2-trunk-java-1.6/ws/axis2/modules/tool/axis2-java2wsdl-maven-plugin/pom.xml,>
MavenProject: org.apache.axis2:axis2-mar-maven-plugin:1.7.0-SNAPSHOT @ <https://builds.apache.org/job/Axis2-trunk-java-1.6/ws/axis2/modules/tool/axis2-mar-maven-plugin/pom.xml,>
MavenProject: org.apache.axis2:simple-server-maven-plugin:1.7.0-SNAPSHOT @ <https://builds.apache.org/job/Axis2-trunk-java-1.6/ws/axis2/modules/tool/simple-server-maven-plugin/pom.xml,>
MavenProject: org.apache.axis2.archetype:quickstart:1.7.0-SNAPSHOT @ <https://builds.apache.org/job/Axis2-trunk-java-1.6/ws/axis2/modules/tool/archetype/quickstart/pom.xml,>
MavenProject: org.apache.axis2.archetype:quickstart-webapp:1.7.0-SNAPSHOT @ <https://builds.apache.org/job/Axis2-trunk-java-1.6/ws/axis2/modules/tool/archetype/quickstart-webapp/pom.xml,>
MavenProject: org.apache.axis2:axis2-jaxbri:1.7.0-SNAPSHOT @ <https://builds.apache.org/job/Axis2-trunk-java-1.6/ws/axis2/modules/jaxbri/pom.xml,>
MavenProject: org.apache.axis2:axis2-corba:1.7.0-SNAPSHOT @ <https://builds.apache.org/job/Axis2-trunk-java-1.6/ws/axis2/modules/corba/pom.xml,>
MavenProject: org.apache.axis2:axis2-jaxws-mar:1.7.0-SNAPSHOT @ <https://builds.apache.org/job/Axis2-trunk-java-1.6/ws/axis2/modules/jaxws-mar/pom.xml,>
MavenProject: org.apache.axis2:axis2-webapp:1.7.0-SNAPSHOT @ <https://builds.apache.org/job/Axis2-trunk-java-1.6/ws/axis2/modules/webapp/pom.xml,>
MavenProject: org.apache.axis2:axis2:1.7.0-SNAPSHOT @ <https://builds.apache.org/job/Axis2-trunk-java-1.6/ws/axis2/pom.xml]>
[JENKINS] Archiving <https://builds.apache.org/job/Axis2-trunk-java-1.6/ws/axis2/modules/integration/pom.xml>
to /home/hudson/hudson/jobs/Axis2-trunk-java-1.6/modules/org.apache.axis2$axis2-integration/builds/2012-06-30_11-28-17/archive/org.apache.axis2/axis2-integration/1.7.0-SNAPSHOT/axis2-integration-1.7.0-SNAPSHOT.pom
[JENKINS] Archiving <https://builds.apache.org/job/Axis2-trunk-java-1.6/ws/axis2/modules/mtompolicy-mar/pom.xml>
to /home/hudson/hudson/jobs/Axis2-trunk-java-1.6/modules/org.apache.axis2$mtompolicy/builds/2012-06-30_11-28-18/archive/org.apache.axis2/mtompolicy/1.7.0-SNAPSHOT/mtompolicy-1.7.0-SNAPSHOT.pom
[JENKINS] Archiving <https://builds.apache.org/job/Axis2-trunk-java-1.6/ws/axis2/modules/codegen/pom.xml>
to /home/hudson/hudson/jobs/Axis2-trunk-java-1.6/modules/org.apache.axis2$axis2-codegen/builds/2012-06-30_11-28-17/archive/org.apache.axis2/axis2-codegen/1.7.0-SNAPSHOT/axis2-codegen-1.7.0-SNAPSHOT.pom
[JENKINS] Archiving <https://builds.apache.org/job/Axis2-trunk-java-1.6/ws/axis2/modules/codegen/target/axis2-codegen-1.7.0-SNAPSHOT.jar>
to /home/hudson/hudson/jobs/Axis2-trunk-java-1.6/modules/org.apache.axis2$axis2-codegen/builds/2012-06-30_11-28-17/archive/org.apache.axis2/axis2-codegen/1.7.0-SNAPSHOT/axis2-codegen-1.7.0-SNAPSHOT.jar
[JENKINS] Archiving <https://builds.apache.org/job/Axis2-trunk-java-1.6/ws/axis2/modules/resource-bundle/pom.xml>
to /home/hudson/hudson/jobs/Axis2-trunk-java-1.6/modules/org.apache.axis2$axis2-resource-bundle/builds/2012-06-30_11-28-17/archive/org.apache.axis2/axis2-resource-bundle/1.7.0-SNAPSHOT/axis2-resource-bundle-1.7.0-SNAPSHOT.pom
[JENKINS] Archiving <https://builds.apache.org/job/Axis2-trunk-java-1.6/ws/axis2/modules/resource-bundle/target/axis2-resource-bundle-1.7.0-SNAPSHOT.jar>
to /home/hudson/hudson/jobs/Axis2-trunk-java-1.6/modules/org.apache.axis2$axis2-resource-bundle/builds/2012-06-30_11-28-17/archive/org.apache.axis2/axis2-resource-bundle/1.7.0-SNAPSHOT/axis2-resource-bundle-1.7.0-SNAPSHOT.jar
[JENKINS] Archiving <https://builds.apache.org/job/Axis2-trunk-java-1.6/ws/axis2/modules/tool/simple-server-maven-plugin/pom.xml>
to /home/hudson/hudson/jobs/Axis2-trunk-java-1.6/modules/org.apache.axis2$simple-server-maven-plugin/builds/2012-06-30_11-28-19/archive/org.apache.axis2/simple-server-maven-plugin/1.7.0-SNAPSHOT/simple-server-maven-plugin-1.7.0-SNAPSHOT.pom
[JENKINS] Archiving <https://builds.apache.org/job/Axis2-trunk-java-1.6/ws/axis2/modules/xmlbeans/pom.xml>
to /home/hudson/hudson/jobs/Axis2-trunk-java-1.6/modules/org.apache.axis2$axis2-xmlbeans/builds/2012-06-30_11-28-19/archive/org.apache.axis2/axis2-xmlbeans/1.7.0-SNAPSHOT/axis2-xmlbeans-1.7.0-SNAPSHOT.pom
[JENKINS] Archiving <https://builds.apache.org/job/Axis2-trunk-java-1.6/ws/axis2/modules/xmlbeans/target/axis2-xmlbeans-1.7.0-SNAPSHOT.jar>
to /home/hudson/hudson/jobs/Axis2-trunk-java-1.6/modules/org.apache.axis2$axis2-xmlbeans/builds/2012-06-30_11-28-19/archive/org.apache.axis2/axis2-xmlbeans/1.7.0-SNAPSHOT/axis2-xmlbeans-1.7.0-SNAPSHOT.jar
[JENKINS] Archiving <https://builds.apache.org/job/Axis2-trunk-java-1.6/ws/axis2/modules/metadata/pom.xml>
to /home/hudson/hudson/jobs/Axis2-trunk-java-1.6/modules/org.apache.axis2$axis2-metadata/builds/2012-06-30_11-28-19/archive/org.apache.axis2/axis2-metadata/1.7.0-SNAPSHOT/axis2-metadata-1.7.0-SNAPSHOT.pom
[JENKINS] Archiving <https://builds.apache.org/job/Axis2-trunk-java-1.6/ws/axis2/modules/metadata/target/axis2-metadata-1.7.0-SNAPSHOT.jar>
to /home/hudson/hudson/jobs/Axis2-trunk-java-1.6/modules/org.apache.axis2$axis2-metadata/builds/2012-06-30_11-28-19/archive/org.apache.axis2/axis2-metadata/1.7.0-SNAPSHOT/axis2-metadata-1.7.0-SNAPSHOT.jar
[JENKINS] Archiving <https://builds.apache.org/job/Axis2-trunk-java-1.6/ws/axis2/modules/tool/axis2-eclipse-service-plugin/pom.xml>
to /home/hudson/hudson/jobs/Axis2-trunk-java-1.6/modules/org.apache.axis2$axis2.eclipse.service.plugin/builds/2012-06-30_11-28-18/archive/org.apache.axis2/axis2.eclipse.service.plugin/1.7.0-SNAPSHOT/axis2.eclipse.service.plugin-1.7.0-SNAPSHOT.pom
[JENKINS] Archiving <https://builds.apache.org/job/Axis2-trunk-java-1.6/ws/axis2/modules/jaxbri/pom.xml>
to /home/hudson/hudson/jobs/Axis2-trunk-java-1.6/modules/org.apache.axis2$axis2-jaxbri/builds/2012-06-30_11-28-19/archive/org.apache.axis2/axis2-jaxbri/1.7.0-SNAPSHOT/axis2-jaxbri-1.7.0-SNAPSHOT.pom
[JENKINS] Archiving <https://builds.apache.org/job/Axis2-trunk-java-1.6/ws/axis2/modules/tool/axis2-java2wsdl-maven-plugin/pom.xml>
to /home/hudson/hudson/jobs/Axis2-trunk-java-1.6/modules/org.apache.axis2$axis2-java2wsdl-maven-plugin/builds/2012-06-30_11-28-19/archive/org.apache.axis2/axis2-java2wsdl-maven-plugin/1.7.0-SNAPSHOT/axis2-java2wsdl-maven-plugin-1.7.0-SNAPSHOT.pom
[JENKINS] Archiving <https://builds.apache.org/job/Axis2-trunk-java-1.6/ws/axis2/modules/clustering/pom.xml>
to /home/hudson/hudson/jobs/Axis2-trunk-java-1.6/modules/org.apache.axis2$axis2-clustering/builds/2012-06-30_11-28-19/archive/org.apache.axis2/axis2-clustering/1.7.0-SNAPSHOT/axis2-clustering-1.7.0-SNAPSHOT.pom
[JENKINS] Archiving <https://builds.apache.org/job/Axis2-trunk-java-1.6/ws/axis2/modules/clustering/target/axis2-clustering-1.7.0-SNAPSHOT.jar>
to /home/hudson/hudson/jobs/Axis2-trunk-java-1.6/modules/org.apache.axis2$axis2-clustering/builds/2012-06-30_11-28-19/archive/org.apache.axis2/axis2-clustering/1.7.0-SNAPSHOT/axis2-clustering-1.7.0-SNAPSHOT.jar
[JENKINS] Archiving <https://builds.apache.org/job/Axis2-trunk-java-1.6/ws/axis2/modules/adb-codegen/pom.xml>
to /home/hudson/hudson/jobs/Axis2-trunk-java-1.6/modules/org.apache.axis2$axis2-adb-codegen/builds/2012-06-30_11-28-17/archive/org.apache.axis2/axis2-adb-codegen/1.7.0-SNAPSHOT/axis2-adb-codegen-1.7.0-SNAPSHOT.pom
[JENKINS] Archiving <https://builds.apache.org/job/Axis2-trunk-java-1.6/ws/axis2/modules/adb-codegen/target/axis2-adb-codegen-1.7.0-SNAPSHOT.jar>
to /home/hudson/hudson/jobs/Axis2-trunk-java-1.6/modules/org.apache.axis2$axis2-adb-codegen/builds/2012-06-30_11-28-17/archive/org.apache.axis2/axis2-adb-codegen/1.7.0-SNAPSHOT/axis2-adb-codegen-1.7.0-SNAPSHOT.jar
[JENKINS] Archiving <https://builds.apache.org/job/Axis2-trunk-java-1.6/ws/axis2/modules/spring/pom.xml>
to /home/hudson/hudson/jobs/Axis2-trunk-java-1.6/modules/org.apache.axis2$axis2-spring/builds/2012-06-30_11-28-18/archive/org.apache.axis2/axis2-spring/1.7.0-SNAPSHOT/axis2-spring-1.7.0-SNAPSHOT.pom
[JENKINS] Archiving <https://builds.apache.org/job/Axis2-trunk-java-1.6/ws/axis2/modules/spring/target/axis2-spring-1.7.0-SNAPSHOT.jar>
to /home/hudson/hudson/jobs/Axis2-trunk-java-1.6/modules/org.apache.axis2$axis2-spring/builds/2012-06-30_11-28-18/archive/org.apache.axis2/axis2-spring/1.7.0-SNAPSHOT/axis2-spring-1.7.0-SNAPSHOT.jar
[JENKINS] Archiving <https://builds.apache.org/job/Axis2-trunk-java-1.6/ws/axis2/modules/mex/pom.xml>
to /home/hudson/hudson/jobs/Axis2-trunk-java-1.6/modules/org.apache.axis2$mex/builds/2012-06-30_11-28-18/archive/org.apache.axis2/mex/1.7.0-SNAPSHOT/mex-1.7.0-SNAPSHOT.pom
[JENKINS] Archiving <https://builds.apache.org/job/Axis2-trunk-java-1.6/ws/axis2/modules/parent/pom.xml>
to /home/hudson/hudson/jobs/Axis2-trunk-java-1.6/modules/org.apache.axis2$axis2-parent/builds/2012-06-30_11-28-18/archive/org.apache.axis2/axis2-parent/1.7.0-SNAPSHOT/axis2-parent-1.7.0-SNAPSHOT.pom
[JENKINS] Archiving <https://builds.apache.org/job/Axis2-trunk-java-1.6/ws/axis2/modules/soapmonitor/servlet/pom.xml>
to /home/hudson/hudson/jobs/Axis2-trunk-java-1.6/modules/org.apache.axis2$axis2-soapmonitor-servlet/builds/2012-06-30_11-28-18/archive/org.apache.axis2/axis2-soapmonitor-servlet/1.7.0-SNAPSHOT/axis2-soapmonitor-servlet-1.7.0-SNAPSHOT.pom
[JENKINS] Archiving <https://builds.apache.org/job/Axis2-trunk-java-1.6/ws/axis2/modules/tool/axis2-ant-plugin/pom.xml>
to /home/hudson/hudson/jobs/Axis2-trunk-java-1.6/modules/org.apache.axis2$axis2-ant-plugin/builds/2012-06-30_11-28-18/archive/org.apache.axis2/axis2-ant-plugin/1.7.0-SNAPSHOT/axis2-ant-plugin-1.7.0-SNAPSHOT.pom
[JENKINS] Archiving <https://builds.apache.org/job/Axis2-trunk-java-1.6/ws/axis2/modules/jaxws-mar/pom.xml>
to /home/hudson/hudson/jobs/Axis2-trunk-java-1.6/modules/org.apache.axis2$axis2-jaxws-mar/builds/2012-06-30_11-28-19/archive/org.apache.axis2/axis2-jaxws-mar/1.7.0-SNAPSHOT/axis2-jaxws-mar-1.7.0-SNAPSHOT.pom
[JENKINS] Archiving <https://builds.apache.org/job/Axis2-trunk-java-1.6/ws/axis2/modules/ping/pom.xml>
to /home/hudson/hudson/jobs/Axis2-trunk-java-1.6/modules/org.apache.axis2$ping/builds/2012-06-30_11-28-18/archive/org.apache.axis2/ping/1.7.0-SNAPSHOT/ping-1.7.0-SNAPSHOT.pom
[JENKINS] Archiving <https://builds.apache.org/job/Axis2-trunk-java-1.6/ws/axis2/modules/tool/axis2-aar-maven-plugin/pom.xml>
to /home/hudson/hudson/jobs/Axis2-trunk-java-1.6/modules/org.apache.axis2$axis2-aar-maven-plugin/builds/2012-06-30_11-28-18/archive/org.apache.axis2/axis2-aar-maven-plugin/1.7.0-SNAPSHOT/axis2-aar-maven-plugin-1.7.0-SNAPSHOT.pom
[JENKINS] Archiving <https://builds.apache.org/job/Axis2-trunk-java-1.6/ws/axis2/modules/saaj/pom.xml>
to /home/hudson/hudson/jobs/Axis2-trunk-java-1.6/modules/org.apache.axis2$axis2-saaj/builds/2012-06-30_11-28-19/archive/org.apache.axis2/axis2-saaj/1.7.0-SNAPSHOT/axis2-saaj-1.7.0-SNAPSHOT.pom
[JENKINS] Archiving <https://builds.apache.org/job/Axis2-trunk-java-1.6/ws/axis2/modules/saaj/target/axis2-saaj-1.7.0-SNAPSHOT.jar>
to /home/hudson/hudson/jobs/Axis2-trunk-java-1.6/modules/org.apache.axis2$axis2-saaj/builds/2012-06-30_11-28-19/archive/org.apache.axis2/axis2-saaj/1.7.0-SNAPSHOT/axis2-saaj-1.7.0-SNAPSHOT.jar
[JENKINS] Archiving <https://builds.apache.org/job/Axis2-trunk-java-1.6/ws/axis2/modules/jaxws-integration/pom.xml>
to /home/hudson/hudson/jobs/Axis2-trunk-java-1.6/modules/org.apache.axis2$axis2-jaxws-integration/builds/2012-06-30_11-28-19/archive/org.apache.axis2/axis2-jaxws-integration/1.7.0-SNAPSHOT/axis2-jaxws-integration-1.7.0-SNAPSHOT.pom
[JENKINS] Archiving <https://builds.apache.org/job/Axis2-trunk-java-1.6/ws/axis2/modules/jaxws-integration/target/axis2-jaxws-integration-1.7.0-SNAPSHOT.jar>
to /home/hudson/hudson/jobs/Axis2-trunk-java-1.6/modules/org.apache.axis2$axis2-jaxws-integration/builds/2012-06-30_11-28-19/archive/org.apache.axis2/axis2-jaxws-integration/1.7.0-SNAPSHOT/axis2-jaxws-integration-1.7.0-SNAPSHOT.jar
[JENKINS] Archiving <https://builds.apache.org/job/Axis2-trunk-java-1.6/ws/axis2/modules/java2wsdl/pom.xml>
to /home/hudson/hudson/jobs/Axis2-trunk-java-1.6/modules/org.apache.axis2$axis2-java2wsdl/builds/2012-06-30_11-28-18/archive/org.apache.axis2/axis2-java2wsdl/1.7.0-SNAPSHOT/axis2-java2wsdl-1.7.0-SNAPSHOT.pom
[JENKINS] Archiving <https://builds.apache.org/job/Axis2-trunk-java-1.6/ws/axis2/modules/java2wsdl/target/axis2-java2wsdl-1.7.0-SNAPSHOT.jar>
to /home/hudson/hudson/jobs/Axis2-trunk-java-1.6/modules/org.apache.axis2$axis2-java2wsdl/builds/2012-06-30_11-28-18/archive/org.apache.axis2/axis2-java2wsdl/1.7.0-SNAPSHOT/axis2-java2wsdl-1.7.0-SNAPSHOT.jar
[JENKINS] Archiving <https://builds.apache.org/job/Axis2-trunk-java-1.6/ws/axis2/modules/mtompolicy/pom.xml>
to /home/hudson/hudson/jobs/Axis2-trunk-java-1.6/modules/org.apache.axis2$axis2-mtompolicy/builds/2012-06-30_11-28-18/archive/org.apache.axis2/axis2-mtompolicy/1.7.0-SNAPSHOT/axis2-mtompolicy-1.7.0-SNAPSHOT.pom
[JENKINS] Archiving <https://builds.apache.org/job/Axis2-trunk-java-1.6/ws/axis2/modules/mtompolicy/target/axis2-mtompolicy-1.7.0-SNAPSHOT.jar>
to /home/hudson/hudson/jobs/Axis2-trunk-java-1.6/modules/org.apache.axis2$axis2-mtompolicy/builds/2012-06-30_11-28-18/archive/org.apache.axis2/axis2-mtompolicy/1.7.0-SNAPSHOT/axis2-mtompolicy-1.7.0-SNAPSHOT.jar
[JENKINS] Archiving <https://builds.apache.org/job/Axis2-trunk-java-1.6/ws/axis2/modules/webapp/pom.xml>
to /home/hudson/hudson/jobs/Axis2-trunk-java-1.6/modules/org.apache.axis2$axis2-webapp/builds/2012-06-30_11-28-19/archive/org.apache.axis2/axis2-webapp/1.7.0-SNAPSHOT/axis2-webapp-1.7.0-SNAPSHOT.pom
[JENKINS] Archiving <https://builds.apache.org/job/Axis2-trunk-java-1.6/ws/axis2/modules/adb/pom.xml>
to /home/hudson/hudson/jobs/Axis2-trunk-java-1.6/modules/org.apache.axis2$axis2-adb/builds/2012-06-30_11-28-17/archive/org.apache.axis2/axis2-adb/1.7.0-SNAPSHOT/axis2-adb-1.7.0-SNAPSHOT.pom
[JENKINS] Archiving <https://builds.apache.org/job/Axis2-trunk-java-1.6/ws/axis2/modules/adb/target/axis2-adb-1.7.0-SNAPSHOT.jar>
to /home/hudson/hudson/jobs/Axis2-trunk-java-1.6/modules/org.apache.axis2$axis2-adb/builds/2012-06-30_11-28-17/archive/org.apache.axis2/axis2-adb/1.7.0-SNAPSHOT/axis2-adb-1.7.0-SNAPSHOT.jar
[JENKINS] Archiving <https://builds.apache.org/job/Axis2-trunk-java-1.6/ws/axis2/modules/kernel/pom.xml>
to /home/hudson/hudson/jobs/Axis2-trunk-java-1.6/modules/org.apache.axis2$axis2-kernel/builds/2012-06-30_11-28-18/archive/org.apache.axis2/axis2-kernel/1.7.0-SNAPSHOT/axis2-kernel-1.7.0-SNAPSHOT.pom
[JENKINS] Archiving <https://builds.apache.org/job/Axis2-trunk-java-1.6/ws/axis2/modules/kernel/target/axis2-kernel-1.7.0-SNAPSHOT.jar>
to /home/hudson/hudson/jobs/Axis2-trunk-java-1.6/modules/org.apache.axis2$axis2-kernel/builds/2012-06-30_11-28-18/archive/org.apache.axis2/axis2-kernel/1.7.0-SNAPSHOT/axis2-kernel-1.7.0-SNAPSHOT.jar
[JENKINS] Archiving <https://builds.apache.org/job/Axis2-trunk-java-1.6/ws/axis2/modules/kernel/target/test-zip.zip>
to /home/hudson/hudson/jobs/Axis2-trunk-java-1.6/modules/org.apache.axis2$axis2-kernel/builds/2012-06-30_11-28-18/archive/org.apache.axis2/axis2-kernel/1.7.0-SNAPSHOT/axis2-kernel-1.7.0-SNAPSHOT.zip
[JENKINS] Archiving <https://builds.apache.org/job/Axis2-trunk-java-1.6/ws/axis2/modules/tool/axis2-idea-plugin/pom.xml>
to /home/hudson/hudson/jobs/Axis2-trunk-java-1.6/modules/org.apache.axis2$axis2-idea-plugin/builds/2012-06-30_11-28-18/archive/org.apache.axis2/axis2-idea-plugin/1.7.0-SNAPSHOT/axis2-idea-plugin-1.7.0-SNAPSHOT.pom
[JENKINS] Archiving <https://builds.apache.org/job/Axis2-trunk-java-1.6/ws/axis2/modules/jaxws/pom.xml>
to /home/hudson/hudson/jobs/Axis2-trunk-java-1.6/modules/org.apache.axis2$axis2-jaxws/builds/2012-06-30_11-28-19/archive/org.apache.axis2/axis2-jaxws/1.7.0-SNAPSHOT/axis2-jaxws-1.7.0-SNAPSHOT.pom
[JENKINS] Archiving <https://builds.apache.org/job/Axis2-trunk-java-1.6/ws/axis2/modules/jaxws/target/axis2-jaxws-1.7.0-SNAPSHOT.jar>
to /home/hudson/hudson/jobs/Axis2-trunk-java-1.6/modules/org.apache.axis2$axis2-jaxws/builds/2012-06-30_11-28-19/archive/org.apache.axis2/axis2-jaxws/1.7.0-SNAPSHOT/axis2-jaxws-1.7.0-SNAPSHOT.jar
[JENKINS] Archiving <https://builds.apache.org/job/Axis2-trunk-java-1.6/ws/axis2/modules/tool/axis2-repo-maven-plugin/pom.xml>
to /home/hudson/hudson/jobs/Axis2-trunk-java-1.6/modules/org.apache.axis2$axis2-repo-maven-plugin/builds/2012-06-30_11-28-19/archive/org.apache.axis2/axis2-repo-maven-plugin/1.7.0-SNAPSHOT/axis2-repo-maven-plugin-1.7.0-SNAPSHOT.pom
[JENKINS] Archiving <https://builds.apache.org/job/Axis2-trunk-java-1.6/ws/axis2/modules/tool/axis2-repo-maven-plugin/target/axis2-repo-maven-plugin-1.7.0-SNAPSHOT.jar>
to /home/hudson/hudson/jobs/Axis2-trunk-java-1.6/modules/org.apache.axis2$axis2-repo-maven-plugin/builds/2012-06-30_11-28-19/archive/org.apache.axis2/axis2-repo-maven-plugin/1.7.0-SNAPSHOT/axis2-repo-maven-plugin-1.7.0-SNAPSHOT.jar
[JENKINS] Archiving <https://builds.apache.org/job/Axis2-trunk-java-1.6/ws/axis2/modules/tool/axis2-eclipse-codegen-plugin/pom.xml>
to /home/hudson/hudson/jobs/Axis2-trunk-java-1.6/modules/org.apache.axis2$axis2.eclipse.codegen.plugin/builds/2012-06-30_11-28-18/archive/org.apache.axis2/axis2.eclipse.codegen.plugin/1.7.0-SNAPSHOT/axis2.eclipse.codegen.plugin-1.7.0-SNAPSHOT.pom
[JENKINS] Archiving <https://builds.apache.org/job/Axis2-trunk-java-1.6/ws/axis2/modules/json/pom.xml>
to /home/hudson/hudson/jobs/Axis2-trunk-java-1.6/modules/org.apache.axis2$axis2-json/builds/2012-06-30_11-28-18/archive/org.apache.axis2/axis2-json/1.7.0-SNAPSHOT/axis2-json-1.7.0-SNAPSHOT.pom
[JENKINS] Archiving <https://builds.apache.org/job/Axis2-trunk-java-1.6/ws/axis2/modules/corba/pom.xml>
to /home/hudson/hudson/jobs/Axis2-trunk-java-1.6/modules/org.apache.axis2$axis2-corba/builds/2012-06-30_11-28-19/archive/org.apache.axis2/axis2-corba/1.7.0-SNAPSHOT/axis2-corba-1.7.0-SNAPSHOT.pom
[JENKINS] Archiving <https://builds.apache.org/job/Axis2-trunk-java-1.6/ws/axis2/modules/jibx/pom.xml>
to /home/hudson/hudson/jobs/Axis2-trunk-java-1.6/modules/org.apache.axis2$axis2-jibx/builds/2012-06-30_11-28-18/archive/org.apache.axis2/axis2-jibx/1.7.0-SNAPSHOT/axis2-jibx-1.7.0-SNAPSHOT.pom
[JENKINS] Archiving <https://builds.apache.org/job/Axis2-trunk-java-1.6/ws/axis2/modules/tool/axis2-wsdl2code-maven-plugin/pom.xml>
to /home/hudson/hudson/jobs/Axis2-trunk-java-1.6/modules/org.apache.axis2$axis2-wsdl2code-maven-plugin/builds/2012-06-30_11-28-19/archive/org.apache.axis2/axis2-wsdl2code-maven-plugin/1.7.0-SNAPSHOT/axis2-wsdl2code-maven-plugin-1.7.0-SNAPSHOT.pom
[JENKINS] Archiving <https://builds.apache.org/job/Axis2-trunk-java-1.6/ws/axis2/modules/tool/axis2-wsdl2code-maven-plugin/target/axis2-wsdl2code-maven-plugin-1.7.0-SNAPSHOT.jar>
to /home/hudson/hudson/jobs/Axis2-trunk-java-1.6/modules/org.apache.axis2$axis2-wsdl2code-maven-plugin/builds/2012-06-30_11-28-19/archive/org.apache.axis2/axis2-wsdl2code-maven-plugin/1.7.0-SNAPSHOT/axis2-wsdl2code-maven-plugin-1.7.0-SNAPSHOT.jar
[JENKINS] Archiving <https://builds.apache.org/job/Axis2-trunk-java-1.6/ws/axis2/modules/tool/archetype/quickstart-webapp/pom.xml>
to /home/hudson/hudson/jobs/Axis2-trunk-java-1.6/modules/org.apache.axis2.archetype$quickstart-webapp/builds/2012-06-30_11-28-19/archive/org.apache.axis2.archetype/quickstart-webapp/1.7.0-SNAPSHOT/quickstart-webapp-1.7.0-SNAPSHOT.pom
[JENKINS] Archiving <https://builds.apache.org/job/Axis2-trunk-java-1.6/ws/axis2/pom.xml>
to /home/hudson/hudson/jobs/Axis2-trunk-java-1.6/modules/org.apache.axis2$axis2/builds/2012-06-30_11-28-17/archive/org.apache.axis2/axis2/1.7.0-SNAPSHOT/axis2-1.7.0-SNAPSHOT.pom
[JENKINS] Archiving <https://builds.apache.org/job/Axis2-trunk-java-1.6/ws/axis2/modules/fastinfoset/pom.xml>
to /home/hudson/hudson/jobs/Axis2-trunk-java-1.6/modules/org.apache.axis2$axis2-fastinfoset/builds/2012-06-30_11-28-17/archive/org.apache.axis2/axis2-fastinfoset/1.7.0-SNAPSHOT/axis2-fastinfoset-1.7.0-SNAPSHOT.pom
[JENKINS] Archiving <https://builds.apache.org/job/Axis2-trunk-java-1.6/ws/axis2/modules/fastinfoset/target/axis2-fastinfoset-1.7.0-SNAPSHOT.jar>
to /home/hudson/hudson/jobs/Axis2-trunk-java-1.6/modules/org.apache.axis2$axis2-fastinfoset/builds/2012-06-30_11-28-17/archive/org.apache.axis2/axis2-fastinfoset/1.7.0-SNAPSHOT/axis2-fastinfoset-1.7.0-SNAPSHOT.jar
[JENKINS] Archiving <https://builds.apache.org/job/Axis2-trunk-java-1.6/ws/axis2/modules/tool/axis2-mar-maven-plugin/pom.xml>
to /home/hudson/hudson/jobs/Axis2-trunk-java-1.6/modules/org.apache.axis2$axis2-mar-maven-plugin/builds/2012-06-30_11-28-19/archive/org.apache.axis2/axis2-mar-maven-plugin/1.7.0-SNAPSHOT/axis2-mar-maven-plugin-1.7.0-SNAPSHOT.pom
[JENKINS] Archiving <https://builds.apache.org/job/Axis2-trunk-java-1.6/ws/axis2/modules/osgi/pom.xml>
to /home/hudson/hudson/jobs/Axis2-trunk-java-1.6/modules/org.apache.axis2$org.apache.axis2.osgi/builds/2012-06-30_11-28-19/archive/org.apache.axis2/org.apache.axis2.osgi/1.7.0-SNAPSHOT/org.apache.axis2.osgi-1.7.0-SNAPSHOT.pom
[JENKINS] Archiving <https://builds.apache.org/job/Axis2-trunk-java-1.6/ws/axis2/modules/osgi/target/org.apache.axis2.osgi-1.7.0-SNAPSHOT.jar>
to /home/hudson/hudson/jobs/Axis2-trunk-java-1.6/modules/org.apache.axis2$org.apache.axis2.osgi/builds/2012-06-30_11-28-19/archive/org.apache.axis2/org.apache.axis2.osgi/1.7.0-SNAPSHOT/org.apache.axis2.osgi-1.7.0-SNAPSHOT.jar
[JENKINS] Archiving <https://builds.apache.org/job/Axis2-trunk-java-1.6/ws/axis2/modules/samples/version/pom.xml>
to /home/hudson/hudson/jobs/Axis2-trunk-java-1.6/modules/org.apache.axis2$version/builds/2012-06-30_11-28-18/archive/org.apache.axis2/version/1.7.0-SNAPSHOT/version-1.7.0-SNAPSHOT.pom
[JENKINS] Archiving <https://builds.apache.org/job/Axis2-trunk-java-1.6/ws/axis2/modules/addressing/pom.xml>
to /home/hudson/hudson/jobs/Axis2-trunk-java-1.6/modules/org.apache.axis2$addressing/builds/2012-06-30_11-28-17/archive/org.apache.axis2/addressing/1.7.0-SNAPSHOT/addressing-1.7.0-SNAPSHOT.pom
[JENKINS] Archiving <https://builds.apache.org/job/Axis2-trunk-java-1.6/ws/axis2/modules/addressing/target/addressing-1.7.0-SNAPSHOT.mar>
to /home/hudson/hudson/jobs/Axis2-trunk-java-1.6/modules/org.apache.axis2$addressing/builds/2012-06-30_11-28-17/archive/org.apache.axis2/addressing/1.7.0-SNAPSHOT/addressing-1.7.0-SNAPSHOT.mar
[JENKINS] Archiving <https://builds.apache.org/job/Axis2-trunk-java-1.6/ws/axis2/modules/addressing/target/addressing-1.7.0-SNAPSHOT-classpath-module.jar>
to /home/hudson/hudson/jobs/Axis2-trunk-java-1.6/modules/org.apache.axis2$addressing/builds/2012-06-30_11-28-17/archive/org.apache.axis2/addressing/1.7.0-SNAPSHOT/addressing-1.7.0-SNAPSHOT-classpath-module.jar
[JENKINS] Archiving <https://builds.apache.org/job/Axis2-trunk-java-1.6/ws/axis2/modules/testutils/pom.xml>
to /home/hudson/hudson/jobs/Axis2-trunk-java-1.6/modules/org.apache.axis2$axis2-testutils/builds/2012-06-30_11-28-18/archive/org.apache.axis2/axis2-testutils/1.7.0-SNAPSHOT/axis2-testutils-1.7.0-SNAPSHOT.pom
[JENKINS] Archiving <https://builds.apache.org/job/Axis2-trunk-java-1.6/ws/axis2/modules/testutils/target/axis2-testutils-1.7.0-SNAPSHOT.jar>
to /home/hudson/hudson/jobs/Axis2-trunk-java-1.6/modules/org.apache.axis2$axis2-testutils/builds/2012-06-30_11-28-18/archive/org.apache.axis2/axis2-testutils/1.7.0-SNAPSHOT/axis2-testutils-1.7.0-SNAPSHOT.jar
[JENKINS] Archiving <https://builds.apache.org/job/Axis2-trunk-java-1.6/ws/axis2/modules/tool/archetype/quickstart/pom.xml>
to /home/hudson/hudson/jobs/Axis2-trunk-java-1.6/modules/org.apache.axis2.archetype$quickstart/builds/2012-06-30_11-28-19/archive/org.apache.axis2.archetype/quickstart/1.7.0-SNAPSHOT/quickstart-1.7.0-SNAPSHOT.pom
[JENKINS] Archiving <https://builds.apache.org/job/Axis2-trunk-java-1.6/ws/axis2/modules/soapmonitor/module/pom.xml>
to /home/hudson/hudson/jobs/Axis2-trunk-java-1.6/modules/org.apache.axis2$soapmonitor/builds/2012-06-30_11-28-18/archive/org.apache.axis2/soapmonitor/1.7.0-SNAPSHOT/soapmonitor-1.7.0-SNAPSHOT.pom
[JENKINS] Archiving <https://builds.apache.org/job/Axis2-trunk-java-1.6/ws/axis2/modules/transport/local/pom.xml>
to /home/hudson/hudson/jobs/Axis2-trunk-java-1.6/modules/org.apache.axis2$axis2-transport-local/builds/2012-06-30_11-28-19/archive/org.apache.axis2/axis2-transport-local/1.7.0-SNAPSHOT/axis2-transport-local-1.7.0-SNAPSHOT.pom
[JENKINS] Archiving <https://builds.apache.org/job/Axis2-trunk-java-1.6/ws/axis2/modules/transport/local/target/axis2-transport-local-1.7.0-SNAPSHOT.jar>
to /home/hudson/hudson/jobs/Axis2-trunk-java-1.6/modules/org.apache.axis2$axis2-transport-local/builds/2012-06-30_11-28-19/archive/org.apache.axis2/axis2-transport-local/1.7.0-SNAPSHOT/axis2-transport-local-1.7.0-SNAPSHOT.jar
[JENKINS] Archiving <https://builds.apache.org/job/Axis2-trunk-java-1.6/ws/axis2/modules/scripting/pom.xml>
to /home/hudson/hudson/jobs/Axis2-trunk-java-1.6/modules/org.apache.axis2$scripting/builds/2012-06-30_11-28-19/archive/org.apache.axis2/scripting/1.7.0-SNAPSHOT/scripting-1.7.0-SNAPSHOT.pom
[JENKINS] Archiving <https://builds.apache.org/job/Axis2-trunk-java-1.6/ws/axis2/modules/scripting/target/scripting-1.7.0-SNAPSHOT.mar>
to /home/hudson/hudson/jobs/Axis2-trunk-java-1.6/modules/org.apache.axis2$scripting/builds/2012-06-30_11-28-19/archive/org.apache.axis2/scripting/1.7.0-SNAPSHOT/scripting-1.7.0-SNAPSHOT.mar
[JENKINS] Archiving <https://builds.apache.org/job/Axis2-trunk-java-1.6/ws/axis2/modules/transport/http/pom.xml>
to /home/hudson/hudson/jobs/Axis2-trunk-java-1.6/modules/org.apache.axis2$axis2-transport-http/builds/2012-06-30_11-28-19/archive/org.apache.axis2/axis2-transport-http/1.7.0-SNAPSHOT/axis2-transport-http-1.7.0-SNAPSHOT.pom
[JENKINS] Archiving <https://builds.apache.org/job/Axis2-trunk-java-1.6/ws/axis2/modules/transport/http/target/axis2-transport-http-1.7.0-SNAPSHOT.jar>
to /home/hudson/hudson/jobs/Axis2-trunk-java-1.6/modules/org.apache.axis2$axis2-transport-http/builds/2012-06-30_11-28-19/archive/org.apache.axis2/axis2-transport-http/1.7.0-SNAPSHOT/axis2-transport-http-1.7.0-SNAPSHOT.jar
Waiting for Jenkins to finish collecting data
mavenExecutionResult exceptions not empty
message : Failed to execute goal org.apache.maven.plugins:maven-compiler-plugin:2.3.1:testCompile
(default-testCompile) on project axis2-integration: Compilation failure
cause : Compilation failure
Stack trace : 
org.apache.maven.lifecycle.LifecycleExecutionException: Failed to execute goal org.apache.maven.plugins:maven-compiler-plugin:2.3.1:testCompile
(default-testCompile) on project axis2-integration: Compilation failure
	at org.apache.maven.lifecycle.internal.MojoExecutor.execute(MojoExecutor.java:213)
	at org.apache.maven.lifecycle.internal.MojoExecutor.execute(MojoExecutor.java:153)
	at org.apache.maven.lifecycle.internal.MojoExecutor.execute(MojoExecutor.java:145)
	at org.apache.maven.lifecycle.internal.LifecycleModuleBuilder.buildProject(LifecycleModuleBuilder.java:84)
	at org.apache.maven.lifecycle.internal.LifecycleModuleBuilder.buildProject(LifecycleModuleBuilder.java:59)
	at org.apache.maven.lifecycle.internal.LifecycleStarter.singleThreadedBuild(LifecycleStarter.java:183)
	at org.apache.maven.lifecycle.internal.LifecycleStarter.execute(LifecycleStarter.java:161)
	at org.apache.maven.DefaultMaven.doExecute(DefaultMaven.java:319)
	at org.apache.maven.DefaultMaven.execute(DefaultMaven.java:156)
	at org.jvnet.hudson.maven3.launcher.Maven3Launcher.main(Maven3Launcher.java:79)
	at sun.reflect.NativeMethodAccessorImpl.invoke0(Native Method)
	at sun.reflect.NativeMethodAccessorImpl.invoke(NativeMethodAccessorImpl.java:39)
	at sun.reflect.DelegatingMethodAccessorImpl.invoke(DelegatingMethodAccessorImpl.java:25)
	at java.lang.reflect.Method.invoke(Method.java:597)
	at org.codehaus.plexus.classworlds.launcher.Launcher.launchStandard(Launcher.java:329)
	at org.codehaus.plexus.classworlds.launcher.Launcher.launch(Launcher.java:239)
	at org.jvnet.hudson.maven3.agent.Maven3Main.launch(Maven3Main.java:158)
	at hudson.maven.Maven3Builder.call(Maven3Builder.java:98)
	at hudson.maven.Maven3Builder.call(Maven3Builder.java:64)
	at hudson.remoting.UserRequest.perform(UserRequest.java:118)
	at hudson.remoting.UserRequest.perform(UserRequest.java:48)
	at hudson.remoting.Request$2.run(Request.java:287)
	at hudson.remoting.InterceptingExecutorService$1.call(InterceptingExecutorService.java:72)
	at java.util.concurrent.FutureTask$Sync.innerRun(FutureTask.java:303)
	at java.util.concurrent.FutureTask.run(FutureTask.java:138)
	at java.util.concurrent.ThreadPoolExecutor$Worker.runTask(ThreadPoolExecutor.java:886)
	at java.util.concurrent.ThreadPoolExecutor$Worker.run(ThreadPoolExecutor.java:908)
	at java.lang.Thread.run(Thread.java:662)
Caused by: org.apache.maven.plugin.CompilationFailureException: Compilation failure
	at org.apache.maven.plugin.AbstractCompilerMojo.execute(AbstractCompilerMojo.java:656)
	at org.apache.maven.plugin.TestCompilerMojo.execute(TestCompilerMojo.java:161)
	at org.apache.maven.plugin.DefaultBuildPluginManager.executeMojo(DefaultBuildPluginManager.java:101)
	at org.apache.maven.lifecycle.internal.MojoExecutor.execute(MojoExecutor.java:209)
	... 27 more
Maven failed with error.
Sending e-mails to: java-dev@axis.apache.org
Sending e-mails to: java-dev@axis.apache.org
channel stopped
[locks-and-latches] Releasing all the locks
[locks-and-latches] All the locks released

---------------------------------------------------------------------
To unsubscribe, e-mail: java-dev-unsubscribe@axis.apache.org
For additional commands, e-mail: java-dev-help@axis.apache.org


Mime
View raw message