axis-java-dev mailing list archives

Site index · List index
Message view « Date » · « Thread »
Top « Date » · « Thread »
From Apache Jenkins Server <jenk...@builds.apache.org>
Subject Build failed in Jenkins: axis2-transports-trunk #792
Date Wed, 02 May 2012 10:11:01 GMT
See <https://builds.apache.org/job/axis2-transports-trunk/792/changes>

Changes:

[sagara] TRANSPORTS-50 - Added a sample to demonstrate use of HTTPS transport. This sample
is based on Jetty Maven plug-in and keytool-maven-plugin.

------------------------------------------
[...truncated 1040 lines...]
    [mkdir] Created dir: <https://builds.apache.org/job/axis2-transports-trunk/ws/transports/modules/sms/target/test-resources/samples/repository/services>
    [mkdir] Created dir: <https://builds.apache.org/job/axis2-transports-trunk/ws/transports/modules/sms/target/test-resources/samples/repository/services/SampleService/org/apache/axis2/transport/sms>
    [mkdir] Created dir: <https://builds.apache.org/job/axis2-transports-trunk/ws/transports/modules/sms/target/test-resources/samples/repository/services/SampleService/META-INF>
     [copy] Copying 1 file to <https://builds.apache.org/job/axis2-transports-trunk/ws/transports/modules/sms/target/test-resources/samples/repository/modules>
     [copy] Copying 1 file to <https://builds.apache.org/job/axis2-transports-trunk/ws/transports/modules/sms/target/test-resources/samples/repository/services/SampleService/org/apache/axis2/transport/sms>
     [copy] Copying 1 file to <https://builds.apache.org/job/axis2-transports-trunk/ws/transports/modules/sms/target/test-resources/samples/conf>
     [copy] Copying 1 file to <https://builds.apache.org/job/axis2-transports-trunk/ws/transports/modules/sms/target/test-resources/samples/repository/services/SampleService/META-INF>
     [copy] Copying 1 file to <https://builds.apache.org/job/axis2-transports-trunk/ws/transports/modules/sms/target/test-resources/samples/repository/services/SampleService/META-INF>
[INFO] Executed tasks
[INFO] [surefire:test {execution: default-test}]
[INFO] Surefire report directory: <https://builds.apache.org/job/axis2-transports-trunk/ws/transports/modules/sms/target/surefire-reports>

-------------------------------------------------------
 T E S T S
-------------------------------------------------------
Running org.apache.axis2.transport.sms.SMSTransportTest
Simple SMSC Listening on port :: 2776
<https://builds.apache.org/job/axis2-transports-trunk/ws/transports/modules/sms/target/test-resources/samples>
 [Axis2] bind and connect to 127.0.0.1 : 2776 on SMPP Transport
 [Axis2] test Server started on port 2776 
Tests run: 1, Failures: 0, Errors: 0, Skipped: 0, Time elapsed: 4.7 sec

Results :

Tests run: 1, Failures: 0, Errors: 0, Skipped: 0

[JENKINS] Recording test results
[INFO] [bundle:bundle {execution: default-bundle}]
[INFO] Preparing source:jar
[WARNING] Removing: jar from forked lifecycle, to prevent recursive invocation.
[INFO] No goals needed for project - skipping
[INFO] [source:jar {execution: default}]
[INFO] Building jar: <https://builds.apache.org/job/axis2-transports-trunk/ws/transports/modules/sms/target/axis2-transport-sms-1.7.0-SNAPSHOT-sources.jar>
[INFO] [install:install {execution: default-install}]
[INFO] Installing <https://builds.apache.org/job/axis2-transports-trunk/ws/transports/modules/sms/target/axis2-transport-sms-1.7.0-SNAPSHOT.jar>
to <https://builds.apache.org/job/axis2-transports-trunk/ws/.repository/org/apache/axis2/axis2-transport-sms/1.7.0-SNAPSHOT/axis2-transport-sms-1.7.0-SNAPSHOT.jar>
[INFO] Installing <https://builds.apache.org/job/axis2-transports-trunk/ws/transports/modules/sms/target/axis2-transport-sms-1.7.0-SNAPSHOT-sources.jar>
to <https://builds.apache.org/job/axis2-transports-trunk/ws/.repository/org/apache/axis2/axis2-transport-sms/1.7.0-SNAPSHOT/axis2-transport-sms-1.7.0-SNAPSHOT-sources.jar>
[INFO] [bundle:install {execution: default-install}]
[INFO] Parsing <https://builds.apache.org/job/axis2-transports-trunk/ws/.repository/repository.xml>
[INFO] Installing org/apache/axis2/axis2-transport-sms/1.7.0-SNAPSHOT/axis2-transport-sms-1.7.0-SNAPSHOT.jar
[INFO] Writing OBR metadata
[INFO] [deploy:deploy {execution: default-deploy}]
[INFO] Retrieving previous build number from apache.snapshots.https
[WARNING] *** CHECKSUM FAILED - Checksum failed on download: local = 'a2b3f3acab1a2eeea7dc3282b6af04c4d483e041';
remote = 'd3994018030d9e7948f4409c4e5ed9f9aacf03a9' - RETRYING
[WARNING] *** CHECKSUM FAILED - Checksum failed on download: local = 'a2b3f3acab1a2eeea7dc3282b6af04c4d483e041';
remote = 'd3994018030d9e7948f4409c4e5ed9f9aacf03a9' - IGNORING
Uploading: https://repository.apache.org/content/repositories/snapshots/org/apache/axis2/axis2-transport-sms/1.7.0-SNAPSHOT/axis2-transport-sms-1.7.0-20120502.100435-337.jar
45K uploaded  (axis2-transport-sms-1.7.0-20120502.100435-337.jar)
[INFO] Uploading project information for axis2-transport-sms 1.7.0-20120502.100435-337
[INFO] Retrieving previous metadata from apache.snapshots.https
[INFO] Uploading repository metadata for: 'artifact org.apache.axis2:axis2-transport-sms'
[INFO] Retrieving previous metadata from apache.snapshots.https
[WARNING] *** CHECKSUM FAILED - Checksum failed on download: local = 'a2b3f3acab1a2eeea7dc3282b6af04c4d483e041';
remote = 'd3994018030d9e7948f4409c4e5ed9f9aacf03a9' - RETRYING
[WARNING] *** CHECKSUM FAILED - Checksum failed on download: local = 'a2b3f3acab1a2eeea7dc3282b6af04c4d483e041';
remote = 'd3994018030d9e7948f4409c4e5ed9f9aacf03a9' - IGNORING
[INFO] Uploading repository metadata for: 'snapshot org.apache.axis2:axis2-transport-sms:1.7.0-SNAPSHOT'
[INFO] Retrieving previous build number from apache.snapshots.https
Uploading: https://repository.apache.org/content/repositories/snapshots/org/apache/axis2/axis2-transport-sms/1.7.0-SNAPSHOT/axis2-transport-sms-1.7.0-20120502.100435-337-sources.jar
40K uploaded  (axis2-transport-sms-1.7.0-20120502.100435-337-sources.jar)
[INFO] [bundle:deploy {execution: default-deploy}]
[INFO] Remote OBR update disabled (enable with -DremoteOBR)
[JENKINS] Archiving <https://builds.apache.org/job/axis2-transports-trunk/ws/transports/modules/sms/pom.xml>
to /home/hudson/hudson/jobs/axis2-transports-trunk/modules/org.apache.axis2$axis2-transport-sms/builds/2012-05-02_10-03-37/archive/org.apache.axis2/axis2-transport-sms/1.7.0-SNAPSHOT/axis2-transport-sms-1.7.0-SNAPSHOT.pom
[JENKINS] Archiving <https://builds.apache.org/job/axis2-transports-trunk/ws/transports/modules/sms/target/axis2-transport-sms-1.7.0-SNAPSHOT.jar>
to /home/hudson/hudson/jobs/axis2-transports-trunk/modules/org.apache.axis2$axis2-transport-sms/builds/2012-05-02_10-03-37/archive/org.apache.axis2/axis2-transport-sms/1.7.0-20120502.100435-337/axis2-transport-sms-1.7.0-20120502.100435-337.jar
[JENKINS] Archiving <https://builds.apache.org/job/axis2-transports-trunk/ws/transports/modules/sms/target/axis2-transport-sms-1.7.0-SNAPSHOT-sources.jar>
to /home/hudson/hudson/jobs/axis2-transports-trunk/modules/org.apache.axis2$axis2-transport-sms/builds/2012-05-02_10-03-37/archive/org.apache.axis2/axis2-transport-sms/1.7.0-20120502.100435-337/axis2-transport-sms-1.7.0-20120502.100435-337-sources.jar
[INFO] ------------------------------------------------------------------------
[INFO] Building Apache Axis2 - Transport - All
[INFO]    task-segment: [clean, deploy]
[INFO] ------------------------------------------------------------------------
[INFO] [clean:clean {execution: default-clean}]
[INFO] Deleting <https://builds.apache.org/job/axis2-transports-trunk/ws/transports/modules/all/target>
[INFO] [remote-resources:process {execution: default}]
[INFO] snapshot org.apache.axis2:axis2-transport-jms:1.7.0-SNAPSHOT: checking for updates
from apache.snapshots
[INFO] snapshot org.apache.axis2:axis2-transport-mail:1.7.0-SNAPSHOT: checking for updates
from apache.snapshots
[INFO] snapshot org.apache.axis2:axis2-transport-tcp:1.7.0-SNAPSHOT: checking for updates
from apache.snapshots
[INFO] snapshot org.apache.axis2:axis2-transport-sms:1.7.0-SNAPSHOT: checking for updates
from apache.snapshots
[INFO] snapshot org.apache.axis2:axis2-transport-xmpp:1.7.0-SNAPSHOT: checking for updates
from apache.snapshots
[INFO] snapshot org.apache.axis2:axis2-transport-udp:1.7.0-SNAPSHOT: checking for updates
from apache.snapshots
[INFO] [resources:resources {execution: default-resources}]
[INFO] Using 'UTF-8' encoding to copy filtered resources.
[INFO] Copying 0 resource
[INFO] Copying 3 resources
[INFO] [compiler:compile {execution: default-compile}]
[INFO] No sources to compile
[INFO] [resources:testResources {execution: default-testResources}]
[INFO] Using 'UTF-8' encoding to copy filtered resources.
[INFO] skip non existing resourceDirectory <https://builds.apache.org/job/axis2-transports-trunk/ws/transports/modules/all/src/test/resources>
[INFO] Copying 3 resources
[INFO] [compiler:testCompile {execution: default-testCompile}]
[INFO] No sources to compile
[INFO] [surefire:test {execution: default-test}]
[INFO] Surefire report directory: <https://builds.apache.org/job/axis2-transports-trunk/ws/transports/modules/all/target/surefire-reports>

-------------------------------------------------------
 T E S T S
-------------------------------------------------------
There are no tests to run.

Results :

Tests run: 0, Failures: 0, Errors: 0, Skipped: 0

[JENKINS] Recording test results
[INFO] [bundle:bundle {execution: default-bundle}]
[INFO] [assembly:single {execution: distribution-package}]
[INFO] Reading assembly descriptor: src/main/assembly/src.xml
[INFO] Building zip: <https://builds.apache.org/job/axis2-transports-trunk/ws/transports/modules/all/target/axis2-transports-1.7.0-SNAPSHOT-src.zip>
[INFO] Preparing source:jar
[WARNING] Removing: jar from forked lifecycle, to prevent recursive invocation.
[INFO] No goals needed for project - skipping
[INFO] [source:jar {execution: default}]
[INFO] Building jar: <https://builds.apache.org/job/axis2-transports-trunk/ws/transports/modules/all/target/axis2-transport-all-1.7.0-SNAPSHOT-sources.jar>
[INFO] NOT adding java-sources to attached artifacts list.
[INFO] [install:install {execution: default-install}]
[INFO] Installing <https://builds.apache.org/job/axis2-transports-trunk/ws/transports/modules/all/target/axis2-transport-all-1.7.0-SNAPSHOT.jar>
to <https://builds.apache.org/job/axis2-transports-trunk/ws/.repository/org/apache/axis2/axis2-transport-all/1.7.0-SNAPSHOT/axis2-transport-all-1.7.0-SNAPSHOT.jar>
[INFO] Installing <https://builds.apache.org/job/axis2-transports-trunk/ws/transports/modules/all/target/axis2-transports-1.7.0-SNAPSHOT-src.zip>
to <https://builds.apache.org/job/axis2-transports-trunk/ws/.repository/org/apache/axis2/axis2-transport-all/1.7.0-SNAPSHOT/axis2-transport-all-1.7.0-SNAPSHOT-src.zip>
[INFO] [bundle:install {execution: default-install}]
[INFO] Parsing <https://builds.apache.org/job/axis2-transports-trunk/ws/.repository/repository.xml>
[INFO] Installing org/apache/axis2/axis2-transport-all/1.7.0-SNAPSHOT/axis2-transport-all-1.7.0-SNAPSHOT.jar
[INFO] Writing OBR metadata
[INFO] [deploy:deploy {execution: default-deploy}]
[INFO] Retrieving previous build number from apache.snapshots.https
[WARNING] *** CHECKSUM FAILED - Checksum failed on download: local = '85d03b2999aed82543d987684342227d4a407163';
remote = 'aabf7c0313a7890cfd24a93fa873d1a4987eeb0a' - RETRYING
[WARNING] *** CHECKSUM FAILED - Checksum failed on download: local = '85d03b2999aed82543d987684342227d4a407163';
remote = 'aabf7c0313a7890cfd24a93fa873d1a4987eeb0a' - IGNORING
Uploading: https://repository.apache.org/content/repositories/snapshots/org/apache/axis2/axis2-transport-all/1.7.0-SNAPSHOT/axis2-transport-all-1.7.0-20120502.100435-337.jar
305K uploaded  (axis2-transport-all-1.7.0-20120502.100435-337.jar)
[INFO] Uploading project information for axis2-transport-all 1.7.0-20120502.100435-337
[INFO] Retrieving previous metadata from apache.snapshots.https
[WARNING] *** CHECKSUM FAILED - Checksum failed on download: local = '85d03b2999aed82543d987684342227d4a407163';
remote = 'aabf7c0313a7890cfd24a93fa873d1a4987eeb0a' - RETRYING
[WARNING] *** CHECKSUM FAILED - Checksum failed on download: local = '85d03b2999aed82543d987684342227d4a407163';
remote = 'aabf7c0313a7890cfd24a93fa873d1a4987eeb0a' - IGNORING
[INFO] Uploading repository metadata for: 'snapshot org.apache.axis2:axis2-transport-all:1.7.0-SNAPSHOT'
[INFO] Retrieving previous metadata from apache.snapshots.https
[INFO] Uploading repository metadata for: 'artifact org.apache.axis2:axis2-transport-all'
[INFO] Retrieving previous build number from apache.snapshots.https
Uploading: https://repository.apache.org/content/repositories/snapshots/org/apache/axis2/axis2-transport-all/1.7.0-SNAPSHOT/axis2-transport-all-1.7.0-20120502.100435-337-src.zip
662K uploaded  (axis2-transport-all-1.7.0-20120502.100435-337-src.zip)
[INFO] [bundle:deploy {execution: default-deploy}]
[INFO] Remote OBR update disabled (enable with -DremoteOBR)
[JENKINS] Archiving <https://builds.apache.org/job/axis2-transports-trunk/ws/transports/modules/all/pom.xml>
to /home/hudson/hudson/jobs/axis2-transports-trunk/modules/org.apache.axis2$axis2-transport-all/builds/2012-05-02_10-03-37/archive/org.apache.axis2/axis2-transport-all/1.7.0-SNAPSHOT/axis2-transport-all-1.7.0-SNAPSHOT.pom
[JENKINS] Archiving <https://builds.apache.org/job/axis2-transports-trunk/ws/transports/modules/all/target/axis2-transport-all-1.7.0-SNAPSHOT.jar>
to /home/hudson/hudson/jobs/axis2-transports-trunk/modules/org.apache.axis2$axis2-transport-all/builds/2012-05-02_10-03-37/archive/org.apache.axis2/axis2-transport-all/1.7.0-20120502.100435-337/axis2-transport-all-1.7.0-20120502.100435-337.jar
[JENKINS] Archiving <https://builds.apache.org/job/axis2-transports-trunk/ws/transports/modules/all/target/axis2-transports-1.7.0-SNAPSHOT-src.zip>
to /home/hudson/hudson/jobs/axis2-transports-trunk/modules/org.apache.axis2$axis2-transport-all/builds/2012-05-02_10-03-37/archive/org.apache.axis2/axis2-transport-all/1.7.0-20120502.100435-337/axis2-transport-all-1.7.0-20120502.100435-337-src.zip
[INFO] ------------------------------------------------------------------------
[INFO] Building Apache Axis2 Transport-HTTPS sample
[INFO]    task-segment: [clean, deploy]
[INFO] ------------------------------------------------------------------------
Downloading: http://repo1.maven.org/maven2/org/apache/maven/plugins/maven-clean-plugin/2.2/maven-clean-plugin-2.2.pom

Downloading: http://repo1.maven.org/maven2/org/apache/maven/plugins/maven-clean-plugin/2.2/maven-clean-plugin-2.2.jar

Downloading: http://repo1.maven.org/maven2/org/apache/maven/plugins/maven-compiler-plugin/2.0.2/maven-compiler-plugin-2.0.2.pom

Downloading: http://repo1.maven.org/maven2/org/apache/maven/plugins/maven-compiler-plugin/2.0.2/maven-compiler-plugin-2.0.2.jar

Downloading: http://repo1.maven.org/maven2/org/apache/maven/shared/file-management/1.2/file-management-1.2.pom

Downloading: http://repo1.maven.org/maven2/org/apache/maven/shared/file-management/1.2/file-management-1.2.jar

[INFO] [clean:clean {execution: default-clean}]
Downloading: http://repo1.maven.org/maven2/org/apache/maven/plugins/maven-site-plugin/2.0-beta-7/maven-site-plugin-2.0-beta-7.pom

Downloading: http://repo1.maven.org/maven2/org/apache/maven/plugins/maven-site-plugin/2.0-beta-7/maven-site-plugin-2.0-beta-7.jar

Downloading: http://repo1.maven.org/maven2/org/apache/maven/plugins/maven-install-plugin/2.2/maven-install-plugin-2.2.pom

Downloading: http://repo1.maven.org/maven2/org/apache/maven/plugins/maven-install-plugin/2.2/maven-install-plugin-2.2.jar

Downloading: http://repo1.maven.org/maven2/org/apache/maven/plugins/maven-deploy-plugin/2.4/maven-deploy-plugin-2.4.pom

Downloading: http://repo1.maven.org/maven2/org/apache/maven/plugins/maven-deploy-plugin/2.4/maven-deploy-plugin-2.4.jar

Downloading: http://repo1.maven.org/maven2/org/apache/maven/maven-model/2.0.2/maven-model-2.0.2.pom

Downloading: http://repo1.maven.org/maven2/org/apache/maven/doxia/doxia-module-xhtml/1.0-alpha-11/doxia-module-xhtml-1.0-alpha-11.pom

Downloading: http://repo1.maven.org/maven2/org/apache/maven/doxia/doxia-modules/1.0-alpha-11/doxia-modules-1.0-alpha-11.pom

Downloading: http://repo1.maven.org/maven2/org/apache/maven/doxia/doxia/1.0-alpha-11/doxia-1.0-alpha-11.pom

Downloading: http://repo1.maven.org/maven2/org/apache/maven/doxia/doxia-core/1.0-alpha-11/doxia-core-1.0-alpha-11.pom

Downloading: http://repo1.maven.org/maven2/org/apache/maven/doxia/doxia-sink-api/1.0-alpha-11/doxia-sink-api-1.0-alpha-11.pom

Downloading: http://repo1.maven.org/maven2/org/apache/maven/doxia/doxia-decoration-model/1.0-alpha-11/doxia-decoration-model-1.0-alpha-11.pom

Downloading: http://repo1.maven.org/maven2/org/apache/maven/doxia/doxia-sitetools/1.0-alpha-11/doxia-sitetools-1.0-alpha-11.pom

Downloading: http://repo1.maven.org/maven2/org/apache/maven/doxia/doxia-site-renderer/1.0-alpha-11/doxia-site-renderer-1.0-alpha-11.pom

Downloading: http://repo1.maven.org/maven2/org/apache/maven/doxia/doxia-module-apt/1.0-alpha-11/doxia-module-apt-1.0-alpha-11.pom

Downloading: http://repo1.maven.org/maven2/org/apache/maven/doxia/doxia-module-fml/1.0-alpha-11/doxia-module-fml-1.0-alpha-11.pom

Downloading: http://repo1.maven.org/maven2/org/apache/maven/doxia/doxia-module-xdoc/1.0-alpha-11/doxia-module-xdoc-1.0-alpha-11.pom

Downloading: http://repo1.maven.org/maven2/org/apache/maven/shared/maven-doxia-tools/1.0.1/maven-doxia-tools-1.0.1.pom

Downloading: http://repo1.maven.org/maven2/org/apache/maven/shared/maven-shared-components/9/maven-shared-components-9.pom

Downloading: http://repo1.maven.org/maven2/org/apache/maven/doxia/doxia-module-xhtml/1.0-alpha-11/doxia-module-xhtml-1.0-alpha-11.jar
Downloading: http://repo1.maven.org/maven2/org/apache/maven/shared/maven-doxia-tools/1.0.1/maven-doxia-tools-1.0.1.jar
Downloading: http://repo1.maven.org/maven2/org/codehaus/plexus/plexus-velocity/1.1.7/plexus-velocity-1.1.7.jar



Downloading: http://repo1.maven.org/maven2/org/apache/maven/doxia/doxia-core/1.0-alpha-11/doxia-core-1.0-alpha-11.jar

Downloading: http://repo1.maven.org/maven2/org/apache/maven/doxia/doxia-decoration-model/1.0-alpha-11/doxia-decoration-model-1.0-alpha-11.jar

Downloading: http://repo1.maven.org/maven2/org/apache/maven/doxia/doxia-site-renderer/1.0-alpha-11/doxia-site-renderer-1.0-alpha-11.jar

Downloading: http://repo1.maven.org/maven2/org/apache/maven/doxia/doxia-module-apt/1.0-alpha-11/doxia-module-apt-1.0-alpha-11.jar

Downloading: http://repo1.maven.org/maven2/org/apache/maven/doxia/doxia-module-fml/1.0-alpha-11/doxia-module-fml-1.0-alpha-11.jar

Downloading: http://repo1.maven.org/maven2/org/apache/maven/doxia/doxia-module-xdoc/1.0-alpha-11/doxia-module-xdoc-1.0-alpha-11.jar

[INFO] [site:attach-descriptor {execution: default-attach-descriptor}]
[INFO] [install:install {execution: default-install}]
[INFO] Installing <https://builds.apache.org/job/axis2-transports-trunk/ws/transports/modules/samples/https-sample/pom.xml>
to <https://builds.apache.org/job/axis2-transports-trunk/ws/.repository/org/apache/axis2/examples/https-sample/1.7.0-SNAPSHOT/https-sample-1.7.0-SNAPSHOT.pom>
[JENKINS] Archiving <https://builds.apache.org/job/axis2-transports-trunk/ws/transports/modules/samples/https-sample/pom.xml>
to /home/hudson/hudson/jobs/axis2-transports-trunk/modules/org.apache.axis2.examples$https-sample/builds/2012-05-02_10-03-37/archive/org.apache.axis2.examples/https-sample/1.7.0-SNAPSHOT/https-sample-1.7.0-SNAPSHOT.pom
[INFO] ------------------------------------------------------------------------
[ERROR] BUILD ERROR
[INFO] ------------------------------------------------------------------------
[INFO] Failed to configure plugin parameters for: org.apache.maven.plugins:maven-deploy-plugin:2.4

check that the following section of the pom.xml is present and correct:

<distributionManagement>
  <!-- use the following if you're not using a snapshot version. -->
  <repository>
    <id>repo</id>
    <name>Repository Name</name>
    <url>scp://host/path/to/repo</url>
  </repository>
  <!-- use the following if you ARE using a snapshot version. -->
  <snapshotRepository>
    <id>repo</id>
    <name>Repository Name</name>
    <url>scp://host/path/to/repo</url>
  </snapshotRepository>
</distributionManagement>

Cause: Class 'org.apache.maven.artifact.repository.ArtifactRepository' cannot be instantiated
[INFO] ------------------------------------------------------------------------
[INFO] For more information, run Maven with the -e switch
[INFO] ------------------------------------------------------------------------
[INFO] Total time: 6 minutes 43 seconds
[INFO] Finished at: Wed May 02 10:10:58 UTC 2012
[INFO] Final Memory: 81M/317M
[INFO] ------------------------------------------------------------------------
channel stopped
[locks-and-latches] Releasing all the locks
[locks-and-latches] All the locks released

---------------------------------------------------------------------
To unsubscribe, e-mail: java-dev-unsubscribe@axis.apache.org
For additional commands, e-mail: java-dev-help@axis.apache.org


Mime
View raw message