axis-java-dev mailing list archives

Site index · List index
Message view « Date » · « Thread »
Top « Date » · « Thread »
From Apache Jenkins Server <jenk...@builds.apache.org>
Subject Build failed in Jenkins: sandesha2-trunk #790
Date Tue, 29 May 2012 16:13:44 GMT
See <https://builds.apache.org/job/sandesha2-trunk/790/>

------------------------------------------
[...truncated 182 lines...]
Uploaded: https://repository.apache.org/content/repositories/snapshots/org/apache/sandesha2/sandesha2-parent/maven-metadata.xml
(470 B at 1.9 KB/sec)
mojoSucceeded org.apache.maven.plugins:maven-deploy-plugin:2.5(default-deploy)
projectSucceeded org.apache.sandesha2:sandesha2-parent:1.7.0-SNAPSHOT
projectStarted org.apache.sandesha2:sandesha2-resource-bundle:1.7.0-SNAPSHOT
[INFO]                                                                         
[INFO] ------------------------------------------------------------------------
[INFO] Building Sandesha2 - Resource bundle 1.7.0-SNAPSHOT
[INFO] ------------------------------------------------------------------------
mojoStarted org.apache.maven.plugins:maven-clean-plugin:2.4.1(default-clean)[INFO] Deleting
<https://builds.apache.org/job/sandesha2-trunk/ws/sandesha2/modules/resource-bundle/target>

[INFO] 
[INFO] --- maven-clean-plugin:2.4.1:clean (default-clean) @ sandesha2-resource-bundle ---
mojoSucceeded org.apache.maven.plugins:maven-clean-plugin:2.4.1(default-clean)
mojoStarted org.apache.maven.plugins:maven-remote-resources-plugin:1.1(default)
[INFO] 
[INFO] --- maven-remote-resources-plugin:1.1:bundle (default) @ sandesha2-resource-bundle
---
mojoSucceeded org.apache.maven.plugins:maven-remote-resources-plugin:1.1(default)
mojoStarted org.apache.maven.plugins:maven-remote-resources-plugin:1.1(default)
[INFO] 
[INFO] --- maven-remote-resources-plugin:1.1:process (default) @ sandesha2-resource-bundle
---
mojoSucceeded org.apache.maven.plugins:maven-remote-resources-plugin:1.1(default)
mojoStarted org.apache.maven.plugins:maven-resources-plugin:2.4(default-resources)
[INFO] 
[INFO] --- maven-resources-plugin:2.4:resources (default-resources) @ sandesha2-resource-bundle
---
[INFO] Using 'UTF-8' encoding to copy filtered resources.
[INFO] Copying 2 resources
[INFO] Copying 3 resources
mojoSucceeded org.apache.maven.plugins:maven-resources-plugin:2.4(default-resources)
mojoStarted org.apache.maven.plugins:maven-compiler-plugin:2.0(default-compile)
[INFO] 
[INFO] --- maven-compiler-plugin:2.0:compile (default-compile) @ sandesha2-resource-bundle
---
[INFO] No sources to compile
mojoSucceeded org.apache.maven.plugins:maven-compiler-plugin:2.0(default-compile)
mojoStarted org.apache.maven.plugins:maven-resources-plugin:2.4(default-testResources)[INFO]
Using 'UTF-8' encoding to copy filtered resources.
[INFO] skip non existing resourceDirectory <https://builds.apache.org/job/sandesha2-trunk/ws/sandesha2/modules/resource-bundle/src/test/resources>
[INFO] Copying 3 resources

[INFO] 
[INFO] --- maven-resources-plugin:2.4:testResources (default-testResources) @ sandesha2-resource-bundle
---
mojoSucceeded org.apache.maven.plugins:maven-resources-plugin:2.4(default-testResources)
mojoStarted org.apache.maven.plugins:maven-compiler-plugin:2.0(default-testCompile)[INFO]
No sources to compile

[INFO] 
[INFO] --- maven-compiler-plugin:2.0:testCompile (default-testCompile) @ sandesha2-resource-bundle
---
mojoSucceeded org.apache.maven.plugins:maven-compiler-plugin:2.0(default-testCompile)
mojoStarted org.apache.maven.plugins:maven-surefire-plugin:2.11(default-test)
[INFO] 
[INFO] --- maven-surefire-plugin:2.11:test (default-test) @ sandesha2-resource-bundle ---
[INFO] Surefire report directory: <https://builds.apache.org/job/sandesha2-trunk/ws/sandesha2/modules/resource-bundle/target/surefire-reports>

-------------------------------------------------------
 T E S T S
-------------------------------------------------------

Results :

Tests run: 0, Failures: 0, Errors: 0, Skipped: 0

mojoSucceeded org.apache.maven.plugins:maven-surefire-plugin:2.11(default-test)
[JENKINS] Recording test results
mojoStarted org.apache.maven.plugins:maven-jar-plugin:2.3(default-jar)
[INFO] 
[INFO] --- maven-jar-plugin:2.3:jar (default-jar) @ sandesha2-resource-bundle ---
[INFO] Building jar: <https://builds.apache.org/job/sandesha2-trunk/ws/sandesha2/modules/resource-bundle/target/sandesha2-resource-bundle-1.7.0-SNAPSHOT.jar>
mojoSucceeded org.apache.maven.plugins:maven-jar-plugin:2.3(default-jar)
mojoStarted org.apache.maven.plugins:maven-assembly-plugin:2.2-beta-5(source-release-assembly)[INFO]
Assemblies have been skipped per configuration of the skipAssembly parameter.

[INFO] 
[INFO] --- maven-assembly-plugin:2.2-beta-5:single (source-release-assembly) @ sandesha2-resource-bundle
---
mojoSucceeded org.apache.maven.plugins:maven-assembly-plugin:2.2-beta-5(source-release-assembly)
May 29, 2012 4:13:27 PM hudson.maven.ExecutedMojo <init>
WARNING: Failed to getClass for org.apache.maven.plugin.source.SourceJarMojo
mojoStarted org.apache.maven.plugins:maven-source-plugin:2.1.1(attach-sources)[INFO] Building
jar: <https://builds.apache.org/job/sandesha2-trunk/ws/sandesha2/modules/resource-bundle/target/sandesha2-resource-bundle-1.7.0-SNAPSHOT-sources.jar>

[INFO] 
[INFO] --- maven-source-plugin:2.1.1:jar (attach-sources) @ sandesha2-resource-bundle ---
mojoSucceeded org.apache.maven.plugins:maven-source-plugin:2.1.1(attach-sources)
mojoStarted org.apache.maven.plugins:maven-javadoc-plugin:2.5(attach-javadocs)
[INFO] 
[INFO] --- maven-javadoc-plugin:2.5:jar (attach-javadocs) @ sandesha2-resource-bundle ---
mojoSucceeded org.apache.maven.plugins:maven-javadoc-plugin:2.5(attach-javadocs)
mojoStarted org.apache.rat:apache-rat-plugin:0.7(default)[INFO] Exclude: src/main/resources/META-INF/*.vm

[INFO] 
[INFO] --- apache-rat-plugin:0.7:check (default) @ sandesha2-resource-bundle ---
mojoSucceeded org.apache.rat:apache-rat-plugin:0.7(default)
mojoStarted org.apache.maven.plugins:maven-gpg-plugin:1.1(default)
[INFO] 
[INFO] --- maven-gpg-plugin:1.1:sign (default) @ sandesha2-resource-bundle ---
mojoSucceeded org.apache.maven.plugins:maven-gpg-plugin:1.1(default)
mojoStarted org.apache.maven.plugins:maven-install-plugin:2.3(default-install)[INFO] Installing
<https://builds.apache.org/job/sandesha2-trunk/ws/sandesha2/modules/resource-bundle/target/sandesha2-resource-bundle-1.7.0-SNAPSHOT.jar>
to <https://builds.apache.org/job/sandesha2-trunk/ws/.repository/org/apache/sandesha2/sandesha2-resource-bundle/1.7.0-SNAPSHOT/sandesha2-resource-bundle-1.7.0-SNAPSHOT.jar>
[INFO] Installing <https://builds.apache.org/job/sandesha2-trunk/ws/sandesha2/modules/resource-bundle/pom.xml>
to <https://builds.apache.org/job/sandesha2-trunk/ws/.repository/org/apache/sandesha2/sandesha2-resource-bundle/1.7.0-SNAPSHOT/sandesha2-resource-bundle-1.7.0-SNAPSHOT.pom>

[INFO] 
[INFO] --- maven-install-plugin:2.3:install (default-install) @ sandesha2-resource-bundle
---
[INFO] Installing <https://builds.apache.org/job/sandesha2-trunk/ws/sandesha2/modules/resource-bundle/target/sandesha2-resource-bundle-1.7.0-SNAPSHOT-sources.jar>
to <https://builds.apache.org/job/sandesha2-trunk/ws/.repository/org/apache/sandesha2/sandesha2-resource-bundle/1.7.0-SNAPSHOT/sandesha2-resource-bundle-1.7.0-SNAPSHOT-sources.jar>
mojoSucceeded org.apache.maven.plugins:maven-install-plugin:2.3(default-install)
mojoStarted org.apache.maven.plugins:maven-deploy-plugin:2.5(default-deploy)Downloading: https://repository.apache.org/content/repositories/snapshots/org/apache/sandesha2/sandesha2-resource-bundle/1.7.0-SNAPSHOT/maven-metadata.xml

[INFO] 
[INFO] --- maven-deploy-plugin:2.5:deploy (default-deploy) @ sandesha2-resource-bundle ---
Downloaded: https://repository.apache.org/content/repositories/snapshots/org/apache/sandesha2/sandesha2-resource-bundle/1.7.0-SNAPSHOT/maven-metadata.xml
(1017 B at 2.4 KB/sec)
Uploading: https://repository.apache.org/content/repositories/snapshots/org/apache/sandesha2/sandesha2-resource-bundle/1.7.0-SNAPSHOT/sandesha2-resource-bundle-1.7.0-20120529.161328-148.jar
Uploaded: https://repository.apache.org/content/repositories/snapshots/org/apache/sandesha2/sandesha2-resource-bundle/1.7.0-SNAPSHOT/sandesha2-resource-bundle-1.7.0-20120529.161328-148.jar
(13 KB at 29.3 KB/sec)
Uploading: https://repository.apache.org/content/repositories/snapshots/org/apache/sandesha2/sandesha2-resource-bundle/1.7.0-SNAPSHOT/sandesha2-resource-bundle-1.7.0-20120529.161328-148.pom
Uploaded: https://repository.apache.org/content/repositories/snapshots/org/apache/sandesha2/sandesha2-resource-bundle/1.7.0-SNAPSHOT/sandesha2-resource-bundle-1.7.0-20120529.161328-148.pom
(4 KB at 14.3 KB/sec)
Downloading: https://repository.apache.org/content/repositories/snapshots/org/apache/sandesha2/sandesha2-resource-bundle/maven-metadata.xml
Downloaded: https://repository.apache.org/content/repositories/snapshots/org/apache/sandesha2/sandesha2-resource-bundle/maven-metadata.xml
(479 B at 2.5 KB/sec)
Uploading: https://repository.apache.org/content/repositories/snapshots/org/apache/sandesha2/sandesha2-resource-bundle/1.7.0-SNAPSHOT/maven-metadata.xml
Uploaded: https://repository.apache.org/content/repositories/snapshots/org/apache/sandesha2/sandesha2-resource-bundle/1.7.0-SNAPSHOT/maven-metadata.xml
(1017 B at 4.6 KB/sec)
Uploading: https://repository.apache.org/content/repositories/snapshots/org/apache/sandesha2/sandesha2-resource-bundle/maven-metadata.xml
Uploaded: https://repository.apache.org/content/repositories/snapshots/org/apache/sandesha2/sandesha2-resource-bundle/maven-metadata.xml
(479 B at 2.7 KB/sec)
Uploading: https://repository.apache.org/content/repositories/snapshots/org/apache/sandesha2/sandesha2-resource-bundle/1.7.0-SNAPSHOT/sandesha2-resource-bundle-1.7.0-20120529.161328-148-sources.jar
Uploaded: https://repository.apache.org/content/repositories/snapshots/org/apache/sandesha2/sandesha2-resource-bundle/1.7.0-SNAPSHOT/sandesha2-resource-bundle-1.7.0-20120529.161328-148-sources.jar
(11 KB at 48.1 KB/sec)
Uploading: https://repository.apache.org/content/repositories/snapshots/org/apache/sandesha2/sandesha2-resource-bundle/1.7.0-SNAPSHOT/maven-metadata.xml
Uploaded: https://repository.apache.org/content/repositories/snapshots/org/apache/sandesha2/sandesha2-resource-bundle/1.7.0-SNAPSHOT/maven-metadata.xml
(1017 B at 7.6 KB/sec)
mojoSucceeded org.apache.maven.plugins:maven-deploy-plugin:2.5(default-deploy)
projectSucceeded org.apache.sandesha2:sandesha2-resource-bundle:1.7.0-SNAPSHOT
projectStarted org.apache.sandesha2:sandesha2-core:1.7.0-SNAPSHOT
[INFO]                                                                         
[INFO] ------------------------------------------------------------------------
[INFO] Building Sandesha2 - Core 1.7.0-SNAPSHOT
[INFO] ------------------------------------------------------------------------
Downloading: http://repository.apache.org/snapshots/org/apache/axis2/axis2-codegen/1.7.0-SNAPSHOT/maven-metadata.xml
Downloaded: http://repository.apache.org/snapshots/org/apache/axis2/axis2-codegen/1.7.0-SNAPSHOT/maven-metadata.xml
(367 B at 3.0 KB/sec)
Downloading: http://repository.apache.org/snapshots/org/apache/axis2/axis2-codegen/1.7.0-SNAPSHOT/axis2-codegen-1.7.0-20120529.140840-802.pom
Downloaded: http://repository.apache.org/snapshots/org/apache/axis2/axis2-codegen/1.7.0-SNAPSHOT/axis2-codegen-1.7.0-20120529.140840-802.pom
(11 KB at 138.9 KB/sec)
Downloading: http://repository.apache.org/snapshots/org/apache/axis2/axis2-adb/1.7.0-SNAPSHOT/maven-metadata.xml
Downloaded: http://repository.apache.org/snapshots/org/apache/axis2/axis2-adb/1.7.0-SNAPSHOT/maven-metadata.xml
(363 B at 3.3 KB/sec)
Downloading: http://repository.apache.org/snapshots/org/apache/axis2/axis2-adb/1.7.0-SNAPSHOT/axis2-adb-1.7.0-20120529.140840-810.pom
Downloaded: http://repository.apache.org/snapshots/org/apache/axis2/axis2-adb/1.7.0-SNAPSHOT/axis2-adb-1.7.0-20120529.140840-810.pom
(5 KB at 30.6 KB/sec)
Downloading: http://repository.apache.org/snapshots/org/apache/ws/commons/axiom/axiom-dom/1.2.14-SNAPSHOT/maven-metadata.xml
Downloaded: http://repository.apache.org/snapshots/org/apache/ws/commons/axiom/axiom-dom/1.2.14-SNAPSHOT/maven-metadata.xml
(2 KB at 16.4 KB/sec)
Downloading: http://repository.apache.org/snapshots/org/apache/ws/commons/axiom/axiom-dom/1.2.14-SNAPSHOT/axiom-dom-1.2.14-20120528.213739-154.pom
Downloaded: http://repository.apache.org/snapshots/org/apache/ws/commons/axiom/axiom-dom/1.2.14-SNAPSHOT/axiom-dom-1.2.14-20120528.213739-154.pom
(9 KB at 104.9 KB/sec)
Downloading: http://repository.apache.org/snapshots/org/apache/axis2/axis2-codegen/1.7.0-SNAPSHOT/axis2-codegen-1.7.0-20120529.140840-802.jar
Downloading: http://repository.apache.org/snapshots/org/apache/axis2/axis2-adb/1.7.0-SNAPSHOT/axis2-adb-1.7.0-20120529.140840-810.jar
Downloading: http://repository.apache.org/snapshots/org/apache/ws/commons/axiom/axiom-dom/1.2.14-SNAPSHOT/axiom-dom-1.2.14-20120528.213739-154.jar
Downloaded: http://repository.apache.org/snapshots/org/apache/ws/commons/axiom/axiom-dom/1.2.14-SNAPSHOT/axiom-dom-1.2.14-20120528.213739-154.jar
(201 KB at 695.2 KB/sec)
Downloaded: http://repository.apache.org/snapshots/org/apache/axis2/axis2-codegen/1.7.0-SNAPSHOT/axis2-codegen-1.7.0-20120529.140840-802.jar
(254 KB at 743.9 KB/sec)
Downloaded: http://repository.apache.org/snapshots/org/apache/axis2/axis2-adb/1.7.0-SNAPSHOT/axis2-adb-1.7.0-20120529.140840-810.jar
(662 KB at 1341.2 KB/sec)
mojoStarted org.apache.maven.plugins:maven-clean-plugin:2.4.1(default-clean)[INFO] Deleting
<https://builds.apache.org/job/sandesha2-trunk/ws/sandesha2/modules/core/target>

[INFO] 
[INFO] --- maven-clean-plugin:2.4.1:clean (default-clean) @ sandesha2-core ---
mojoSucceeded org.apache.maven.plugins:maven-clean-plugin:2.4.1(default-clean)
mojoStarted org.apache.maven.plugins:maven-remote-resources-plugin:1.1(default)Downloading:
http://repository.apache.org/snapshots/org/apache/axis2/axis2-adb/1.7.0-SNAPSHOT/maven-metadata.xml

[INFO] 
[INFO] --- maven-remote-resources-plugin:1.1:process (default) @ sandesha2-core ---
Downloaded: http://repository.apache.org/snapshots/org/apache/axis2/axis2-adb/1.7.0-SNAPSHOT/maven-metadata.xml
(363 B at 4.3 KB/sec)
Downloading: http://repository.apache.org/snapshots/org/apache/ws/commons/axiom/axiom-dom/1.2.14-SNAPSHOT/maven-metadata.xml
Downloaded: http://repository.apache.org/snapshots/org/apache/ws/commons/axiom/axiom-dom/1.2.14-SNAPSHOT/maven-metadata.xml
(2 KB at 17.2 KB/sec)
Downloading: http://repository.apache.org/snapshots/org/apache/axis2/axis2-codegen/1.7.0-SNAPSHOT/maven-metadata.xml
Downloaded: http://repository.apache.org/snapshots/org/apache/axis2/axis2-codegen/1.7.0-SNAPSHOT/maven-metadata.xml
(367 B at 4.0 KB/sec)
mojoSucceeded org.apache.maven.plugins:maven-remote-resources-plugin:1.1(default)
mojoStarted org.apache.maven.plugins:maven-resources-plugin:2.4(default-resources)[INFO] Using
'UTF-8' encoding to copy filtered resources.
[INFO] Copying 1 resource
[INFO] Copying 2 resources

[INFO] 
[INFO] --- maven-resources-plugin:2.4:resources (default-resources) @ sandesha2-core ---
mojoSucceeded org.apache.maven.plugins:maven-resources-plugin:2.4(default-resources)
mojoStarted org.apache.maven.plugins:maven-compiler-plugin:2.0(default-compile)
[INFO] 
[INFO] --- maven-compiler-plugin:2.0:compile (default-compile) @ sandesha2-core ---
Compiling 134 source files to <https://builds.apache.org/job/sandesha2-trunk/ws/sandesha2/modules/core/target/classes>
mojoFailed org.apache.maven.plugins:maven-compiler-plugin:2.0(default-compile)
projectFailed org.apache.sandesha2:sandesha2-core:1.7.0-SNAPSHOT
sessionEnded
[INFO] ------------------------------------------------------------------------
[INFO] Reactor Summary:
[INFO] 
[INFO] Apache Sandesha ................................... SUCCESS [35.426s]
[INFO] Sandesha2 - Resource bundle ....................... SUCCESS [7.045s]
[INFO] Sandesha2 - Core .................................. FAILURE [4.381s]
[INFO] Sandesha2 - Mar ................................... SKIPPED
[INFO] Sandesha2 - Client ................................ SKIPPED
[INFO] Sandesha2 - Policy ................................ SKIPPED
[INFO] Sandesha2 - Rampart Integration ................... SKIPPED
[INFO] Sandesha2 - Samples ............................... SKIPPED
[INFO] Sandesha2 - Test Suite ............................ SKIPPED
[INFO] Sandesha2 - Interop ............................... SKIPPED
[INFO] Sandesha2 - Persistent Storage .................... SKIPPED
[INFO] Sandesha2 - Distribution .......................... SKIPPED
[INFO] ------------------------------------------------------------------------
[INFO] BUILD FAILURE
[INFO] ------------------------------------------------------------------------
[INFO] Total time: 51.134s
[INFO] Finished at: Tue May 29 16:13:35 UTC 2012
[INFO] Final Memory: 22M/147M
[INFO] ------------------------------------------------------------------------
Projects to build: [MavenProject: org.apache.sandesha2:sandesha2-parent:1.7.0-SNAPSHOT @ <https://builds.apache.org/job/sandesha2-trunk/ws/sandesha2/pom.xml,>
MavenProject: org.apache.sandesha2:sandesha2-resource-bundle:1.7.0-SNAPSHOT @ <https://builds.apache.org/job/sandesha2-trunk/ws/sandesha2/modules/resource-bundle/pom.xml,>
MavenProject: org.apache.sandesha2:sandesha2-core:1.7.0-SNAPSHOT @ <https://builds.apache.org/job/sandesha2-trunk/ws/sandesha2/modules/core/pom.xml,>
MavenProject: org.apache.sandesha2:sandesha2:1.7.0-SNAPSHOT @ <https://builds.apache.org/job/sandesha2-trunk/ws/sandesha2/modules/mar/pom.xml,>
MavenProject: org.apache.sandesha2:sandesha2-client-constants:1.7.0-SNAPSHOT @ <https://builds.apache.org/job/sandesha2-trunk/ws/sandesha2/modules/client/pom.xml,>
MavenProject: org.apache.sandesha2:sandesha2-policy:1.7.0-SNAPSHOT @ <https://builds.apache.org/job/sandesha2-trunk/ws/sandesha2/modules/policy/pom.xml,>
MavenProject: org.apache.sandesha2:sandesha2-rampart-integration:1.7.0-SNAPSHOT @ <https://builds.apache.org/job/sandesha2-trunk/ws/sandesha2/modules/rampart-integration/pom.xml,>
MavenProject: org.apache.sandesha2:sandesha2-samples:1.7.0-SNAPSHOT @ <https://builds.apache.org/job/sandesha2-trunk/ws/sandesha2/modules/samples/pom.xml,>
MavenProject: org.apache.sandesha2:sandesha2-tests:1.7.0-SNAPSHOT @ <https://builds.apache.org/job/sandesha2-trunk/ws/sandesha2/modules/tests/pom.xml,>
MavenProject: org.apache.sandesha2:sandesha2-interop:1.7.0-SNAPSHOT @ <https://builds.apache.org/job/sandesha2-trunk/ws/sandesha2/modules/interop/pom.xml,>
MavenProject: org.apache.sandesha2:sandesha2-persistence:1.7.0-SNAPSHOT @ <https://builds.apache.org/job/sandesha2-trunk/ws/sandesha2/modules/persistence/pom.xml,>
MavenProject: org.apache.sandesha2:distribution:1.7.0-SNAPSHOT @ <https://builds.apache.org/job/sandesha2-trunk/ws/sandesha2/modules/distribution/pom.xml]>
[JENKINS] Archiving <https://builds.apache.org/job/sandesha2-trunk/ws/sandesha2/modules/core/pom.xml>
to /home/hudson/hudson/jobs/sandesha2-trunk/modules/org.apache.sandesha2$sandesha2-core/builds/2012-05-29_16-12-30/archive/org.apache.sandesha2/sandesha2-core/1.7.0-SNAPSHOT/sandesha2-core-1.7.0-SNAPSHOT.pom
[JENKINS] Archiving <https://builds.apache.org/job/sandesha2-trunk/ws/sandesha2/modules/samples/pom.xml>
to /home/hudson/hudson/jobs/sandesha2-trunk/modules/org.apache.sandesha2$sandesha2-samples/builds/2012-05-29_16-12-30/archive/org.apache.sandesha2/sandesha2-samples/1.7.0-SNAPSHOT/sandesha2-samples-1.7.0-SNAPSHOT.pom
[JENKINS] Archiving <https://builds.apache.org/job/sandesha2-trunk/ws/sandesha2/modules/client/pom.xml>
to /home/hudson/hudson/jobs/sandesha2-trunk/modules/org.apache.sandesha2$sandesha2-client-constants/builds/2012-05-29_16-12-30/archive/org.apache.sandesha2/sandesha2-client-constants/1.7.0-SNAPSHOT/sandesha2-client-constants-1.7.0-SNAPSHOT.pom
[JENKINS] Archiving <https://builds.apache.org/job/sandesha2-trunk/ws/sandesha2/modules/policy/pom.xml>
to /home/hudson/hudson/jobs/sandesha2-trunk/modules/org.apache.sandesha2$sandesha2-policy/builds/2012-05-29_16-12-30/archive/org.apache.sandesha2/sandesha2-policy/1.7.0-SNAPSHOT/sandesha2-policy-1.7.0-SNAPSHOT.pom
[JENKINS] Archiving <https://builds.apache.org/job/sandesha2-trunk/ws/sandesha2/modules/rampart-integration/pom.xml>
to /home/hudson/hudson/jobs/sandesha2-trunk/modules/org.apache.sandesha2$sandesha2-rampart-integration/builds/2012-05-29_16-12-30/archive/org.apache.sandesha2/sandesha2-rampart-integration/1.7.0-SNAPSHOT/sandesha2-rampart-integration-1.7.0-SNAPSHOT.pom
[JENKINS] Archiving <https://builds.apache.org/job/sandesha2-trunk/ws/sandesha2/modules/persistence/pom.xml>
to /home/hudson/hudson/jobs/sandesha2-trunk/modules/org.apache.sandesha2$sandesha2-persistence/builds/2012-05-29_16-12-30/archive/org.apache.sandesha2/sandesha2-persistence/1.7.0-SNAPSHOT/sandesha2-persistence-1.7.0-SNAPSHOT.pom
[JENKINS] Archiving <https://builds.apache.org/job/sandesha2-trunk/ws/sandesha2/modules/distribution/pom.xml>
to /home/hudson/hudson/jobs/sandesha2-trunk/modules/org.apache.sandesha2$distribution/builds/2012-05-29_16-12-30/archive/org.apache.sandesha2/distribution/1.7.0-SNAPSHOT/distribution-1.7.0-SNAPSHOT.pom
[JENKINS] Archiving <https://builds.apache.org/job/sandesha2-trunk/ws/sandesha2/modules/tests/pom.xml>
to /home/hudson/hudson/jobs/sandesha2-trunk/modules/org.apache.sandesha2$sandesha2-tests/builds/2012-05-29_16-12-30/archive/org.apache.sandesha2/sandesha2-tests/1.7.0-SNAPSHOT/sandesha2-tests-1.7.0-SNAPSHOT.pom
[JENKINS] Archiving <https://builds.apache.org/job/sandesha2-trunk/ws/sandesha2/pom.xml>
to /home/hudson/hudson/jobs/sandesha2-trunk/modules/org.apache.sandesha2$sandesha2-parent/builds/2012-05-29_16-12-30/archive/org.apache.sandesha2/sandesha2-parent/1.7.0-SNAPSHOT/sandesha2-parent-1.7.0-SNAPSHOT.pom
[JENKINS] Archiving <https://builds.apache.org/job/sandesha2-trunk/ws/sandesha2/modules/interop/pom.xml>
to /home/hudson/hudson/jobs/sandesha2-trunk/modules/org.apache.sandesha2$sandesha2-interop/builds/2012-05-29_16-12-30/archive/org.apache.sandesha2/sandesha2-interop/1.7.0-SNAPSHOT/sandesha2-interop-1.7.0-SNAPSHOT.pom
[JENKINS] Archiving <https://builds.apache.org/job/sandesha2-trunk/ws/sandesha2/modules/mar/pom.xml>
to /home/hudson/hudson/jobs/sandesha2-trunk/modules/org.apache.sandesha2$sandesha2/builds/2012-05-29_16-12-30/archive/org.apache.sandesha2/sandesha2/1.7.0-SNAPSHOT/sandesha2-1.7.0-SNAPSHOT.pom
[JENKINS] Archiving <https://builds.apache.org/job/sandesha2-trunk/ws/sandesha2/modules/resource-bundle/pom.xml>
to /home/hudson/hudson/jobs/sandesha2-trunk/modules/org.apache.sandesha2$sandesha2-resource-bundle/builds/2012-05-29_16-12-30/archive/org.apache.sandesha2/sandesha2-resource-bundle/1.7.0-SNAPSHOT/sandesha2-resource-bundle-1.7.0-SNAPSHOT.pom
[JENKINS] Archiving <https://builds.apache.org/job/sandesha2-trunk/ws/sandesha2/modules/resource-bundle/target/sandesha2-resource-bundle-1.7.0-SNAPSHOT.jar>
to /home/hudson/hudson/jobs/sandesha2-trunk/modules/org.apache.sandesha2$sandesha2-resource-bundle/builds/2012-05-29_16-12-30/archive/org.apache.sandesha2/sandesha2-resource-bundle/1.7.0-20120529.161328-148/sandesha2-resource-bundle-1.7.0-20120529.161328-148.jar
[JENKINS] Archiving <https://builds.apache.org/job/sandesha2-trunk/ws/sandesha2/modules/resource-bundle/target/sandesha2-resource-bundle-1.7.0-SNAPSHOT-sources.jar>
to /home/hudson/hudson/jobs/sandesha2-trunk/modules/org.apache.sandesha2$sandesha2-resource-bundle/builds/2012-05-29_16-12-30/archive/org.apache.sandesha2/sandesha2-resource-bundle/1.7.0-20120529.161328-148/sandesha2-resource-bundle-1.7.0-20120529.161328-148-sources.jar
Waiting for Jenkins to finish collecting data
mavenExecutionResult exceptions not empty
message : Failed to execute goal org.apache.maven.plugins:maven-compiler-plugin:2.0:compile
(default-compile) on project sandesha2-core: Compilation failure
cause : Compilation failure
Stack trace : 
org.apache.maven.lifecycle.LifecycleExecutionException: Failed to execute goal org.apache.maven.plugins:maven-compiler-plugin:2.0:compile
(default-compile) on project sandesha2-core: Compilation failure
	at org.apache.maven.lifecycle.internal.MojoExecutor.execute(MojoExecutor.java:213)
	at org.apache.maven.lifecycle.internal.MojoExecutor.execute(MojoExecutor.java:153)
	at org.apache.maven.lifecycle.internal.MojoExecutor.execute(MojoExecutor.java:145)
	at org.apache.maven.lifecycle.internal.LifecycleModuleBuilder.buildProject(LifecycleModuleBuilder.java:84)
	at org.apache.maven.lifecycle.internal.LifecycleModuleBuilder.buildProject(LifecycleModuleBuilder.java:59)
	at org.apache.maven.lifecycle.internal.LifecycleStarter.singleThreadedBuild(LifecycleStarter.java:183)
	at org.apache.maven.lifecycle.internal.LifecycleStarter.execute(LifecycleStarter.java:161)
	at org.apache.maven.DefaultMaven.doExecute(DefaultMaven.java:319)
	at org.apache.maven.DefaultMaven.execute(DefaultMaven.java:156)
	at org.jvnet.hudson.maven3.launcher.Maven3Launcher.main(Maven3Launcher.java:79)
	at sun.reflect.NativeMethodAccessorImpl.invoke0(Native Method)
	at sun.reflect.NativeMethodAccessorImpl.invoke(NativeMethodAccessorImpl.java:39)
	at sun.reflect.DelegatingMethodAccessorImpl.invoke(DelegatingMethodAccessorImpl.java:25)
	at java.lang.reflect.Method.invoke(Method.java:592)
	at org.codehaus.plexus.classworlds.launcher.Launcher.launchStandard(Launcher.java:329)
	at org.codehaus.plexus.classworlds.launcher.Launcher.launch(Launcher.java:239)
	at org.jvnet.hudson.maven3.agent.Maven3Main.launch(Maven3Main.java:158)
	at hudson.maven.Maven3Builder.call(Maven3Builder.java:98)
	at hudson.maven.Maven3Builder.call(Maven3Builder.java:64)
	at hudson.remoting.UserRequest.perform(UserRequest.java:118)
	at hudson.remoting.UserRequest.perform(UserRequest.java:48)
	at hudson.remoting.Request$2.run(Request.java:287)
	at hudson.remoting.InterceptingExecutorService$1.call(InterceptingExecutorService.java:72)
	at java.util.concurrent.FutureTask$Sync.innerRun(FutureTask.java:269)
	at java.util.concurrent.FutureTask.run(FutureTask.java:123)
	at java.util.concurrent.ThreadPoolExecutor$Worker.runTask(ThreadPoolExecutor.java:651)
	at java.util.concurrent.ThreadPoolExecutor$Worker.run(ThreadPoolExecutor.java:676)
	at java.lang.Thread.run(Thread.java:595)
Caused by: org.apache.maven.plugin.CompilationFailureException: Compilation failure
	at org.apache.maven.plugin.AbstractCompilerMojo.execute(AbstractCompilerMojo.java:429)
	at org.apache.maven.plugin.CompilerMojo.execute(CompilerMojo.java:110)
	at org.apache.maven.plugin.DefaultBuildPluginManager.executeMojo(DefaultBuildPluginManager.java:101)
	at org.apache.maven.lifecycle.internal.MojoExecutor.execute(MojoExecutor.java:209)
	... 27 more
Sending e-mails to: java-dev@axis.apache.org
channel stopped

---------------------------------------------------------------------
To unsubscribe, e-mail: java-dev-unsubscribe@axis.apache.org
For additional commands, e-mail: java-dev-help@axis.apache.org


Mime
View raw message