axis-java-dev mailing list archives

Site index · List index
Message view « Date » · « Thread »
Top « Date » · « Thread »
From Apache Jenkins Server <jenk...@builds.apache.org>
Subject Build failed in Jenkins: sandesha2-trunk #734
Date Sun, 06 May 2012 03:10:40 GMT
See <https://builds.apache.org/job/sandesha2-trunk/734/>

------------------------------------------
[...truncated 4778 lines...]
     [java] -- specific language governing permissions and limitations
     [java] -- under the License.

     [java] drop table wsrm_sender;
     [java] ERROR 42Y55: 'DROP TABLE' cannot be performed on 'WSRM_SENDER' because it does
not exist.
     [java] ij> create table wsrm_sender (
     [java] 	message_id varchar(255) not null,
     [java] 	message_context_ref_key varchar(255),
     [java] 	internal_sequence_id varchar(255),
     [java] 	sequence_id varchar(255),
     [java] 	to_address varchar(255),
     [java] 	inbound_sequence_id varchar(255),
     [java] 	send smallint,
     [java] 	sent_count integer,
     [java] 	message_number bigint,
     [java] 	resend smallint,
     [java] 	time_to_send bigint,
     [java] 	message_type integer,
     [java] 	last_message smallint,
     [java] 	inbound_message_number bigint,
     [java] 	transport_available smallint,
     [java] 	flags integer,
     [java] 	primary key (message_id)
     [java] );
     [java] 0 rows inserted/updated/deleted
     [java] ij> drop table wsrm_rmd;
     [java] ERROR 42Y55: 'DROP TABLE' cannot be performed on 'WSRM_RMD' because it does not
exist.
     [java] ij> create table wsrm_rmd (
     [java] 	sequence_id varchar(255) not null,
     [java] 	to_epr_addr varchar(255),
     [java] 	to_epr blob,
     [java] 	reply_to_epr_addr varchar(255),
     [java] 	reply_to_epr blob,
     [java] 	acks_to_epr_addr varchar(255),
     [java] 	acks_to_epr blob,
     [java] 	rm_version varchar(255),
     [java] 	security_token_data varchar(255),
     [java] 	last_activated_time bigint,
     [java] 	closed smallint,
     [java] 	terminated_flag smallint,
     [java] 	polling_mode smallint,
     [java] 	service_name varchar(255),
     [java] 	flags integer,
     [java] 	reference_message_key varchar(255),
     [java] 	highest_in_message_id varchar(255),
     [java] 	last_in_message_id varchar(255),
     [java] 	server_completed_messages clob,
     [java] 	outof_order_ranges clob,
     [java] 	to_address varchar(255),
     [java] 	outbound_internal_sequence varchar(255),
     [java] 	next_msgno_to_process bigint,
     [java] 	highest_in_message_number bigint,
     [java] 	rmd_flags integer,
     [java] 	primary key (sequence_id)
     [java] );
     [java] 0 rows inserted/updated/deleted
     [java] ij> drop table wsrm_rms;
     [java] ERROR 42Y55: 'DROP TABLE' cannot be performed on 'WSRM_RMS' because it does not
exist.
     [java] ij> create table wsrm_rms (
     [java] 	create_seq_msg_id varchar(255) not null,
     [java] 	sequence_id varchar(255),
     [java] 	to_epr_addr varchar(255),
     [java] 	to_epr blob,
     [java] 	reply_to_epr_addr varchar(255),
     [java] 	reply_to_epr blob,
     [java] 	acks_to_epr_addr varchar(255),
     [java] 	acks_to_epr blob,
     [java] 	rm_version varchar(255),
     [java] 	security_token_data varchar(255),
     [java] 	last_activated_time BIGINT,
     [java] 	closed smallint,
     [java] 	terminated_flag smallint,
     [java] 	polling_mode smallint,
     [java] 	service_name varchar(255),
     [java] 	flags integer,
     [java] 	id bigint,
     [java] 	internal_sequence_id varchar(255),
     [java] 	create_sequence_msg_store_key varchar(255),
     [java] 	reference_msg_store_key varchar(255),
     [java] 	last_send_error blob,
     [java] 	highest_out_relates_to varchar(255),
     [java] 	client_completed_messages clob,
     [java] 	transport_to varchar(255),
     [java] 	offered_endpoint varchar(255),
     [java] 	offered_endpoint_epr_addr varchar(255),
     [java] 	offered_endpoint_epr blob,
     [java] 	offered_sequence varchar(255),
     [java] 	anonymous_uuid varchar(255),
     [java] 	last_send_error_timestamp bigint,
     [java] 	last_out_message bigint,
     [java] 	highest_out_message_number bigint,
     [java] 	next_message_number bigint,
     [java] 	terminate_added smallint,
     [java] 	timed_out smallint,
     [java] 	sequence_closed_client smallint,
     [java] 	expected_replies bigint,
     [java] 	soap_version integer,
     [java] 	termination_pauser_for_cs smallint,
     [java] 	avoid_auto_termination smallint,
     [java] 	rms_flags integer,
     [java] 	reallocated smallint,
     [java] 	internalSeqIDOfSeqUsedForReallocation varchar(255),
     [java] 	primary key (create_seq_msg_id)
     [java] );
     [java] 0 rows inserted/updated/deleted
     [java] ij> drop table wsrm_invoker;
     [java] ERROR 42Y55: 'DROP TABLE' cannot be performed on 'WSRM_INVOKER' because it does
not exist.
     [java] ij> create table wsrm_invoker (
     [java] 	message_context_ref_key varchar(255) not null,
     [java] 	sequence_id varchar(255),
     [java] 	context blob,
     [java] 	msg_no bigint,
     [java] 	flags integer,
     [java] 	PRIMARY KEY (message_context_ref_key)
     [java] );
     [java] 0 rows inserted/updated/deleted
     [java] ij> drop table wsrm_msgctx;
     [java] ERROR 42Y55: 'DROP TABLE' cannot be performed on 'WSRM_MSGCTX' because it does
not exist.
     [java] ij> create table wsrm_msgctx (
     [java] 	ctx_key varchar(255) not null,
     [java] 	ctx blob,
     [java] 	PRIMARY KEY (ctx_key)
     [java] );
     [java] 0 rows inserted/updated/deleted
     [java] ij> 

persistence:create:
    [mkdir] Created dir: <https://builds.apache.org/job/sandesha2-trunk/ws/sandesha2/modules/persistence/target/repos/persistence-client>
    [mkdir] Created dir: <https://builds.apache.org/job/sandesha2-trunk/ws/sandesha2/modules/persistence/target/repos/persistence-client/modules>
    [mkdir] Created dir: <https://builds.apache.org/job/sandesha2-trunk/ws/sandesha2/modules/persistence/target/repos/persistence-server>
    [mkdir] Created dir: <https://builds.apache.org/job/sandesha2-trunk/ws/sandesha2/modules/persistence/target/repos/persistence-server/modules>
    [mkdir] Created dir: <https://builds.apache.org/job/sandesha2-trunk/ws/sandesha2/modules/persistence/target/repos/persistence-server/services>
    [mkdir] Created dir: <https://builds.apache.org/job/sandesha2-trunk/ws/sandesha2/modules/persistence/target/temp/persistence>
     [copy] Copying 1 file to <https://builds.apache.org/job/sandesha2-trunk/ws/sandesha2/modules/persistence/target/repos/persistence-server/modules>
     [copy] Copying 1 file to <https://builds.apache.org/job/sandesha2-trunk/ws/sandesha2/modules/persistence/target/repos/persistence-server/modules>
     [copy] Copying 1 file to <https://builds.apache.org/job/sandesha2-trunk/ws/sandesha2/modules/persistence/target/repos/persistence-server>
     [copy] Copying 1 file to <https://builds.apache.org/job/sandesha2-trunk/ws/sandesha2/modules/persistence/target/repos/persistence-server/services>
     [copy] Copying 1 file to <https://builds.apache.org/job/sandesha2-trunk/ws/sandesha2/modules/persistence/target/repos/persistence-client/modules>
     [copy] Copying 1 file to <https://builds.apache.org/job/sandesha2-trunk/ws/sandesha2/modules/persistence/target/repos/persistence-client>
    [unjar] Expanding: <https://builds.apache.org/job/sandesha2-trunk/ws/sandesha2/modules/mar/target/sandesha2-1.7.0-SNAPSHOT.mar>
into <https://builds.apache.org/job/sandesha2-trunk/ws/sandesha2/modules/persistence/target/temp/persistence>
      [jar] Building jar: <https://builds.apache.org/job/sandesha2-trunk/ws/sandesha2/modules/persistence/target/repos/persistence-client/modules/sandesha2-UnitTest.mar>

prepare:
[INFO] Executed tasks
mojoSucceeded org.apache.maven.plugins:maven-antrun-plugin:1.1(create_test_repos)
mojoStarted org.apache.maven.plugins:maven-compiler-plugin:2.0(default-testCompile)Compiling
2 source files to <https://builds.apache.org/job/sandesha2-trunk/ws/sandesha2/modules/persistence/target/test-classes>

[INFO] 
[INFO] --- maven-compiler-plugin:2.0:testCompile (default-testCompile) @ sandesha2-persistence
---
mojoFailed org.apache.maven.plugins:maven-compiler-plugin:2.0(default-testCompile)
projectFailed org.apache.sandesha2:sandesha2-persistence:1.7.0-SNAPSHOT
sessionEnded
[INFO] ------------------------------------------------------------------------
[INFO] Reactor Summary:
[INFO] 
[INFO] Apache Sandesha ................................... SUCCESS [23.930s]
[INFO] Sandesha2 - Resource bundle ....................... SUCCESS [4.100s]
[INFO] Sandesha2 - Core .................................. SUCCESS [13.152s]
[INFO] Sandesha2 - Mar ................................... SUCCESS [4.350s]
[INFO] Sandesha2 - Client ................................ SUCCESS [5.142s]
[INFO] Sandesha2 - Policy ................................ SUCCESS [2.253s]
[INFO] Sandesha2 - Rampart Integration ................... SUCCESS [10.717s]
[INFO] Sandesha2 - Samples ............................... SUCCESS [5.661s]
[INFO] Sandesha2 - Test Suite ............................ SUCCESS [12:01.871s]
[INFO] Sandesha2 - Interop ............................... SUCCESS [8.428s]
[INFO] Sandesha2 - Persistent Storage .................... FAILURE [3.509s]
[INFO] Sandesha2 - Distribution .......................... SKIPPED
[INFO] ------------------------------------------------------------------------
[INFO] BUILD FAILURE
[INFO] ------------------------------------------------------------------------
[INFO] Total time: 13:26.890s
[INFO] Finished at: Sun May 06 03:10:33 GMT 2012
[INFO] Final Memory: 44M/385M
[INFO] ------------------------------------------------------------------------
Projects to build: [MavenProject: org.apache.sandesha2:sandesha2-parent:1.7.0-SNAPSHOT @ <https://builds.apache.org/job/sandesha2-trunk/ws/sandesha2/pom.xml,>
MavenProject: org.apache.sandesha2:sandesha2-resource-bundle:1.7.0-SNAPSHOT @ <https://builds.apache.org/job/sandesha2-trunk/ws/sandesha2/modules/resource-bundle/pom.xml,>
MavenProject: org.apache.sandesha2:sandesha2-core:1.7.0-SNAPSHOT @ <https://builds.apache.org/job/sandesha2-trunk/ws/sandesha2/modules/core/pom.xml,>
MavenProject: org.apache.sandesha2:sandesha2:1.7.0-SNAPSHOT @ <https://builds.apache.org/job/sandesha2-trunk/ws/sandesha2/modules/mar/pom.xml,>
MavenProject: org.apache.sandesha2:sandesha2-client-constants:1.7.0-SNAPSHOT @ <https://builds.apache.org/job/sandesha2-trunk/ws/sandesha2/modules/client/dependency-reduced-pom.xml,>
MavenProject: org.apache.sandesha2:sandesha2-policy:1.7.0-SNAPSHOT @ <https://builds.apache.org/job/sandesha2-trunk/ws/sandesha2/modules/policy/dependency-reduced-pom.xml,>
MavenProject: org.apache.sandesha2:sandesha2-rampart-integration:1.7.0-SNAPSHOT @ <https://builds.apache.org/job/sandesha2-trunk/ws/sandesha2/modules/rampart-integration/pom.xml,>
MavenProject: org.apache.sandesha2:sandesha2-samples:1.7.0-SNAPSHOT @ <https://builds.apache.org/job/sandesha2-trunk/ws/sandesha2/modules/samples/pom.xml,>
MavenProject: org.apache.sandesha2:sandesha2-tests:1.7.0-SNAPSHOT @ <https://builds.apache.org/job/sandesha2-trunk/ws/sandesha2/modules/tests/pom.xml,>
MavenProject: org.apache.sandesha2:sandesha2-interop:1.7.0-SNAPSHOT @ <https://builds.apache.org/job/sandesha2-trunk/ws/sandesha2/modules/interop/pom.xml,>
MavenProject: org.apache.sandesha2:sandesha2-persistence:1.7.0-SNAPSHOT @ <https://builds.apache.org/job/sandesha2-trunk/ws/sandesha2/modules/persistence/pom.xml,>
MavenProject: org.apache.sandesha2:distribution:1.7.0-SNAPSHOT @ <https://builds.apache.org/job/sandesha2-trunk/ws/sandesha2/modules/distribution/pom.xml]>
[JENKINS] Archiving <https://builds.apache.org/job/sandesha2-trunk/ws/sandesha2/modules/core/pom.xml>
to /home/hudson/hudson/jobs/sandesha2-trunk/modules/org.apache.sandesha2$sandesha2-core/builds/2012-05-06_02-57-01/archive/org.apache.sandesha2/sandesha2-core/1.7.0-SNAPSHOT/sandesha2-core-1.7.0-SNAPSHOT.pom
[JENKINS] Archiving <https://builds.apache.org/job/sandesha2-trunk/ws/sandesha2/modules/core/target/sandesha2-core-1.7.0-SNAPSHOT.jar>
to /home/hudson/hudson/jobs/sandesha2-trunk/modules/org.apache.sandesha2$sandesha2-core/builds/2012-05-06_02-57-01/archive/org.apache.sandesha2/sandesha2-core/1.7.0-20120506.025749-93/sandesha2-core-1.7.0-20120506.025749-93.jar
[JENKINS] Archiving <https://builds.apache.org/job/sandesha2-trunk/ws/sandesha2/modules/core/target/sandesha2-core-1.7.0-SNAPSHOT-javadoc.jar>
to /home/hudson/hudson/jobs/sandesha2-trunk/modules/org.apache.sandesha2$sandesha2-core/builds/2012-05-06_02-57-01/archive/org.apache.sandesha2/sandesha2-core/1.7.0-20120506.025749-93/sandesha2-core-1.7.0-20120506.025749-93-javadoc.jar
[JENKINS] Archiving <https://builds.apache.org/job/sandesha2-trunk/ws/sandesha2/modules/core/target/sandesha2-core-1.7.0-SNAPSHOT-sources.jar>
to /home/hudson/hudson/jobs/sandesha2-trunk/modules/org.apache.sandesha2$sandesha2-core/builds/2012-05-06_02-57-01/archive/org.apache.sandesha2/sandesha2-core/1.7.0-20120506.025749-93/sandesha2-core-1.7.0-20120506.025749-93-sources.jar
[JENKINS] Archiving <https://builds.apache.org/job/sandesha2-trunk/ws/sandesha2/modules/samples/pom.xml>
to /home/hudson/hudson/jobs/sandesha2-trunk/modules/org.apache.sandesha2$sandesha2-samples/builds/2012-05-06_02-57-01/archive/org.apache.sandesha2/sandesha2-samples/1.7.0-SNAPSHOT/sandesha2-samples-1.7.0-SNAPSHOT.pom
[JENKINS] Archiving <https://builds.apache.org/job/sandesha2-trunk/ws/sandesha2/modules/samples/target/sandesha2-samples-1.7.0-SNAPSHOT.jar>
to /home/hudson/hudson/jobs/sandesha2-trunk/modules/org.apache.sandesha2$sandesha2-samples/builds/2012-05-06_02-57-01/archive/org.apache.sandesha2/sandesha2-samples/1.7.0-20120506.025818-92/sandesha2-samples-1.7.0-20120506.025818-92.jar
[JENKINS] Archiving <https://builds.apache.org/job/sandesha2-trunk/ws/sandesha2/modules/samples/target/sandesha2-samples-1.7.0-SNAPSHOT-sources.jar>
to /home/hudson/hudson/jobs/sandesha2-trunk/modules/org.apache.sandesha2$sandesha2-samples/builds/2012-05-06_02-57-01/archive/org.apache.sandesha2/sandesha2-samples/1.7.0-20120506.025818-92/sandesha2-samples-1.7.0-20120506.025818-92-sources.jar
[JENKINS] Archiving <https://builds.apache.org/job/sandesha2-trunk/ws/sandesha2/modules/samples/target/sandesha2-samples-1.7.0-SNAPSHOT-javadoc.jar>
to /home/hudson/hudson/jobs/sandesha2-trunk/modules/org.apache.sandesha2$sandesha2-samples/builds/2012-05-06_02-57-01/archive/org.apache.sandesha2/sandesha2-samples/1.7.0-20120506.025818-92/sandesha2-samples-1.7.0-20120506.025818-92-javadoc.jar
[JENKINS] Archiving <https://builds.apache.org/job/sandesha2-trunk/ws/sandesha2/modules/client/dependency-reduced-pom.xml>
to /home/hudson/hudson/jobs/sandesha2-trunk/modules/org.apache.sandesha2$sandesha2-client-constants/builds/2012-05-06_02-57-01/archive/org.apache.sandesha2/sandesha2-client-constants/1.7.0-SNAPSHOT/sandesha2-client-constants-1.7.0-SNAPSHOT.pom
[JENKINS] Archiving <https://builds.apache.org/job/sandesha2-trunk/ws/sandesha2/modules/client/target/sandesha2-client-constants-1.7.0-SNAPSHOT.jar>
to /home/hudson/hudson/jobs/sandesha2-trunk/modules/org.apache.sandesha2$sandesha2-client-constants/builds/2012-05-06_02-57-01/archive/org.apache.sandesha2/sandesha2-client-constants/1.7.0-20120506.025757-92/sandesha2-client-constants-1.7.0-20120506.025757-92.jar
[JENKINS] Archiving <https://builds.apache.org/job/sandesha2-trunk/ws/sandesha2/modules/policy/dependency-reduced-pom.xml>
to /home/hudson/hudson/jobs/sandesha2-trunk/modules/org.apache.sandesha2$sandesha2-policy/builds/2012-05-06_02-57-01/archive/org.apache.sandesha2/sandesha2-policy/1.7.0-SNAPSHOT/sandesha2-policy-1.7.0-SNAPSHOT.pom
[JENKINS] Archiving <https://builds.apache.org/job/sandesha2-trunk/ws/sandesha2/modules/policy/target/sandesha2-policy-1.7.0-SNAPSHOT.jar>
to /home/hudson/hudson/jobs/sandesha2-trunk/modules/org.apache.sandesha2$sandesha2-policy/builds/2012-05-06_02-57-01/archive/org.apache.sandesha2/sandesha2-policy/1.7.0-20120506.025802-92/sandesha2-policy-1.7.0-20120506.025802-92.jar
[JENKINS] Archiving <https://builds.apache.org/job/sandesha2-trunk/ws/sandesha2/modules/rampart-integration/pom.xml>
to /home/hudson/hudson/jobs/sandesha2-trunk/modules/org.apache.sandesha2$sandesha2-rampart-integration/builds/2012-05-06_02-57-01/archive/org.apache.sandesha2/sandesha2-rampart-integration/1.7.0-SNAPSHOT/sandesha2-rampart-integration-1.7.0-SNAPSHOT.pom
[JENKINS] Archiving <https://builds.apache.org/job/sandesha2-trunk/ws/sandesha2/modules/rampart-integration/target/sandesha2-rampart-integration-1.7.0-SNAPSHOT.jar>
to /home/hudson/hudson/jobs/sandesha2-trunk/modules/org.apache.sandesha2$sandesha2-rampart-integration/builds/2012-05-06_02-57-01/archive/org.apache.sandesha2/sandesha2-rampart-integration/1.7.0-20120506.025812-93/sandesha2-rampart-integration-1.7.0-20120506.025812-93.jar
[JENKINS] Archiving <https://builds.apache.org/job/sandesha2-trunk/ws/sandesha2/modules/rampart-integration/target/sandesha2-rampart-integration-1.7.0-SNAPSHOT-javadoc.jar>
to /home/hudson/hudson/jobs/sandesha2-trunk/modules/org.apache.sandesha2$sandesha2-rampart-integration/builds/2012-05-06_02-57-01/archive/org.apache.sandesha2/sandesha2-rampart-integration/1.7.0-20120506.025812-93/sandesha2-rampart-integration-1.7.0-20120506.025812-93-javadoc.jar
[JENKINS] Archiving <https://builds.apache.org/job/sandesha2-trunk/ws/sandesha2/modules/rampart-integration/target/sandesha2-rampart-integration-1.7.0-SNAPSHOT-sources.jar>
to /home/hudson/hudson/jobs/sandesha2-trunk/modules/org.apache.sandesha2$sandesha2-rampart-integration/builds/2012-05-06_02-57-01/archive/org.apache.sandesha2/sandesha2-rampart-integration/1.7.0-20120506.025812-93/sandesha2-rampart-integration-1.7.0-20120506.025812-93-sources.jar
[JENKINS] Archiving <https://builds.apache.org/job/sandesha2-trunk/ws/sandesha2/modules/persistence/pom.xml>
to /home/hudson/hudson/jobs/sandesha2-trunk/modules/org.apache.sandesha2$sandesha2-persistence/builds/2012-05-06_02-57-01/archive/org.apache.sandesha2/sandesha2-persistence/1.7.0-SNAPSHOT/sandesha2-persistence-1.7.0-SNAPSHOT.pom
[JENKINS] Archiving <https://builds.apache.org/job/sandesha2-trunk/ws/sandesha2/modules/distribution/pom.xml>
to /home/hudson/hudson/jobs/sandesha2-trunk/modules/org.apache.sandesha2$distribution/builds/2012-05-06_02-57-01/archive/org.apache.sandesha2/distribution/1.7.0-SNAPSHOT/distribution-1.7.0-SNAPSHOT.pom
[JENKINS] Archiving <https://builds.apache.org/job/sandesha2-trunk/ws/sandesha2/modules/tests/pom.xml>
to /home/hudson/hudson/jobs/sandesha2-trunk/modules/org.apache.sandesha2$sandesha2-tests/builds/2012-05-06_02-57-01/archive/org.apache.sandesha2/sandesha2-tests/1.7.0-SNAPSHOT/sandesha2-tests-1.7.0-SNAPSHOT.pom
[JENKINS] Archiving <https://builds.apache.org/job/sandesha2-trunk/ws/sandesha2/modules/tests/target/sandesha2-tests-1.7.0-SNAPSHOT.jar>
to /home/hudson/hudson/jobs/sandesha2-trunk/modules/org.apache.sandesha2$sandesha2-tests/builds/2012-05-06_02-57-01/archive/org.apache.sandesha2/sandesha2-tests/1.7.0-SNAPSHOT/sandesha2-tests-1.7.0-SNAPSHOT.jar
[JENKINS] Archiving <https://builds.apache.org/job/sandesha2-trunk/ws/sandesha2/modules/tests/target/sandesha2-tests-1.7.0-SNAPSHOT-sources.jar>
to /home/hudson/hudson/jobs/sandesha2-trunk/modules/org.apache.sandesha2$sandesha2-tests/builds/2012-05-06_02-57-01/archive/org.apache.sandesha2/sandesha2-tests/1.7.0-SNAPSHOT/sandesha2-tests-1.7.0-SNAPSHOT-sources.jar
[JENKINS] Archiving <https://builds.apache.org/job/sandesha2-trunk/ws/sandesha2/pom.xml>
to /home/hudson/hudson/jobs/sandesha2-trunk/modules/org.apache.sandesha2$sandesha2-parent/builds/2012-05-06_02-57-01/archive/org.apache.sandesha2/sandesha2-parent/1.7.0-SNAPSHOT/sandesha2-parent-1.7.0-SNAPSHOT.pom
[JENKINS] Archiving <https://builds.apache.org/job/sandesha2-trunk/ws/sandesha2/modules/interop/pom.xml>
to /home/hudson/hudson/jobs/sandesha2-trunk/modules/org.apache.sandesha2$sandesha2-interop/builds/2012-05-06_02-57-01/archive/org.apache.sandesha2/sandesha2-interop/1.7.0-SNAPSHOT/sandesha2-interop-1.7.0-SNAPSHOT.pom
[JENKINS] Archiving <https://builds.apache.org/job/sandesha2-trunk/ws/sandesha2/modules/interop/target/sandesha2-interop-1.7.0-SNAPSHOT.jar>
to /home/hudson/hudson/jobs/sandesha2-trunk/modules/org.apache.sandesha2$sandesha2-interop/builds/2012-05-06_02-57-01/archive/org.apache.sandesha2/sandesha2-interop/1.7.0-20120506.031028-93/sandesha2-interop-1.7.0-20120506.031028-93.jar
[JENKINS] Archiving <https://builds.apache.org/job/sandesha2-trunk/ws/sandesha2/modules/interop/target/sandesha2-interop-1.7.0-SNAPSHOT-javadoc.jar>
to /home/hudson/hudson/jobs/sandesha2-trunk/modules/org.apache.sandesha2$sandesha2-interop/builds/2012-05-06_02-57-01/archive/org.apache.sandesha2/sandesha2-interop/1.7.0-20120506.031028-93/sandesha2-interop-1.7.0-20120506.031028-93-javadoc.jar
[JENKINS] Archiving <https://builds.apache.org/job/sandesha2-trunk/ws/sandesha2/modules/interop/target/sandesha2-interop-1.7.0-SNAPSHOT-sources.jar>
to /home/hudson/hudson/jobs/sandesha2-trunk/modules/org.apache.sandesha2$sandesha2-interop/builds/2012-05-06_02-57-01/archive/org.apache.sandesha2/sandesha2-interop/1.7.0-20120506.031028-93/sandesha2-interop-1.7.0-20120506.031028-93-sources.jar
[JENKINS] Archiving <https://builds.apache.org/job/sandesha2-trunk/ws/sandesha2/modules/mar/pom.xml>
to /home/hudson/hudson/jobs/sandesha2-trunk/modules/org.apache.sandesha2$sandesha2/builds/2012-05-06_02-57-01/archive/org.apache.sandesha2/sandesha2/1.7.0-SNAPSHOT/sandesha2-1.7.0-SNAPSHOT.pom
[JENKINS] Archiving <https://builds.apache.org/job/sandesha2-trunk/ws/sandesha2/modules/mar/target/sandesha2-1.7.0-SNAPSHOT.mar>
to /home/hudson/hudson/jobs/sandesha2-trunk/modules/org.apache.sandesha2$sandesha2/builds/2012-05-06_02-57-01/archive/org.apache.sandesha2/sandesha2/1.7.0-20120506.025754-92/sandesha2-1.7.0-20120506.025754-92.mar
[JENKINS] Archiving <https://builds.apache.org/job/sandesha2-trunk/ws/sandesha2/modules/mar/target/sandesha2-1.7.0-SNAPSHOT-sources.jar>
to /home/hudson/hudson/jobs/sandesha2-trunk/modules/org.apache.sandesha2$sandesha2/builds/2012-05-06_02-57-01/archive/org.apache.sandesha2/sandesha2/1.7.0-20120506.025754-92/sandesha2-1.7.0-20120506.025754-92-sources.jar
[JENKINS] Archiving <https://builds.apache.org/job/sandesha2-trunk/ws/sandesha2/modules/resource-bundle/pom.xml>
to /home/hudson/hudson/jobs/sandesha2-trunk/modules/org.apache.sandesha2$sandesha2-resource-bundle/builds/2012-05-06_02-57-01/archive/org.apache.sandesha2/sandesha2-resource-bundle/1.7.0-SNAPSHOT/sandesha2-resource-bundle-1.7.0-SNAPSHOT.pom
[JENKINS] Archiving <https://builds.apache.org/job/sandesha2-trunk/ws/sandesha2/modules/resource-bundle/target/sandesha2-resource-bundle-1.7.0-SNAPSHOT.jar>
to /home/hudson/hudson/jobs/sandesha2-trunk/modules/org.apache.sandesha2$sandesha2-resource-bundle/builds/2012-05-06_02-57-01/archive/org.apache.sandesha2/sandesha2-resource-bundle/1.7.0-20120506.025736-92/sandesha2-resource-bundle-1.7.0-20120506.025736-92.jar
[JENKINS] Archiving <https://builds.apache.org/job/sandesha2-trunk/ws/sandesha2/modules/resource-bundle/target/sandesha2-resource-bundle-1.7.0-SNAPSHOT-sources.jar>
to /home/hudson/hudson/jobs/sandesha2-trunk/modules/org.apache.sandesha2$sandesha2-resource-bundle/builds/2012-05-06_02-57-01/archive/org.apache.sandesha2/sandesha2-resource-bundle/1.7.0-20120506.025736-92/sandesha2-resource-bundle-1.7.0-20120506.025736-92-sources.jar
Waiting for Jenkins to finish collecting data
mavenExecutionResult exceptions not empty
message : Failed to execute goal org.apache.maven.plugins:maven-compiler-plugin:2.0:testCompile
(default-testCompile) on project sandesha2-persistence: Compilation failure
cause : Compilation failure
Stack trace : 
org.apache.maven.lifecycle.LifecycleExecutionException: Failed to execute goal org.apache.maven.plugins:maven-compiler-plugin:2.0:testCompile
(default-testCompile) on project sandesha2-persistence: Compilation failure
	at org.apache.maven.lifecycle.internal.MojoExecutor.execute(MojoExecutor.java:213)
	at org.apache.maven.lifecycle.internal.MojoExecutor.execute(MojoExecutor.java:153)
	at org.apache.maven.lifecycle.internal.MojoExecutor.execute(MojoExecutor.java:145)
	at org.apache.maven.lifecycle.internal.LifecycleModuleBuilder.buildProject(LifecycleModuleBuilder.java:84)
	at org.apache.maven.lifecycle.internal.LifecycleModuleBuilder.buildProject(LifecycleModuleBuilder.java:59)
	at org.apache.maven.lifecycle.internal.LifecycleStarter.singleThreadedBuild(LifecycleStarter.java:183)
	at org.apache.maven.lifecycle.internal.LifecycleStarter.execute(LifecycleStarter.java:161)
	at org.apache.maven.DefaultMaven.doExecute(DefaultMaven.java:319)
	at org.apache.maven.DefaultMaven.execute(DefaultMaven.java:156)
	at org.jvnet.hudson.maven3.launcher.Maven3Launcher.main(Maven3Launcher.java:79)
	at sun.reflect.NativeMethodAccessorImpl.invoke0(Native Method)
	at sun.reflect.NativeMethodAccessorImpl.invoke(NativeMethodAccessorImpl.java:39)
	at sun.reflect.DelegatingMethodAccessorImpl.invoke(DelegatingMethodAccessorImpl.java:25)
	at java.lang.reflect.Method.invoke(Method.java:592)
	at org.codehaus.plexus.classworlds.launcher.Launcher.launchStandard(Launcher.java:329)
	at org.codehaus.plexus.classworlds.launcher.Launcher.launch(Launcher.java:239)
	at org.jvnet.hudson.maven3.agent.Maven3Main.launch(Maven3Main.java:158)
	at hudson.maven.Maven3Builder.call(Maven3Builder.java:98)
	at hudson.maven.Maven3Builder.call(Maven3Builder.java:64)
	at hudson.remoting.UserRequest.perform(UserRequest.java:118)
	at hudson.remoting.UserRequest.perform(UserRequest.java:48)
	at hudson.remoting.Request$2.run(Request.java:287)
	at hudson.remoting.InterceptingExecutorService$1.call(InterceptingExecutorService.java:72)
	at java.util.concurrent.FutureTask$Sync.innerRun(FutureTask.java:269)
	at java.util.concurrent.FutureTask.run(FutureTask.java:123)
	at java.util.concurrent.ThreadPoolExecutor$Worker.runTask(ThreadPoolExecutor.java:651)
	at java.util.concurrent.ThreadPoolExecutor$Worker.run(ThreadPoolExecutor.java:676)
	at java.lang.Thread.run(Thread.java:595)
Caused by: org.apache.maven.plugin.CompilationFailureException: Compilation failure
	at org.apache.maven.plugin.AbstractCompilerMojo.execute(AbstractCompilerMojo.java:429)
	at org.apache.maven.plugin.TestCompilerMojo.execute(TestCompilerMojo.java:98)
	at org.apache.maven.plugin.DefaultBuildPluginManager.executeMojo(DefaultBuildPluginManager.java:101)
	at org.apache.maven.lifecycle.internal.MojoExecutor.execute(MojoExecutor.java:209)
	... 27 more
Sending e-mails to: java-dev@axis.apache.org
channel stopped

---------------------------------------------------------------------
To unsubscribe, e-mail: java-dev-unsubscribe@axis.apache.org
For additional commands, e-mail: java-dev-help@axis.apache.org


Mime
View raw message