axis-java-dev mailing list archives

Site index · List index
Message view « Date » · « Thread »
Top « Date » · « Thread »
From Apache Jenkins Server <jenk...@builds.apache.org>
Subject Build failed in Jenkins: Axis2 » Apache Axis2 - Data Binding #1445
Date Wed, 09 May 2012 13:13:13 GMT
See <https://builds.apache.org/job/Axis2/org.apache.axis2$axis2-adb/1445/>

------------------------------------------
[INFO] ------------------------------------------------------------------------
[INFO] Building Apache Axis2 - Data Binding
[INFO]    task-segment: [clean, deploy]
[INFO] ------------------------------------------------------------------------
[INFO] [clean:clean {execution: default-clean}]
[INFO] Deleting directory <https://builds.apache.org/job/Axis2/org.apache.axis2$axis2-adb/ws/target>
[INFO] [remote-resources:process {execution: default}]
[INFO] snapshot org.apache.ws.commons.axiom:axiom-dom:1.2.14-SNAPSHOT: checking for updates
from apache.snapshots
Downloading: http://repository.apache.org/snapshots/org/apache/ws/commons/axiom/axiom-dom/1.2.14-SNAPSHOT/axiom-dom-1.2.14-20120509.013318-104.pom

Downloading: http://repository.apache.org/snapshots/org/apache/ws/commons/axiom/axiom-dom/1.2.14-SNAPSHOT/axiom-dom-1.2.14-20120509.013318-104.jar
195K downloaded  (axiom-dom-1.2.14-20120509.013318-104.jar)
[INFO] [resources:resources {execution: default-resources}]
[INFO] Using 'UTF-8' encoding to copy filtered resources.
[INFO] skip non existing resourceDirectory <https://builds.apache.org/job/Axis2/org.apache.axis2$axis2-adb/ws/conf>
[INFO] Copying 2 resources
[INFO] Copying 2 resources
[INFO] [compiler:compile {execution: default-compile}]
[INFO] Compiling 172 source files to <https://builds.apache.org/job/Axis2/org.apache.axis2$axis2-adb/ws/target/classes>
[INFO] -------------------------------------------------------------
[ERROR] COMPILATION ERROR : 
[INFO] -------------------------------------------------------------
[ERROR] <https://builds.apache.org/job/Axis2/org.apache.axis2$axis2-adb/ws/src/org/apache/axis2/rpc/receivers/RPCInOutAsyncMessageReceiver.java>:[34,34]
cannot find symbol
symbol  : class AbstractInOutAsyncMessageReceiver
location: package org.apache.axis2.receivers

[ERROR] <https://builds.apache.org/job/Axis2/org.apache.axis2$axis2-adb/ws/src/org/apache/axis2/rpc/receivers/RPCInOutAsyncMessageReceiver.java>:[42,50]
cannot find symbol
symbol: class AbstractInOutAsyncMessageReceiver
public class RPCInOutAsyncMessageReceiver extends AbstractInOutAsyncMessageReceiver {

[ERROR] <https://builds.apache.org/job/Axis2/org.apache.axis2$axis2-adb/ws/src/org/apache/axis2/rpc/receivers/RPCInOutAsyncMessageReceiver.java>:[68,25]
cannot find symbol
symbol  : method getTheImplementationObject(org.apache.axis2.context.MessageContext)
location: class org.apache.axis2.rpc.receivers.RPCInOutAsyncMessageReceiver

[ERROR] <https://builds.apache.org/job/Axis2/org.apache.axis2$axis2-adb/ws/src/org/apache/axis2/rpc/receivers/RPCInOutAsyncMessageReceiver.java>:[100,30]
cannot find symbol
symbol  : method getSOAPFactory(org.apache.axis2.context.MessageContext)
location: class org.apache.axis2.rpc.receivers.RPCInOutAsyncMessageReceiver

[INFO] 4 errors 
[INFO] -------------------------------------------------------------
[JENKINS] Archiving <https://builds.apache.org/job/Axis2/org.apache.axis2$axis2-adb/ws/pom.xml>
to /home/hudson/hudson/jobs/Axis2/modules/org.apache.axis2$axis2-adb/builds/2012-05-09_13-12-22/archive/org.apache.axis2/axis2-adb/1.7.0-SNAPSHOT/axis2-adb-1.7.0-SNAPSHOT.pom
[INFO] ------------------------------------------------------------------------
[ERROR] BUILD FAILURE
[INFO] ------------------------------------------------------------------------
[INFO] Compilation failure

<https://builds.apache.org/job/Axis2/org.apache.axis2$axis2-adb/ws/src/org/apache/axis2/rpc/receivers/RPCInOutAsyncMessageReceiver.java>:[34,34]
cannot find symbol
symbol  : class AbstractInOutAsyncMessageReceiver
location: package org.apache.axis2.receivers

<https://builds.apache.org/job/Axis2/org.apache.axis2$axis2-adb/ws/src/org/apache/axis2/rpc/receivers/RPCInOutAsyncMessageReceiver.java>:[42,50]
cannot find symbol
symbol: class AbstractInOutAsyncMessageReceiver
public class RPCInOutAsyncMessageReceiver extends AbstractInOutAsyncMessageReceiver {

<https://builds.apache.org/job/Axis2/org.apache.axis2$axis2-adb/ws/src/org/apache/axis2/rpc/receivers/RPCInOutAsyncMessageReceiver.java>:[68,25]
cannot find symbol
symbol  : method getTheImplementationObject(org.apache.axis2.context.MessageContext)
location: class org.apache.axis2.rpc.receivers.RPCInOutAsyncMessageReceiver

<https://builds.apache.org/job/Axis2/org.apache.axis2$axis2-adb/ws/src/org/apache/axis2/rpc/receivers/RPCInOutAsyncMessageReceiver.java>:[100,30]
cannot find symbol
symbol  : method getSOAPFactory(org.apache.axis2.context.MessageContext)
location: class org.apache.axis2.rpc.receivers.RPCInOutAsyncMessageReceiver


[INFO] ------------------------------------------------------------------------
[INFO] For more information, run Maven with the -e switch
[INFO] ------------------------------------------------------------------------
[INFO] Total time: 44 seconds
[INFO] Finished at: Wed May 09 13:13:13 GMT 2012
[INFO] Final Memory: 69M/223M
[INFO] ------------------------------------------------------------------------

---------------------------------------------------------------------
To unsubscribe, e-mail: java-dev-unsubscribe@axis.apache.org
For additional commands, e-mail: java-dev-help@axis.apache.org


Mime
View raw message