axis-java-dev mailing list archives

Site index · List index
Message view « Date » · « Thread »
Top « Date » · « Thread »
From Apache Jenkins Server <jenk...@builds.apache.org>
Subject Build failed in Jenkins: Axis2 » Apache Axis2 - ADB Codegen #1482
Date Fri, 18 May 2012 23:21:24 GMT
See <https://builds.apache.org/job/Axis2/org.apache.axis2$axis2-adb-codegen/1482/>

------------------------------------------
[INFO] ------------------------------------------------------------------------
[INFO] Building Apache Axis2 - ADB Codegen
[INFO]    task-segment: [clean, deploy]
[INFO] ------------------------------------------------------------------------
[INFO] [clean:clean {execution: default-clean}]
[INFO] Deleting directory <https://builds.apache.org/job/Axis2/org.apache.axis2$axis2-adb-codegen/ws/target>
[INFO] [remote-resources:process {execution: default}]
[INFO] [resources:resources {execution: default-resources}]
[INFO] Using 'UTF-8' encoding to copy filtered resources.
[INFO] skip non existing resourceDirectory <https://builds.apache.org/job/Axis2/org.apache.axis2$axis2-adb-codegen/ws/conf>
[INFO] Copying 11 resources
[INFO] Copying 2 resources
[INFO] [antrun:run {execution: process-resources}]
[INFO] Executing tasks
     [copy] Copying 7 files to <https://builds.apache.org/job/Axis2/org.apache.axis2$axis2-adb-codegen/ws/target/classes>
[INFO] Executed tasks
[INFO] [compiler:compile {execution: default-compile}]
[INFO] Compiling 17 source files to <https://builds.apache.org/job/Axis2/org.apache.axis2$axis2-adb-codegen/ws/target/classes>
[INFO] [antrun:run {execution: generate-test-sources}]
[INFO] Executing tasks
Overriding previous definition of reference to maven.dependency.classpath

main:
    [mkdir] Created dir: <https://builds.apache.org/job/Axis2/org.apache.axis2$axis2-adb-codegen/ws/target/schema>
    [mkdir] Created dir: <https://builds.apache.org/job/Axis2/org.apache.axis2$axis2-adb-codegen/ws/target/schema/src>
    [mkdir] Created dir: <https://builds.apache.org/job/Axis2/org.apache.axis2$axis2-adb-codegen/ws/target/schema/classes>
     [java] Compiling simple_maxOccurs2.xsd
     [java] Compiling anonymous_complexType.xsd
     [java] Compiling simple_choice.xsd
     [java] Compiling simple_particle_all.xsd
     [java] Compiling simple_maxOccurs.xsd
     [java] Compiling simple_anytype.xsd
     [java] Compiling simple-minoccurs0.xsd
     [java] Compiling complex-minoccurs0.xsd
     [java] Compiling simple-recursive-datatypes.xsd
     [java] Compiling mixed_minoccus0.xsd
     [java] Compiling simpleType-All.xsd
     [java] Compiling derivedType-All.xsd
     [java] Compiling testsuite.xsd
     [java] Compiling extensions.xsd
     [java] Compiling union.xsd
     [java] Compiling all.xsd
     [java] Compiling enumeration.xsd
     [java] Compiling restrictions.xsd
     [java] Compiling choice.xsd
     [java] Compiling list.xsd
     [java] Compiling references.xsd
     [java] Compiling innerchoice.xsd
     [java] Compiling attribute.xsd
     [java] Compiling boolean.xsd
     [java] Compiling particlemaxoccurs.xsd
     [java] Compiling innerParticles.xsd
     [java] Compiling default_namespaces.xsd
     [java] Compiling groups.xsd
     [java] Compiling base64binary.xsd
     [java] Compiling abstract.xsd
     [java] Compiling decimal.xsd
     [java] Compiling anytype.xsd
     [java] Compiling innerParticleExtension.xsd
     [java] Compiling union2.xsd
     [java] Compiling default_value.xsd
     [java] Compiling complexExtension.xsd
     [java] Compiling soapencoding.xsd
     [java] Compiling chameleon.xsd
     [java] Compiling nonamespace.xsd
     [java] Compiling unqualified.xsd
     [java] Compiling companyservice.xsd
     [java] Compiling names.xsd
     [java] Compiling std-schemas.xsd
     [java] Compiling testsuite.xsd
     [java] Compiling all.xsd
     [java] Compiling boolean.xsd
     [java] Compiling chameleon.xsd
     [java] Compiling choice.xsd
     [java] Compiling decimal.xsd
     [java] Compiling default_value.xsd
     [java] Compiling enumeration.xsd
     [java] Compiling groups.xsd
     [java] Compiling innerchoice.xsd
     [java] Compiling innerParticleExtension.xsd
     [java] Compiling unqualified.xsd
     [java] Compiling companyservice.xsd
     [java] Compiling names.xsd
[INFO] Executed tasks
[INFO] [resources:testResources {execution: default-testResources}]
[INFO] Using 'UTF-8' encoding to copy filtered resources.
[INFO] skip non existing resourceDirectory <https://builds.apache.org/job/Axis2/org.apache.axis2$axis2-adb-codegen/ws/src/test/resources>
[INFO] Copying 2 resources
[INFO] [build-helper:add-test-source {execution: add-test-source}]
[INFO] Test Source directory: <https://builds.apache.org/job/Axis2/org.apache.axis2$axis2-adb-codegen/ws/target/schema/src>
added.
[INFO] [compiler:testCompile {execution: default-testCompile}]
[INFO] Compiling 868 source files to <https://builds.apache.org/job/Axis2/org.apache.axis2$axis2-adb-codegen/ws/target/test-classes>
[INFO] -------------------------------------------------------------
[ERROR] COMPILATION ERROR : 
[INFO] -------------------------------------------------------------
[ERROR] <https://builds.apache.org/job/Axis2/org.apache.axis2$axis2-adb-codegen/ws/test/org/apache/axis2/schema/AbstractTestCase.java>:[52,43]
package org.apache.axiom.mime.impl.javamail does not exist

[ERROR] <https://builds.apache.org/job/Axis2/org.apache.axis2$axis2-adb-codegen/ws/test/org/apache/axis2/schema/AbstractTestCase.java>:[376,65]
package JavaMailMultipartWriterFactory does not exist

[INFO] 2 errors 
[INFO] -------------------------------------------------------------
[JENKINS] Archiving <https://builds.apache.org/job/Axis2/org.apache.axis2$axis2-adb-codegen/ws/pom.xml>
to /home/hudson/hudson/jobs/Axis2/modules/org.apache.axis2$axis2-adb-codegen/builds/2012-05-18_23-19-16/archive/org.apache.axis2/axis2-adb-codegen/1.7.0-SNAPSHOT/axis2-adb-codegen-1.7.0-SNAPSHOT.pom
[INFO] ------------------------------------------------------------------------
[ERROR] BUILD FAILURE
[INFO] ------------------------------------------------------------------------
[INFO] Compilation failure

<https://builds.apache.org/job/Axis2/org.apache.axis2$axis2-adb-codegen/ws/test/org/apache/axis2/schema/AbstractTestCase.java>:[52,43]
package org.apache.axiom.mime.impl.javamail does not exist

<https://builds.apache.org/job/Axis2/org.apache.axis2$axis2-adb-codegen/ws/test/org/apache/axis2/schema/AbstractTestCase.java>:[376,65]
package JavaMailMultipartWriterFactory does not exist


[INFO] ------------------------------------------------------------------------
[INFO] For more information, run Maven with the -e switch
[INFO] ------------------------------------------------------------------------
[INFO] Total time: 2 minutes 
[INFO] Finished at: Fri May 18 23:21:23 GMT 2012
[INFO] Final Memory: 79M/239M
[INFO] ------------------------------------------------------------------------

---------------------------------------------------------------------
To unsubscribe, e-mail: java-dev-unsubscribe@axis.apache.org
For additional commands, e-mail: java-dev-help@axis.apache.org


Mime
View raw message