axis-java-dev mailing list archives

Site index · List index
Message view « Date » · « Thread »
Top « Date » · « Thread »
From Apache Jenkins Server <jenk...@builds.apache.org>
Subject Build failed in Jenkins: axis2-transports-trunk #793
Date Wed, 02 May 2012 11:02:31 GMT
See <https://builds.apache.org/job/axis2-transports-trunk/793/changes>

Changes:

[sagara] Moved sample into a new profiles.

------------------------------------------
Started by an SCM change
Building remotely on ubuntu4 in workspace <https://builds.apache.org/job/axis2-transports-trunk/ws/>
Updating http://svn.apache.org/repos/asf/axis/axis2/java/transports/trunk
U         pom.xml
At revision 1332990
[axis2-transports-trunk] $ /bin/bash -xe /tmp/hudson5320637674778208912.sh
+ '[' -d <https://builds.apache.org/job/axis2-transports-trunk/ws/.repository> ']'
++ find <https://builds.apache.org/job/axis2-transports-trunk/ws/.repository> -type
d -and -name '*-SNAPSHOT'
+ rm -rf <https://builds.apache.org/job/axis2-transports-trunk/ws/.repository/org/apache/woden/woden/1.0-SNAPSHOT>
<https://builds.apache.org/job/axis2-transports-trunk/ws/.repository/org/apache/woden/woden-impl-dom/1.0-SNAPSHOT>
<https://builds.apache.org/job/axis2-transports-trunk/ws/.repository/org/apache/woden/woden-impl-commons/1.0-SNAPSHOT>
<https://builds.apache.org/job/axis2-transports-trunk/ws/.repository/org/apache/woden/woden-api/1.0-SNAPSHOT>
<https://builds.apache.org/job/axis2-transports-trunk/ws/.repository/org/apache/neethi/neethi/3.0.3-SNAPSHOT>
<https://builds.apache.org/job/axis2-transports-trunk/ws/.repository/org/apache/james/apache-mime4j-project/0.8-SNAPSHOT>
<https://builds.apache.org/job/axis2-transports-trunk/ws/.repository/org/apache/james/apache-mime4j-core/0.8-SNAPSHOT>
<https://builds.apache.org/job/axis2-transports-trunk/ws/.repository/org/apache/axis2/addressing/1.7.0-SNAPSHOT>
<https://builds.apache.org/job/axis2-transports-trunk/ws/.repository/org/apache/axis2/axis2-transport-testkit/1.7.0-SNAPSHOT>
<https://builds.apache.org/job/axis2-transports-trunk/ws/.repository/org/apache/axis2/axis2-kernel/1.7.0-SNAPSHOT>
<https://builds.apache.org/job/axis2-transports-trunk/ws/.repository/org/apache/axis2/examples/https-sample/1.7.0-SNAPSHOT>
<https://builds.apache.org/job/axis2-transports-trunk/ws/.repository/org/apache/axis2/axis2-transport-xmpp/1.7.0-SNAPSHOT>
<https://builds.apache.org/job/axis2-transports-trunk/ws/.repository/org/apache/axis2/axis2-transport-http/1.7.0-SNAPSHOT>
<https://builds.apache.org/job/axis2-transports-trunk/ws/.repository/org/apache/axis2/axis2-transport-sms/1.7.0-SNAPSHOT>
<https://builds.apache.org/job/axis2-transports-trunk/ws/.repository/org/apache/axis2/axis2-transport-all/1.7.0-SNAPSHOT>
<https://builds.apache.org/job/axis2-transports-trunk/ws/.repository/org/apache/axis2/axis2-transports/1.7.0-SNAPSHOT>
<https://builds.apache.org/job/axis2-transports-trunk/ws/.repository/org/apache/axis2/axis2-transport-mail/1.7.0-SNAPSHOT>
<https://builds.apache.org/job/axis2-transports-trunk/ws/.repository/org/apache/axis2/axis2-transport-udp/1.7.0-SNAPSHOT>
<https://builds.apache.org/job/axis2-transports-trunk/ws/.repository/org/apache/axis2/axis2-transport-tcp/1.7.0-SNAPSHOT>
<https://builds.apache.org/job/axis2-transports-trunk/ws/.repository/org/apache/axis2/axis2-transport-http-tests/1.7.0-SNAPSHOT>
<https://builds.apache.org/job/axis2-transports-trunk/ws/.repository/org/apache/axis2/axis2-transport-jms/1.7.0-SNAPSHOT>
<https://builds.apache.org/job/axis2-transports-trunk/ws/.repository/org/apache/axis2/axis2-transport-base/1.7.0-SNAPSHOT>
<https://builds.apache.org/job/axis2-transports-trunk/ws/.repository/org/apache/axis2/axis2-parent/1.7.0-SNAPSHOT>
<https://builds.apache.org/job/axis2-transports-trunk/ws/.repository/org/apache/ws/commons/schema/XmlSchema/1.4.8-SNAPSHOT>
<https://builds.apache.org/job/axis2-transports-trunk/ws/.repository/org/apache/ws/commons/axiom/axiom-parent/1.2.14-SNAPSHOT>
<https://builds.apache.org/job/axis2-transports-trunk/ws/.repository/org/apache/ws/commons/axiom/axiom-impl/1.2.14-SNAPSHOT>
<https://builds.apache.org/job/axis2-transports-trunk/ws/.repository/org/apache/ws/commons/axiom/axiom-api/1.2.14-SNAPSHOT>
[locks-and-latches] Checking to see if we really have the locks
[locks-and-latches] Have all the locks, build can start
Parsing POMs
[locks-and-latches] Releasing all the locks
[locks-and-latches] All the locks released
ERROR: Failed to parse POMs
hudson.util.IOException2: remote file operation failed: <https://builds.apache.org/job/axis2-transports-trunk/ws/transports>
at hudson.remoting.Channel@c4bcd15:ubuntu4
	at hudson.FilePath.act(FilePath.java:828)
	at hudson.FilePath.act(FilePath.java:814)
	at hudson.maven.MavenModuleSetBuild$RunnerImpl.parsePoms(MavenModuleSetBuild.java:910)
	at hudson.maven.MavenModuleSetBuild$RunnerImpl.doRun(MavenModuleSetBuild.java:654)
	at hudson.model.AbstractBuild$AbstractRunner.run(AbstractBuild.java:475)
	at hudson.model.Run.run(Run.java:1434)
	at hudson.maven.MavenModuleSetBuild.run(MavenModuleSetBuild.java:477)
	at hudson.model.ResourceController.execute(ResourceController.java:88)
	at hudson.model.Executor.run(Executor.java:239)
Caused by: hudson.remoting.ProxyException: hudson.maven.MavenModuleSetBuild$MavenExecutionException:
org.apache.maven.project.ProjectBuildingException: Some problems were encountered while processing
the POMs:
[FATAL] Non-parseable POM <https://builds.apache.org/job/axis2-transports-trunk/ws/transports/pom.xml>:
end tag name </project> must match start tag name <profiles> from line 162 (position:
TEXT seen ...</properties>\n\n</project>... @467:11)  @ line 467, column 11

	at hudson.maven.MavenModuleSetBuild$PomParser.invoke(MavenModuleSetBuild.java:1278)
	at hudson.maven.MavenModuleSetBuild$PomParser.invoke(MavenModuleSetBuild.java:1045)
	at hudson.FilePath$FileCallableWrapper.call(FilePath.java:2154)
	at hudson.remoting.UserRequest.perform(UserRequest.java:118)
	at hudson.remoting.UserRequest.perform(UserRequest.java:48)
	at hudson.remoting.Request$2.run(Request.java:287)
	at hudson.remoting.InterceptingExecutorService$1.call(InterceptingExecutorService.java:72)
	at java.util.concurrent.FutureTask$Sync.innerRun(FutureTask.java:334)
	at java.util.concurrent.FutureTask.run(FutureTask.java:166)
	at java.util.concurrent.ThreadPoolExecutor.runWorker(ThreadPoolExecutor.java:1110)
	at java.util.concurrent.ThreadPoolExecutor$Worker.run(ThreadPoolExecutor.java:603)
	at java.lang.Thread.run(Thread.java:636)
Caused by: hudson.remoting.ProxyException: org.apache.maven.project.ProjectBuildingException:
Some problems were encountered while processing the POMs:
[FATAL] Non-parseable POM <https://builds.apache.org/job/axis2-transports-trunk/ws/transports/pom.xml>:
end tag name </project> must match start tag name <profiles> from line 162 (position:
TEXT seen ...</properties>\n\n</project>... @467:11)  @ line 467, column 11

	at org.apache.maven.project.DefaultProjectBuilder.build(DefaultProjectBuilder.java:363)
	at hudson.maven.MavenEmbedder.buildProjects(MavenEmbedder.java:361)
	at hudson.maven.MavenEmbedder.readProjects(MavenEmbedder.java:331)
	at hudson.maven.MavenEmbedder.readProject(MavenEmbedder.java:322)
	at hudson.maven.MavenModuleSetBuild$PomParser.invoke(MavenModuleSetBuild.java:1234)
	... 11 more

---------------------------------------------------------------------
To unsubscribe, e-mail: java-dev-unsubscribe@axis.apache.org
For additional commands, e-mail: java-dev-help@axis.apache.org


Mime
View raw message