axis-java-dev mailing list archives

Site index · List index
Message view « Date » · « Thread »
Top « Date » · « Thread »
From Apache Jenkins Server <jenk...@builds.apache.org>
Subject Build failed in Jenkins: Rampart #866
Date Tue, 01 May 2012 22:59:14 GMT
See <https://builds.apache.org/job/Rampart/866/>

------------------------------------------
[...truncated 80 lines...]
Downloading: http://repository.apache.org/snapshots/org/apache/james/apache-mime4j-core/0.8-SNAPSHOT/maven-metadata.xml
Downloaded: http://repository.apache.org/snapshots/org/apache/james/apache-mime4j-core/0.8-SNAPSHOT/maven-metadata.xml
(2 KB at 1.1 KB/sec)
Downloading: http://repository.apache.org/snapshots/org/apache/james/apache-mime4j-core/0.8-SNAPSHOT/apache-mime4j-core-0.8-20120501.004225-253.pom
Downloaded: http://repository.apache.org/snapshots/org/apache/james/apache-mime4j-core/0.8-SNAPSHOT/apache-mime4j-core-0.8-20120501.004225-253.pom
(3 KB at 16.5 KB/sec)
Downloading: http://shibboleth.internet2.edu/downloads/maven2/org/apache/james/apache-mime4j-project/0.8-SNAPSHOT/maven-metadata.xml
Downloading: http://repository.apache.org/snapshots/org/apache/james/apache-mime4j-project/0.8-SNAPSHOT/maven-metadata.xml
Downloaded: http://repository.apache.org/snapshots/org/apache/james/apache-mime4j-project/0.8-SNAPSHOT/maven-metadata.xml
(825 B at 1.7 KB/sec)
Downloading: http://repository.apache.org/snapshots/org/apache/james/apache-mime4j-project/0.8-SNAPSHOT/apache-mime4j-project-0.8-20120501.004208-281.pom
Downloaded: http://repository.apache.org/snapshots/org/apache/james/apache-mime4j-project/0.8-SNAPSHOT/apache-mime4j-project-0.8-20120501.004208-281.pom
(10 KB at 64.0 KB/sec)
Downloading: http://shibboleth.internet2.edu/downloads/maven2/org/apache/ws/commons/axiom/axiom-impl/1.2.14-SNAPSHOT/maven-metadata.xml
Downloading: http://repository.apache.org/snapshots/org/apache/ws/commons/axiom/axiom-impl/1.2.14-SNAPSHOT/maven-metadata.xml
Downloaded: http://repository.apache.org/snapshots/org/apache/ws/commons/axiom/axiom-impl/1.2.14-SNAPSHOT/maven-metadata.xml
(2 KB at 2.3 KB/sec)
Downloading: http://repository.apache.org/snapshots/org/apache/ws/commons/axiom/axiom-impl/1.2.14-SNAPSHOT/axiom-impl-1.2.14-20120501.201819-86.pom
Downloaded: http://repository.apache.org/snapshots/org/apache/ws/commons/axiom/axiom-impl/1.2.14-SNAPSHOT/axiom-impl-1.2.14-20120501.201819-86.pom
(8 KB at 43.8 KB/sec)
Downloading: http://shibboleth.internet2.edu/downloads/maven2/org/apache/ws/commons/schema/XmlSchema/1.4.8-SNAPSHOT/maven-metadata.xml
Downloading: http://repository.apache.org/snapshots/org/apache/ws/commons/schema/XmlSchema/1.4.8-SNAPSHOT/maven-metadata.xml
Downloaded: http://repository.apache.org/snapshots/org/apache/ws/commons/schema/XmlSchema/1.4.8-SNAPSHOT/maven-metadata.xml
(283 B at 0.5 KB/sec)
Downloading: http://shibboleth.internet2.edu/downloads/maven2/org/apache/ws/commons/schema/XmlSchema/1.4.8-SNAPSHOT/XmlSchema-1.4.8-SNAPSHOT.pom
Downloading: http://repository.apache.org/snapshots/org/apache/ws/commons/schema/XmlSchema/1.4.8-SNAPSHOT/XmlSchema-1.4.8-SNAPSHOT.pom
Downloaded: http://repository.apache.org/snapshots/org/apache/ws/commons/schema/XmlSchema/1.4.8-SNAPSHOT/XmlSchema-1.4.8-SNAPSHOT.pom
(18 KB at 76.1 KB/sec)
Downloading: http://shibboleth.internet2.edu/downloads/maven2/org/apache/neethi/neethi/3.0.3-SNAPSHOT/maven-metadata.xml
Downloading: http://repository.apache.org/snapshots/org/apache/neethi/neethi/3.0.3-SNAPSHOT/maven-metadata.xml
Downloaded: http://repository.apache.org/snapshots/org/apache/neethi/neethi/3.0.3-SNAPSHOT/maven-metadata.xml
(360 B at 0.2 KB/sec)
Downloading: http://repository.apache.org/snapshots/org/apache/neethi/neethi/3.0.3-SNAPSHOT/neethi-3.0.3-20120501.203245-71.pom
Downloaded: http://repository.apache.org/snapshots/org/apache/neethi/neethi/3.0.3-SNAPSHOT/neethi-3.0.3-20120501.203245-71.pom
(14 KB at 43.0 KB/sec)
Downloading: http://shibboleth.internet2.edu/downloads/maven2/org/apache/woden/woden-api/1.0-SNAPSHOT/maven-metadata.xml
Downloading: http://repository.apache.org/snapshots/org/apache/woden/woden-api/1.0-SNAPSHOT/maven-metadata.xml
Downloaded: http://repository.apache.org/snapshots/org/apache/woden/woden-api/1.0-SNAPSHOT/maven-metadata.xml
(775 B at 0.9 KB/sec)
Downloading: http://repository.apache.org/snapshots/org/apache/woden/woden-api/1.0-SNAPSHOT/woden-api-1.0-20120402.023555-405.pom
Downloaded: http://repository.apache.org/snapshots/org/apache/woden/woden-api/1.0-SNAPSHOT/woden-api-1.0-20120402.023555-405.pom
(3 KB at 15.2 KB/sec)
Downloading: http://repository.apache.org/snapshots/org/apache/woden/woden/1.0-SNAPSHOT/maven-metadata.xml
Downloading: http://shibboleth.internet2.edu/downloads/maven2/org/apache/woden/woden/1.0-SNAPSHOT/maven-metadata.xml
Downloaded: http://repository.apache.org/snapshots/org/apache/woden/woden/1.0-SNAPSHOT/maven-metadata.xml
(598 B at 0.8 KB/sec)
Downloading: http://repository.apache.org/snapshots/org/apache/woden/woden/1.0-SNAPSHOT/woden-1.0-20120402.023554-405.pom
Downloaded: http://repository.apache.org/snapshots/org/apache/woden/woden/1.0-SNAPSHOT/woden-1.0-20120402.023554-405.pom
(14 KB at 81.9 KB/sec)
Downloading: http://repository.apache.org/snapshots/org/apache/woden/woden-impl-dom/1.0-SNAPSHOT/maven-metadata.xml
Downloading: http://shibboleth.internet2.edu/downloads/maven2/org/apache/woden/woden-impl-dom/1.0-SNAPSHOT/maven-metadata.xml
Downloaded: http://repository.apache.org/snapshots/org/apache/woden/woden-impl-dom/1.0-SNAPSHOT/maven-metadata.xml
(780 B at 1.3 KB/sec)
Downloading: http://repository.apache.org/snapshots/org/apache/woden/woden-impl-dom/1.0-SNAPSHOT/woden-impl-dom-1.0-20120402.023557-405.pom
Downloaded: http://repository.apache.org/snapshots/org/apache/woden/woden-impl-dom/1.0-SNAPSHOT/woden-impl-dom-1.0-20120402.023557-405.pom
(5 KB at 22.4 KB/sec)
Downloading: http://repository.apache.org/snapshots/org/apache/woden/woden-impl-commons/1.0-SNAPSHOT/maven-metadata.xml
Downloading: http://shibboleth.internet2.edu/downloads/maven2/org/apache/woden/woden-impl-commons/1.0-SNAPSHOT/maven-metadata.xml
Downloaded: http://repository.apache.org/snapshots/org/apache/woden/woden-impl-commons/1.0-SNAPSHOT/maven-metadata.xml
(784 B at 1.4 KB/sec)
Downloading: http://repository.apache.org/snapshots/org/apache/woden/woden-impl-commons/1.0-SNAPSHOT/woden-impl-commons-1.0-20120402.023557-405.pom
Downloaded: http://repository.apache.org/snapshots/org/apache/woden/woden-impl-commons/1.0-SNAPSHOT/woden-impl-commons-1.0-20120402.023557-405.pom
(5 KB at 22.3 KB/sec)
Downloading: http://shibboleth.internet2.edu/downloads/maven2/org/apache/axis2/axis2-mtompolicy/1.7.0-SNAPSHOT/maven-metadata.xml
Downloading: http://repository.apache.org/snapshots/org/apache/axis2/axis2-mtompolicy/1.7.0-SNAPSHOT/maven-metadata.xml
Downloaded: http://repository.apache.org/snapshots/org/apache/axis2/axis2-mtompolicy/1.7.0-SNAPSHOT/maven-metadata.xml
(370 B at 0.6 KB/sec)
Downloading: http://repository.apache.org/snapshots/org/apache/axis2/axis2-mtompolicy/1.7.0-SNAPSHOT/axis2-mtompolicy-1.7.0-20120501.221002-650.pom
Downloaded: http://repository.apache.org/snapshots/org/apache/axis2/axis2-mtompolicy/1.7.0-SNAPSHOT/axis2-mtompolicy-1.7.0-20120501.221002-650.pom
(4 KB at 12.6 KB/sec)
Downloading: http://shibboleth.internet2.edu/downloads/maven2/org/apache/axis2/addressing/1.7.0-SNAPSHOT/maven-metadata.xml
Downloading: http://repository.apache.org/snapshots/org/apache/axis2/addressing/1.7.0-SNAPSHOT/maven-metadata.xml
Downloaded: http://repository.apache.org/snapshots/org/apache/axis2/addressing/1.7.0-SNAPSHOT/maven-metadata.xml
(364 B at 1.0 KB/sec)
Downloading: http://repository.apache.org/snapshots/org/apache/axis2/addressing/1.7.0-SNAPSHOT/addressing-1.7.0-20120501.221002-697.pom
Downloaded: http://repository.apache.org/snapshots/org/apache/axis2/addressing/1.7.0-SNAPSHOT/addressing-1.7.0-20120501.221002-697.pom
(5 KB at 11.4 KB/sec)
mojoFailed org.apache.maven.plugins:maven-remote-resources-plugin:1.1(default)
projectFailed org.apache.rampart:rampart-project:1.7.0-SNAPSHOT
sessionEnded
[INFO] ------------------------------------------------------------------------
[INFO] Reactor Summary:
[INFO] 
[INFO] Apache Rampart .................................... FAILURE [5:34.059s]
[INFO] Rampart - Policy .................................. SKIPPED
[INFO] Rampart - Trust ................................... SKIPPED
[INFO] Rampart - Core .................................... SKIPPED
[INFO] Rampart - Test Suite .............................. SKIPPED
[INFO] Rampart - Mar ..................................... SKIPPED
[INFO] Rampart - Trust-Mar ............................... SKIPPED
[INFO] Rampart - Integration ............................. SKIPPED
[INFO] Rampart - Samples ................................. SKIPPED
[INFO] Rampart - Documentation ........................... SKIPPED
[INFO] Rampart - Distribution ............................ SKIPPED
[INFO] ------------------------------------------------------------------------
[INFO] BUILD FAILURE
[INFO] ------------------------------------------------------------------------
[INFO] Total time: 5:36.886s
[INFO] Finished at: Tue May 01 22:59:01 UTC 2012
[INFO] Final Memory: 8M/70M
[INFO] ------------------------------------------------------------------------
Projects to build: [MavenProject: org.apache.rampart:rampart-project:1.7.0-SNAPSHOT @ <https://builds.apache.org/job/Rampart/ws/trunk/pom.xml,>
MavenProject: org.apache.rampart:rampart-policy:1.7.0-SNAPSHOT @ <https://builds.apache.org/job/Rampart/ws/trunk/modules/rampart-policy/pom.xml,>
MavenProject: org.apache.rampart:rampart-trust:1.7.0-SNAPSHOT @ <https://builds.apache.org/job/Rampart/ws/trunk/modules/rampart-trust/pom.xml,>
MavenProject: org.apache.rampart:rampart-core:1.7.0-SNAPSHOT @ <https://builds.apache.org/job/Rampart/ws/trunk/modules/rampart-core/pom.xml,>
MavenProject: org.apache.rampart:rampart-tests:1.7.0-SNAPSHOT @ <https://builds.apache.org/job/Rampart/ws/trunk/modules/rampart-tests/pom.xml,>
MavenProject: org.apache.rampart:rampart:1.7.0-SNAPSHOT @ <https://builds.apache.org/job/Rampart/ws/trunk/modules/rampart-mar/pom.xml,>
MavenProject: org.apache.rampart:rahas:1.7.0-SNAPSHOT @ <https://builds.apache.org/job/Rampart/ws/trunk/modules/rampart-trust-mar/pom.xml,>
MavenProject: org.apache.rampart:rampart-integration:1.7.0-SNAPSHOT @ <https://builds.apache.org/job/Rampart/ws/trunk/modules/rampart-integration/pom.xml,>
MavenProject: org.apache.rampart:rampart-sample:1.7.0-SNAPSHOT @ <https://builds.apache.org/job/Rampart/ws/trunk/modules/rampart-samples/pom.xml,>
MavenProject: org.apache.rampart:rampart-documentation:1.7.0-SNAPSHOT @ <https://builds.apache.org/job/Rampart/ws/trunk/modules/documentation/pom.xml,>
MavenProject: org.apache.rampart:rampart-dist:1.7.0-SNAPSHOT @ <https://builds.apache.org/job/Rampart/ws/trunk/modules/distribution/pom.xml]>
[JENKINS] Archiving <https://builds.apache.org/job/Rampart/ws/trunk/modules/rampart-core/pom.xml>
to /home/hudson/hudson/jobs/Rampart/modules/org.apache.rampart$rampart-core/builds/2012-05-01_22-51-56/archive/org.apache.rampart/rampart-core/1.7.0-SNAPSHOT/rampart-core-1.7.0-SNAPSHOT.pom
[JENKINS] Archiving <https://builds.apache.org/job/Rampart/ws/trunk/modules/rampart-tests/pom.xml>
to /home/hudson/hudson/jobs/Rampart/modules/org.apache.rampart$rampart-tests/builds/2012-05-01_22-51-56/archive/org.apache.rampart/rampart-tests/1.7.0-SNAPSHOT/rampart-tests-1.7.0-SNAPSHOT.pom
[JENKINS] Archiving <https://builds.apache.org/job/Rampart/ws/trunk/modules/documentation/pom.xml>
to /home/hudson/hudson/jobs/Rampart/modules/org.apache.rampart$rampart-documentation/builds/2012-05-01_22-51-57/archive/org.apache.rampart/rampart-documentation/1.7.0-SNAPSHOT/rampart-documentation-1.7.0-SNAPSHOT.pom
[JENKINS] Archiving <https://builds.apache.org/job/Rampart/ws/trunk/pom.xml> to /home/hudson/hudson/jobs/Rampart/modules/org.apache.rampart$rampart-project/builds/2012-05-01_22-51-54/archive/org.apache.rampart/rampart-project/1.7.0-SNAPSHOT/rampart-project-1.7.0-SNAPSHOT.pom
[JENKINS] Archiving <https://builds.apache.org/job/Rampart/ws/trunk/modules/rampart-trust-mar/pom.xml>
to /home/hudson/hudson/jobs/Rampart/modules/org.apache.rampart$rahas/builds/2012-05-01_22-51-57/archive/org.apache.rampart/rahas/1.7.0-SNAPSHOT/rahas-1.7.0-SNAPSHOT.pom
[JENKINS] Archiving <https://builds.apache.org/job/Rampart/ws/trunk/modules/rampart-integration/pom.xml>
to /home/hudson/hudson/jobs/Rampart/modules/org.apache.rampart$rampart-integration/builds/2012-05-01_22-51-57/archive/org.apache.rampart/rampart-integration/1.7.0-SNAPSHOT/rampart-integration-1.7.0-SNAPSHOT.pom
[JENKINS] Archiving <https://builds.apache.org/job/Rampart/ws/trunk/modules/rampart-samples/pom.xml>
to /home/hudson/hudson/jobs/Rampart/modules/org.apache.rampart$rampart-sample/builds/2012-05-01_22-51-57/archive/org.apache.rampart/rampart-sample/1.7.0-SNAPSHOT/rampart-sample-1.7.0-SNAPSHOT.pom
[JENKINS] Archiving <https://builds.apache.org/job/Rampart/ws/trunk/modules/rampart-mar/pom.xml>
to /home/hudson/hudson/jobs/Rampart/modules/org.apache.rampart$rampart/builds/2012-05-01_22-51-56/archive/org.apache.rampart/rampart/1.7.0-SNAPSHOT/rampart-1.7.0-SNAPSHOT.pom
[JENKINS] Archiving <https://builds.apache.org/job/Rampart/ws/trunk/modules/rampart-policy/pom.xml>
to /home/hudson/hudson/jobs/Rampart/modules/org.apache.rampart$rampart-policy/builds/2012-05-01_22-51-55/archive/org.apache.rampart/rampart-policy/1.7.0-SNAPSHOT/rampart-policy-1.7.0-SNAPSHOT.pom
[JENKINS] Archiving <https://builds.apache.org/job/Rampart/ws/trunk/modules/rampart-trust/pom.xml>
to /home/hudson/hudson/jobs/Rampart/modules/org.apache.rampart$rampart-trust/builds/2012-05-01_22-51-55/archive/org.apache.rampart/rampart-trust/1.7.0-SNAPSHOT/rampart-trust-1.7.0-SNAPSHOT.pom
[JENKINS] Archiving <https://builds.apache.org/job/Rampart/ws/trunk/modules/distribution/pom.xml>
to /home/hudson/hudson/jobs/Rampart/modules/org.apache.rampart$rampart-dist/builds/2012-05-01_22-51-58/archive/org.apache.rampart/rampart-dist/1.7.0-SNAPSHOT/rampart-dist-1.7.0-SNAPSHOT.pom
Waiting for Jenkins to finish collecting data
mavenExecutionResult exceptions not empty
message : Failed to execute goal org.apache.maven.plugins:maven-remote-resources-plugin:1.1:process
(default) on project rampart-project: Failed to resolve dependencies for one or more projects
in the reactor. Reason: Unable to get dependency information for org.apache.axis2:axis2-kernel:jar:1.7.0-SNAPSHOT:
Failed to retrieve POM for org.apache.axis2:axis2-kernel:jar:1.7.0-SNAPSHOT: Could not transfer
artifact org.apache.axis2:axis2-kernel:pom:1.7.0-SNAPSHOT from/to Nexus (http://repository.apache.org/snapshots):
Error transferring file: Connection timed out
  org.apache.axis2:axis2-kernel:jar:1.7.0-SNAPSHOT

from the specified remote repositories:
  open-saml (http://shibboleth.internet2.edu/downloads/maven2/, releases=true, snapshots=true),
  Nexus (http://repository.apache.org/snapshots, releases=false, snapshots=true),
  central (http://repo1.maven.org/maven2, releases=true, snapshots=false)
Path to dependency: 
	1) org.apache.rampart:rampart-project:pom:1.7.0-SNAPSHOT


cause : Failed to resolve dependencies for one or more projects in the reactor. Reason: Unable
to get dependency information for org.apache.axis2:axis2-kernel:jar:1.7.0-SNAPSHOT: Failed
to retrieve POM for org.apache.axis2:axis2-kernel:jar:1.7.0-SNAPSHOT: Could not transfer artifact
org.apache.axis2:axis2-kernel:pom:1.7.0-SNAPSHOT from/to Nexus (http://repository.apache.org/snapshots):
Error transferring file: Connection timed out
  org.apache.axis2:axis2-kernel:jar:1.7.0-SNAPSHOT

from the specified remote repositories:
  open-saml (http://shibboleth.internet2.edu/downloads/maven2/, releases=true, snapshots=true),
  Nexus (http://repository.apache.org/snapshots, releases=false, snapshots=true),
  central (http://repo1.maven.org/maven2, releases=true, snapshots=false)
Path to dependency: 
	1) org.apache.rampart:rampart-project:pom:1.7.0-SNAPSHOT


Stack trace : 
org.apache.maven.lifecycle.LifecycleExecutionException: Failed to execute goal org.apache.maven.plugins:maven-remote-resources-plugin:1.1:process
(default) on project rampart-project: Failed to resolve dependencies for one or more projects
in the reactor. Reason: Unable to get dependency information for org.apache.axis2:axis2-kernel:jar:1.7.0-SNAPSHOT:
Failed to retrieve POM for org.apache.axis2:axis2-kernel:jar:1.7.0-SNAPSHOT: Could not transfer
artifact org.apache.axis2:axis2-kernel:pom:1.7.0-SNAPSHOT from/to Nexus (http://repository.apache.org/snapshots):
Error transferring file: Connection timed out
  org.apache.axis2:axis2-kernel:jar:1.7.0-SNAPSHOT

from the specified remote repositories:
  open-saml (http://shibboleth.internet2.edu/downloads/maven2/, releases=true, snapshots=true),
  Nexus (http://repository.apache.org/snapshots, releases=false, snapshots=true),
  central (http://repo1.maven.org/maven2, releases=true, snapshots=false)
Path to dependency: 
	1) org.apache.rampart:rampart-project:pom:1.7.0-SNAPSHOT


	at org.apache.maven.lifecycle.internal.MojoExecutor.execute(MojoExecutor.java:217)
	at org.apache.maven.lifecycle.internal.MojoExecutor.execute(MojoExecutor.java:153)
	at org.apache.maven.lifecycle.internal.MojoExecutor.execute(MojoExecutor.java:145)
	at org.apache.maven.lifecycle.internal.LifecycleModuleBuilder.buildProject(LifecycleModuleBuilder.java:84)
	at org.apache.maven.lifecycle.internal.LifecycleModuleBuilder.buildProject(LifecycleModuleBuilder.java:59)
	at org.apache.maven.lifecycle.internal.LifecycleStarter.singleThreadedBuild(LifecycleStarter.java:183)
	at org.apache.maven.lifecycle.internal.LifecycleStarter.execute(LifecycleStarter.java:161)
	at org.apache.maven.DefaultMaven.doExecute(DefaultMaven.java:319)
	at org.apache.maven.DefaultMaven.execute(DefaultMaven.java:156)
	at org.jvnet.hudson.maven3.launcher.Maven3Launcher.main(Maven3Launcher.java:79)
	at sun.reflect.NativeMethodAccessorImpl.invoke0(Native Method)
	at sun.reflect.NativeMethodAccessorImpl.invoke(NativeMethodAccessorImpl.java:39)
	at sun.reflect.DelegatingMethodAccessorImpl.invoke(DelegatingMethodAccessorImpl.java:25)
	at java.lang.reflect.Method.invoke(Method.java:597)
	at org.codehaus.plexus.classworlds.launcher.Launcher.launchStandard(Launcher.java:329)
	at org.codehaus.plexus.classworlds.launcher.Launcher.launch(Launcher.java:239)
	at org.jvnet.hudson.maven3.agent.Maven3Main.launch(Maven3Main.java:158)
	at hudson.maven.Maven3Builder.call(Maven3Builder.java:98)
	at hudson.maven.Maven3Builder.call(Maven3Builder.java:64)
	at hudson.remoting.UserRequest.perform(UserRequest.java:118)
	at hudson.remoting.UserRequest.perform(UserRequest.java:48)
	at hudson.remoting.Request$2.run(Request.java:287)
	at hudson.remoting.InterceptingExecutorService$1.call(InterceptingExecutorService.java:72)
	at java.util.concurrent.FutureTask$Sync.innerRun(FutureTask.java:303)
	at java.util.concurrent.FutureTask.run(FutureTask.java:138)
	at java.util.concurrent.ThreadPoolExecutor$Worker.runTask(ThreadPoolExecutor.java:886)
	at java.util.concurrent.ThreadPoolExecutor$Worker.run(ThreadPoolExecutor.java:908)
	at java.lang.Thread.run(Thread.java:662)
Caused by: org.apache.maven.plugin.MojoExecutionException: Failed to resolve dependencies
for one or more projects in the reactor. Reason: Unable to get dependency information for
org.apache.axis2:axis2-kernel:jar:1.7.0-SNAPSHOT: Failed to retrieve POM for org.apache.axis2:axis2-kernel:jar:1.7.0-SNAPSHOT:
Could not transfer artifact org.apache.axis2:axis2-kernel:pom:1.7.0-SNAPSHOT from/to Nexus
(http://repository.apache.org/snapshots): Error transferring file: Connection timed out
  org.apache.axis2:axis2-kernel:jar:1.7.0-SNAPSHOT

from the specified remote repositories:
  open-saml (http://shibboleth.internet2.edu/downloads/maven2/, releases=true, snapshots=true),
  Nexus (http://repository.apache.org/snapshots, releases=false, snapshots=true),
  central (http://repo1.maven.org/maven2, releases=true, snapshots=false)
Path to dependency: 
	1) org.apache.rampart:rampart-project:pom:1.7.0-SNAPSHOT


	at org.apache.maven.plugin.resources.remote.ProcessRemoteResourcesMojo.resolveProjectArtifacts(ProcessRemoteResourcesMojo.java:702)
	at org.apache.maven.plugin.resources.remote.ProcessRemoteResourcesMojo.getProjects(ProcessRemoteResourcesMojo.java:602)
	at org.apache.maven.plugin.resources.remote.ProcessRemoteResourcesMojo.configureVelocityContext(ProcessRemoteResourcesMojo.java:969)
	at org.apache.maven.plugin.resources.remote.ProcessRemoteResourcesMojo.execute(ProcessRemoteResourcesMojo.java:492)
	at org.apache.maven.plugin.DefaultBuildPluginManager.executeMojo(DefaultBuildPluginManager.java:101)
	at org.apache.maven.lifecycle.internal.MojoExecutor.execute(MojoExecutor.java:209)
	... 27 more
Caused by: org.apache.maven.artifact.resolver.ArtifactResolutionException: Unable to get dependency
information for org.apache.axis2:axis2-kernel:jar:1.7.0-SNAPSHOT: Failed to retrieve POM for
org.apache.axis2:axis2-kernel:jar:1.7.0-SNAPSHOT: Could not transfer artifact org.apache.axis2:axis2-kernel:pom:1.7.0-SNAPSHOT
from/to Nexus (http://repository.apache.org/snapshots): Error transferring file: Connection
timed out
  org.apache.axis2:axis2-kernel:jar:1.7.0-SNAPSHOT

from the specified remote repositories:
  open-saml (http://shibboleth.internet2.edu/downloads/maven2/, releases=true, snapshots=true),
  Nexus (http://repository.apache.org/snapshots, releases=false, snapshots=true),
  central (http://repo1.maven.org/maven2, releases=true, snapshots=false)
Path to dependency: 
	1) org.apache.rampart:rampart-project:pom:1.7.0-SNAPSHOT


	at org.apache.maven.repository.legacy.resolver.DefaultLegacyArtifactCollector.recurse(DefaultLegacyArtifactCollector.java:576)
	at org.apache.maven.repository.legacy.resolver.DefaultLegacyArtifactCollector.collect(DefaultLegacyArtifactCollector.java:144)
	at org.apache.maven.artifact.resolver.DefaultArtifactResolver.resolve(DefaultArtifactResolver.java:464)
	at org.apache.maven.artifact.resolver.DefaultArtifactResolver.resolveWithExceptions(DefaultArtifactResolver.java:320)
	at org.apache.maven.artifact.resolver.DefaultArtifactResolver.resolveTransitively(DefaultArtifactResolver.java:314)
	at org.apache.maven.artifact.resolver.DefaultArtifactResolver.resolveTransitively(DefaultArtifactResolver.java:293)
	at org.apache.maven.artifact.resolver.DefaultArtifactResolver.resolveTransitively(DefaultArtifactResolver.java:271)
	at org.apache.maven.shared.artifact.resolver.DefaultProjectDependenciesResolver.resolve(DefaultProjectDependenciesResolver.java:140)
	at org.apache.maven.shared.artifact.resolver.DefaultProjectDependenciesResolver.resolve(DefaultProjectDependenciesResolver.java:187)
	at org.apache.maven.plugin.resources.remote.ProcessRemoteResourcesMojo.resolveProjectArtifacts(ProcessRemoteResourcesMojo.java:697)
	... 32 more
Caused by: org.apache.maven.artifact.metadata.ArtifactMetadataRetrievalException: Failed to
retrieve POM for org.apache.axis2:axis2-kernel:jar:1.7.0-SNAPSHOT: Could not transfer artifact
org.apache.axis2:axis2-kernel:pom:1.7.0-SNAPSHOT from/to Nexus (http://repository.apache.org/snapshots):
Error transferring file: Connection timed out
	at org.apache.maven.project.artifact.MavenMetadataSource.retrieveRelocatedProject(MavenMetadataSource.java:600)
	at org.apache.maven.project.artifact.MavenMetadataSource.retrieve(MavenMetadataSource.java:192)
	at org.apache.maven.repository.legacy.resolver.DefaultLegacyArtifactCollector.recurse(DefaultLegacyArtifactCollector.java:532)
	... 41 more
Caused by: org.sonatype.aether.resolution.ArtifactResolutionException: Could not transfer
artifact org.apache.axis2:axis2-kernel:pom:1.7.0-SNAPSHOT from/to Nexus (http://repository.apache.org/snapshots):
Error transferring file: Connection timed out
	at org.sonatype.aether.impl.internal.DefaultArtifactResolver.resolve(DefaultArtifactResolver.java:541)
	at org.sonatype.aether.impl.internal.DefaultArtifactResolver.resolveArtifacts(DefaultArtifactResolver.java:220)
	at org.sonatype.aether.impl.internal.DefaultArtifactResolver.resolveArtifact(DefaultArtifactResolver.java:197)
	at org.sonatype.aether.impl.internal.DefaultRepositorySystem.resolveArtifact(DefaultRepositorySystem.java:323)
	at org.apache.maven.project.DefaultProjectBuilder.build(DefaultProjectBuilder.java:261)
	at org.apache.maven.project.DefaultProjectBuilder.build(DefaultProjectBuilder.java:243)
	at org.apache.maven.project.artifact.MavenMetadataSource.retrieveRelocatedProject(MavenMetadataSource.java:579)
	... 43 more
Caused by: org.sonatype.aether.transfer.ArtifactTransferException: Could not transfer artifact
org.apache.axis2:axis2-kernel:pom:1.7.0-SNAPSHOT from/to Nexus (http://repository.apache.org/snapshots):
Error transferring file: Connection timed out
	at org.sonatype.aether.connector.wagon.WagonRepositoryConnector$4.wrap(WagonRepositoryConnector.java:949)
	at org.sonatype.aether.connector.wagon.WagonRepositoryConnector$4.wrap(WagonRepositoryConnector.java:940)
	at org.sonatype.aether.connector.wagon.WagonRepositoryConnector$GetTask.flush(WagonRepositoryConnector.java:695)
	at org.sonatype.aether.connector.wagon.WagonRepositoryConnector$GetTask.flush(WagonRepositoryConnector.java:689)
	at org.sonatype.aether.connector.wagon.WagonRepositoryConnector.get(WagonRepositoryConnector.java:445)
	at org.sonatype.aether.impl.internal.DefaultArtifactResolver.resolve(DefaultArtifactResolver.java:460)
	... 49 more
Caused by: org.apache.maven.wagon.TransferFailedException: Error transferring file: Connection
timed out
	at org.apache.maven.wagon.providers.http.LightweightHttpWagon.fillInputData(LightweightHttpWagon.java:143)
	at org.apache.maven.wagon.StreamWagon.getInputStream(StreamWagon.java:116)
	at org.apache.maven.wagon.StreamWagon.getIfNewer(StreamWagon.java:88)
	at org.apache.maven.wagon.StreamWagon.get(StreamWagon.java:61)
	at org.sonatype.aether.connector.wagon.WagonRepositoryConnector$GetTask.run(WagonRepositoryConnector.java:608)
	at org.sonatype.aether.util.concurrency.RunnableErrorForwarder$1.run(RunnableErrorForwarder.java:64)
	... 3 more
Caused by: java.net.ConnectException: Connection timed out
	at java.net.PlainSocketImpl.socketConnect(Native Method)
	at java.net.PlainSocketImpl.doConnect(PlainSocketImpl.java:351)
	at java.net.PlainSocketImpl.connectToAddress(PlainSocketImpl.java:213)
	at java.net.PlainSocketImpl.connect(PlainSocketImpl.java:200)
	at java.net.SocksSocketImpl.connect(SocksSocketImpl.java:366)
	at java.net.Socket.connect(Socket.java:529)
	at java.net.Socket.connect(Socket.java:478)
	at sun.net.NetworkClient.doConnect(NetworkClient.java:163)
	at sun.net.www.http.HttpClient.openServer(HttpClient.java:395)
	at sun.net.www.http.HttpClient.openServer(HttpClient.java:530)
	at sun.net.www.http.HttpClient.<init>(HttpClient.java:234)
	at sun.net.www.http.HttpClient.New(HttpClient.java:307)
	at sun.net.www.http.HttpClient.New(HttpClient.java:324)
	at sun.net.www.protocol.http.HttpURLConnection.getNewHttpClient(HttpURLConnection.java:970)
	at sun.net.www.protocol.http.HttpURLConnection.plainConnect(HttpURLConnection.java:911)
	at sun.net.www.protocol.http.HttpURLConnection.connect(HttpURLConnection.java:836)
	at sun.net.www.protocol.http.HttpURLConnection.getInputStream(HttpURLConnection.java:1172)
	at java.net.HttpURLConnection.getResponseCode(HttpURLConnection.java:379)
	at org.apache.maven.wagon.providers.http.LightweightHttpWagon.fillInputData(LightweightHttpWagon.java:115)
	... 8 more
channel stopped
[locks-and-latches] Releasing all the locks
[locks-and-latches] All the locks released

---------------------------------------------------------------------
To unsubscribe, e-mail: java-dev-unsubscribe@axis.apache.org
For additional commands, e-mail: java-dev-help@axis.apache.org


Mime
View raw message