axis-java-dev mailing list archives

Site index · List index
Message view « Date » · « Thread »
Top « Date » · « Thread »
From Apache Jenkins Server <jenk...@builds.apache.org>
Subject Build failed in Jenkins: rampart-1.6 #238
Date Mon, 23 Apr 2012 07:30:50 GMT
See <https://builds.apache.org/job/rampart-1.6/238/changes>

Changes:

[sagara] Set 1.6.2 as Axis2 version.

------------------------------------------
Started by an SCM change
Building remotely on ubuntu5 in workspace <https://builds.apache.org/job/rampart-1.6/ws/>
Updating http://svn.apache.org/repos/asf/axis/axis2/java/rampart/branches/1_6
U         modules/rampart-samples/policy/sample01/src/org/apache/rampart/samples/policy/sample01/PWCBHandler.java
U         modules/rampart-samples/policy/sample02/src/org/apache/rampart/samples/policy/sample02/PWCBHandler.java
U         modules/rampart-samples/policy/sample03/src/org/apache/rampart/samples/policy/sample03/PWCBHandler.java
U         modules/rampart-samples/policy/sample04/src/org/apache/rampart/samples/policy/sample04/PWCBHandler.java
U         modules/rampart-samples/policy/sample-tomcat/src/org/apache/rampart/tomcat/sample/PWCBHandler.java
U         modules/rampart-samples/policy/sample05/src/org/apache/rampart/samples/policy/sample05/PWCBHandler.java
U         modules/rampart-samples/policy/sample05/src/org/apache/rampart/samples/policy/sample05/Client.java
U         modules/rampart-samples/policy/sample06/src/org/apache/rampart/samples/policy/sample06/PWCBHandler.java
U         modules/rampart-samples/policy/sample06/src/org/apache/rampart/samples/policy/sample06/Client.java
U         modules/rampart-samples/policy/sample07/src/org/apache/rampart/samples/policy/sample07/PWCBHandler.java
U         modules/rampart-samples/policy/sample08/src/org/apache/rampart/samples/policy/sample08/PWCBHandler.java
U         modules/rampart-samples/policy/sample08/src/org/apache/rampart/samples/policy/sample08/Client.java
U         modules/rampart-samples/basic/sample10/src/org/apache/rampart/samples/sample10/PWCBHandler.java
U         modules/rampart-samples/basic/sample02/src/org/apache/rampart/samples/sample02/PWCBHandler.java
U         modules/rampart-samples/basic/sample11/src/org/apache/rampart/samples/sample11/PWCBHandler.java
U         modules/rampart-samples/basic/sample11/src/org/apache/rampart/samples/sample11/Client.java
U         modules/rampart-samples/basic/sample03/src/org/apache/rampart/samples/sample03/PWCBHandler.java
U         modules/rampart-samples/basic/sample04/src/org/apache/rampart/samples/sample04/PWCBHandler.java
U         modules/rampart-samples/basic/sample05/src/org/apache/rampart/samples/sample05/PWCBHandler.java
U         modules/rampart-samples/basic/sample06/src/org/apache/rampart/samples/sample06/PWCBHandler.java
U         modules/rampart-samples/basic/sample07/src/org/apache/rampart/samples/sample07/PWCBHandler.java
U         modules/rampart-samples/basic/sample08/src/org/apache/rampart/samples/sample08/PWCBHandler.java
A         modules/rampart-samples/pom.xml
U         pom.xml
 U        .
At revision 1329102
[rampart-1.6] $ /bin/bash -xe /tmp/hudson7412784365551271878.sh
+ '[' -d <https://builds.apache.org/job/rampart-1.6/ws/.repository> ']'
++ find <https://builds.apache.org/job/rampart-1.6/ws/.repository> -type d -and -name
'*-SNAPSHOT'
+ rm -rf <https://builds.apache.org/job/rampart-1.6/ws/.repository/org/apache/axis2/axis2-transport-local/1.6.2-SNAPSHOT>
<https://builds.apache.org/job/rampart-1.6/ws/.repository/org/apache/axis2/addressing/1.6.2-SNAPSHOT>
<https://builds.apache.org/job/rampart-1.6/ws/.repository/org/apache/axis2/axis2-parent/1.6.2-SNAPSHOT>
<https://builds.apache.org/job/rampart-1.6/ws/.repository/org/apache/axis2/axis2-adb/1.6.2-SNAPSHOT>
<https://builds.apache.org/job/rampart-1.6/ws/.repository/org/apache/axis2/axis2-mtompolicy/1.6.2-SNAPSHOT>
<https://builds.apache.org/job/rampart-1.6/ws/.repository/org/apache/axis2/mex/1.6.2-SNAPSHOT>
<https://builds.apache.org/job/rampart-1.6/ws/.repository/org/apache/axis2/axis2-codegen/1.6.2-SNAPSHOT>
<https://builds.apache.org/job/rampart-1.6/ws/.repository/org/apache/axis2/axis2-transport-http/1.6.2-SNAPSHOT>
<https://builds.apache.org/job/rampart-1.6/ws/.repository/org/apache/axis2/axis2-kernel/1.6.2-SNAPSHOT>
<https://builds.apache.org/job/rampart-1.6/ws/.repository/org/apache/axis2/axis2-xmlbeans/1.6.2-SNAPSHOT>
<https://builds.apache.org/job/rampart-1.6/ws/.repository/org/apache/axis2/axis2-adb-codegen/1.6.2-SNAPSHOT>
<https://builds.apache.org/job/rampart-1.6/ws/.repository/org/apache/rampart/rampart-documentation/1.6.2-SNAPSHOT>
<https://builds.apache.org/job/rampart-1.6/ws/.repository/org/apache/rampart/rampart-project/1.6.2-SNAPSHOT>
<https://builds.apache.org/job/rampart-1.6/ws/.repository/org/apache/rampart/rampart-trust/1.6.2-SNAPSHOT>
<https://builds.apache.org/job/rampart-1.6/ws/.repository/org/apache/rampart/rampart-policy/1.6.2-SNAPSHOT>
<https://builds.apache.org/job/rampart-1.6/ws/.repository/org/apache/rampart/rahas/1.6.2-SNAPSHOT>
<https://builds.apache.org/job/rampart-1.6/ws/.repository/org/apache/rampart/rampart-tests/1.6.2-SNAPSHOT>
<https://builds.apache.org/job/rampart-1.6/ws/.repository/org/apache/rampart/rampart/1.6.2-SNAPSHOT>
<https://builds.apache.org/job/rampart-1.6/ws/.repository/org/apache/rampart/rampart-core/1.6.2-SNAPSHOT>
<https://builds.apache.org/job/rampart-1.6/ws/.repository/org/apache/rampart/rampart-integration/1.6.2-SNAPSHOT>
<https://builds.apache.org/job/rampart-1.6/ws/.repository/org/apache/rampart/rampart-dist/1.6.2-SNAPSHOT>
[locks-and-latches] Checking to see if we really have the locks
[locks-and-latches] Have all the locks, build can start
Parsing POMs
[locks-and-latches] Releasing all the locks
[locks-and-latches] All the locks released
ERROR: Failed to parse POMs
hudson.util.IOException2: remote file operation failed: <https://builds.apache.org/job/rampart-1.6/ws/rampart>
at hudson.remoting.Channel@5e83a52:ubuntu5
	at hudson.FilePath.act(FilePath.java:828)
	at hudson.FilePath.act(FilePath.java:814)
	at hudson.maven.MavenModuleSetBuild$RunnerImpl.parsePoms(MavenModuleSetBuild.java:912)
	at hudson.maven.MavenModuleSetBuild$RunnerImpl.doRun(MavenModuleSetBuild.java:656)
	at hudson.model.AbstractBuild$AbstractRunner.run(AbstractBuild.java:475)
	at hudson.model.Run.run(Run.java:1413)
	at hudson.maven.MavenModuleSetBuild.run(MavenModuleSetBuild.java:479)
	at hudson.model.ResourceController.execute(ResourceController.java:88)
	at hudson.model.Executor.run(Executor.java:238)
Caused by: hudson.remoting.ProxyException: hudson.maven.MavenModuleSetBuild$MavenExecutionException:
org.apache.maven.project.ProjectBuildingException: Some problems were encountered while processing
the POMs:
[FATAL] Non-resolvable parent POM: Could not find artifact org.apache.rampart:rampart-project:pom:1.7.0-SNAPSHOT
and 'parent.relativePath' points at wrong local POM @ line 25, column 13

	at hudson.maven.MavenModuleSetBuild$PomParser.invoke(MavenModuleSetBuild.java:1272)
	at hudson.maven.MavenModuleSetBuild$PomParser.invoke(MavenModuleSetBuild.java:1047)
	at hudson.FilePath$FileCallableWrapper.call(FilePath.java:2154)
	at hudson.remoting.UserRequest.perform(UserRequest.java:118)
	at hudson.remoting.UserRequest.perform(UserRequest.java:48)
	at hudson.remoting.Request$2.run(Request.java:287)
	at hudson.remoting.InterceptingExecutorService$1.call(InterceptingExecutorService.java:72)
	at java.util.concurrent.FutureTask$Sync.innerRun(FutureTask.java:334)
	at java.util.concurrent.FutureTask.run(FutureTask.java:166)
	at java.util.concurrent.ThreadPoolExecutor.runWorker(ThreadPoolExecutor.java:1110)
	at java.util.concurrent.ThreadPoolExecutor$Worker.run(ThreadPoolExecutor.java:603)
	at java.lang.Thread.run(Thread.java:636)
Caused by: hudson.remoting.ProxyException: org.apache.maven.project.ProjectBuildingException:
Some problems were encountered while processing the POMs:
[FATAL] Non-resolvable parent POM: Could not find artifact org.apache.rampart:rampart-project:pom:1.7.0-SNAPSHOT
and 'parent.relativePath' points at wrong local POM @ line 25, column 13

	at org.apache.maven.project.DefaultProjectBuilder.build(DefaultProjectBuilder.java:363)
	at hudson.maven.MavenEmbedder.buildProjects(MavenEmbedder.java:361)
	at hudson.maven.MavenEmbedder.readProjects(MavenEmbedder.java:331)
	at hudson.maven.MavenModuleSetBuild$PomParser.invoke(MavenModuleSetBuild.java:1222)
	... 11 more

---------------------------------------------------------------------
To unsubscribe, e-mail: java-dev-unsubscribe@axis.apache.org
For additional commands, e-mail: java-dev-help@axis.apache.org


Mime
View raw message