axis-java-dev mailing list archives

Site index · List index
Message view « Date » · « Thread »
Top « Date » · « Thread »
From Apache Jenkins Server <jenk...@builds.apache.org>
Subject Build failed in Jenkins: sandesha2-1.4 #132
Date Mon, 09 Apr 2012 15:06:14 GMT
See <https://builds.apache.org/job/sandesha2-1.4/132/changes>

Changes:

[veithen] Switched the Sandesha2 1.4 branch to Axiom 1.2.13.

------------------------------------------
[...truncated 272 lines...]
[INFO] Excluding org.codehaus.woodstox:wstx-asl:jar:3.2.9 from the shaded jar.
[INFO] Excluding org.apache.ws.commons.axiom:axiom-dom:jar:1.2.13 from the shaded jar.
[INFO] Excluding org.apache.geronimo.specs:geronimo-ws-metadata_2.0_spec:jar:1.1.2 from the
shaded jar.
[INFO] Excluding org.apache.geronimo.specs:geronimo-jta_1.1_spec:jar:1.1 from the shaded jar.
[INFO] Excluding javax.servlet:servlet-api:jar:2.3 from the shaded jar.
[INFO] Excluding commons-httpclient:commons-httpclient:jar:3.1 from the shaded jar.
[INFO] Excluding commons-codec:commons-codec:jar:1.2 from the shaded jar.
[INFO] Excluding commons-fileupload:commons-fileupload:jar:1.2 from the shaded jar.
[INFO] Excluding wsdl4j:wsdl4j:jar:1.6.2 from the shaded jar.
[INFO] Excluding org.apache.ws.commons.schema:XmlSchema:jar:1.4.3 from the shaded jar.
[INFO] Excluding org.apache.neethi:neethi:jar:2.0.5 from the shaded jar.
[INFO] Excluding org.apache.woden:woden-api:jar:1.0M8 from the shaded jar.
[INFO] Excluding org.apache.ant:ant:jar:1.7.0 from the shaded jar.
[INFO] Excluding org.apache.ant:ant-launcher:jar:1.7.0 from the shaded jar.
[INFO] Excluding org.apache.woden:woden-impl-dom:jar:1.0M8 from the shaded jar.
[INFO] Excluding xerces:xercesImpl:jar:2.8.1 from the shaded jar.
[INFO] Excluding org.apache.axis2:axis2-adb:jar:1.5.7-SNAPSHOT from the shaded jar.
[INFO] Excluding org.apache.axis2:addressing:mar:1.5.7-SNAPSHOT from the shaded jar.
[INFO] Excluding org.apache.axis2:axis2-mtompolicy:jar:1.5.7-SNAPSHOT from the shaded jar.
[INFO] Replacing original artifact with shaded artifact.
[INFO] Replacing <https://builds.apache.org/job/sandesha2-1.4/ws/sandesha2/modules/client/target/sandesha2-client-constants-1.4.1-SNAPSHOT.jar>
with <https://builds.apache.org/job/sandesha2-1.4/ws/sandesha2/modules/client/target/sandesha2-client-constants-1.4.1-SNAPSHOT-shaded.jar>
[INFO] [apache-rat:check {execution: default}]
[INFO] Exclude: dependency-reduced-pom.xml
[INFO] [install:install {execution: default-install}]
[INFO] Installing <https://builds.apache.org/job/sandesha2-1.4/ws/sandesha2/modules/client/target/sandesha2-client-constants-1.4.1-SNAPSHOT.jar>
to <https://builds.apache.org/job/sandesha2-1.4/ws/.repository/org/apache/sandesha2/sandesha2-client-constants/1.4.1-SNAPSHOT/sandesha2-client-constants-1.4.1-SNAPSHOT.jar>
[JENKINS] Archiving <https://builds.apache.org/job/sandesha2-1.4/ws/sandesha2/modules/client/dependency-reduced-pom.xml>
to /home/hudson/hudson/jobs/sandesha2-1.4/modules/org.apache.sandesha2$sandesha2-client-constants/builds/2012-04-09_15-04-40/archive/org.apache.sandesha2/sandesha2-client-constants/1.4.1-SNAPSHOT/sandesha2-client-constants-1.4.1-SNAPSHOT.pom
[JENKINS] Archiving <https://builds.apache.org/job/sandesha2-1.4/ws/sandesha2/modules/client/target/sandesha2-client-constants-1.4.1-SNAPSHOT.jar>
to /home/hudson/hudson/jobs/sandesha2-1.4/modules/org.apache.sandesha2$sandesha2-client-constants/builds/2012-04-09_15-04-40/archive/org.apache.sandesha2/sandesha2-client-constants/1.4.1-SNAPSHOT/sandesha2-client-constants-1.4.1-SNAPSHOT.jar
[INFO] ------------------------------------------------------------------------
[INFO] Building Sandesha2 - Policy
[INFO]    task-segment: [clean, install]
[INFO] ------------------------------------------------------------------------
[INFO] [clean:clean {execution: default-clean}]
[INFO] Deleting <https://builds.apache.org/job/sandesha2-1.4/ws/sandesha2/modules/policy/target>
[INFO] [remote-resources:process {execution: default}]
[INFO] [resources:resources {execution: default-resources}]
[INFO] Using 'UTF-8' encoding to copy filtered resources.
[INFO] Copying 1 resource
[INFO] Copying 2 resources
[INFO] [compiler:compile {execution: default-compile}]
[INFO] No sources to compile
[INFO] [resources:testResources {execution: default-testResources}]
[INFO] Using 'UTF-8' encoding to copy filtered resources.
[INFO] skip non existing resourceDirectory <https://builds.apache.org/job/sandesha2-1.4/ws/sandesha2/modules/policy/src/test/resources>
[INFO] Copying 2 resources
[INFO] [compiler:testCompile {execution: default-testCompile}]
[INFO] No sources to compile
[INFO] [surefire:test {execution: default-test}]
[INFO] Surefire report directory: <https://builds.apache.org/job/sandesha2-1.4/ws/sandesha2/modules/policy/target/surefire-reports>

-------------------------------------------------------
 T E S T S
-------------------------------------------------------
There are no tests to run.

Results :
Tests run: 0, Failures: 0, Errors: 0, Skipped: 0

[JENKINS] Recording test results
[INFO] [jar:jar {execution: default-jar}]
[INFO] Building jar: <https://builds.apache.org/job/sandesha2-1.4/ws/sandesha2/modules/policy/target/sandesha2-policy-1.4.1-SNAPSHOT.jar>
[INFO] [shade:shade {execution: default}]
[INFO] Including org.apache.sandesha2:sandesha2-core:jar:1.4.1-SNAPSHOT in the shaded jar.
[INFO] Excluding org.apache.axis2:axis2-codegen:jar:1.5.7-SNAPSHOT from the shaded jar.
[INFO] Excluding org.apache.axis2:axis2-kernel:jar:1.5.7-SNAPSHOT from the shaded jar.
[INFO] Excluding org.apache.ws.commons.axiom:axiom-api:jar:1.2.13 from the shaded jar.
[INFO] Excluding org.apache.geronimo.specs:geronimo-activation_1.1_spec:jar:1.1 from the shaded
jar.
[INFO] Excluding org.apache.geronimo.specs:geronimo-javamail_1.4_spec:jar:1.7.1 from the shaded
jar.
[INFO] Excluding commons-logging:commons-logging:jar:1.1.1 from the shaded jar.
[INFO] Excluding jaxen:jaxen:jar:1.1.3 from the shaded jar.
[INFO] Excluding org.apache.geronimo.specs:geronimo-stax-api_1.0_spec:jar:1.0.1 from the shaded
jar.
[INFO] Excluding org.apache.james:apache-mime4j-core:jar:0.7.2 from the shaded jar.
[INFO] Excluding org.apache.ws.commons.axiom:axiom-impl:jar:1.2.13 from the shaded jar.
[INFO] Excluding org.codehaus.woodstox:wstx-asl:jar:3.2.9 from the shaded jar.
[INFO] Excluding org.apache.ws.commons.axiom:axiom-dom:jar:1.2.13 from the shaded jar.
[INFO] Excluding org.apache.geronimo.specs:geronimo-ws-metadata_2.0_spec:jar:1.1.2 from the
shaded jar.
[INFO] Excluding org.apache.geronimo.specs:geronimo-jta_1.1_spec:jar:1.1 from the shaded jar.
[INFO] Excluding javax.servlet:servlet-api:jar:2.3 from the shaded jar.
[INFO] Excluding commons-httpclient:commons-httpclient:jar:3.1 from the shaded jar.
[INFO] Excluding commons-codec:commons-codec:jar:1.2 from the shaded jar.
[INFO] Excluding commons-fileupload:commons-fileupload:jar:1.2 from the shaded jar.
[INFO] Excluding wsdl4j:wsdl4j:jar:1.6.2 from the shaded jar.
[INFO] Excluding org.apache.ws.commons.schema:XmlSchema:jar:1.4.3 from the shaded jar.
[INFO] Excluding org.apache.neethi:neethi:jar:2.0.5 from the shaded jar.
[INFO] Excluding org.apache.woden:woden-api:jar:1.0M8 from the shaded jar.
[INFO] Excluding org.apache.ant:ant:jar:1.7.0 from the shaded jar.
[INFO] Excluding org.apache.ant:ant-launcher:jar:1.7.0 from the shaded jar.
[INFO] Excluding org.apache.woden:woden-impl-dom:jar:1.0M8 from the shaded jar.
[INFO] Excluding xerces:xercesImpl:jar:2.8.1 from the shaded jar.
[INFO] Excluding org.apache.axis2:axis2-adb:jar:1.5.7-SNAPSHOT from the shaded jar.
[INFO] Excluding org.apache.axis2:addressing:mar:1.5.7-SNAPSHOT from the shaded jar.
[INFO] Excluding org.apache.axis2:axis2-mtompolicy:jar:1.5.7-SNAPSHOT from the shaded jar.
[INFO] Replacing original artifact with shaded artifact.
[INFO] Replacing <https://builds.apache.org/job/sandesha2-1.4/ws/sandesha2/modules/policy/target/sandesha2-policy-1.4.1-SNAPSHOT.jar>
with <https://builds.apache.org/job/sandesha2-1.4/ws/sandesha2/modules/policy/target/sandesha2-policy-1.4.1-SNAPSHOT-shaded.jar>
[INFO] [apache-rat:check {execution: default}]
[INFO] Exclude: dependency-reduced-pom.xml
[INFO] [install:install {execution: default-install}]
[INFO] Installing <https://builds.apache.org/job/sandesha2-1.4/ws/sandesha2/modules/policy/target/sandesha2-policy-1.4.1-SNAPSHOT.jar>
to <https://builds.apache.org/job/sandesha2-1.4/ws/.repository/org/apache/sandesha2/sandesha2-policy/1.4.1-SNAPSHOT/sandesha2-policy-1.4.1-SNAPSHOT.jar>
[JENKINS] Archiving <https://builds.apache.org/job/sandesha2-1.4/ws/sandesha2/modules/policy/dependency-reduced-pom.xml>
to /home/hudson/hudson/jobs/sandesha2-1.4/modules/org.apache.sandesha2$sandesha2-policy/builds/2012-04-09_15-04-40/archive/org.apache.sandesha2/sandesha2-policy/1.4.1-SNAPSHOT/sandesha2-policy-1.4.1-SNAPSHOT.pom
[JENKINS] Archiving <https://builds.apache.org/job/sandesha2-1.4/ws/sandesha2/modules/policy/target/sandesha2-policy-1.4.1-SNAPSHOT.jar>
to /home/hudson/hudson/jobs/sandesha2-1.4/modules/org.apache.sandesha2$sandesha2-policy/builds/2012-04-09_15-04-40/archive/org.apache.sandesha2/sandesha2-policy/1.4.1-SNAPSHOT/sandesha2-policy-1.4.1-SNAPSHOT.jar
[INFO] ------------------------------------------------------------------------
[INFO] Building Sandesha2 - Rampart Integration
[INFO]    task-segment: [clean, install]
[INFO] ------------------------------------------------------------------------
[INFO] [clean:clean {execution: default-clean}]
[INFO] Deleting <https://builds.apache.org/job/sandesha2-1.4/ws/sandesha2/modules/rampart-integration/target>
[INFO] [remote-resources:process {execution: default}]
[INFO] snapshot org.apache.rampart:rampart-core:1.5.3-SNAPSHOT: checking for updates from
apache.snapshots
Downloading: http://repository.apache.org/snapshots/org/apache/rampart/rampart-core/1.5.3-SNAPSHOT/rampart-core-1.5.3-20120402.073637-97.pom

[INFO] snapshot org.apache.rampart:rampart-project:1.5.3-SNAPSHOT: checking for updates from
apache.snapshots
Downloading: http://repository.apache.org/snapshots/org/apache/rampart/rampart-project/1.5.3-SNAPSHOT/rampart-project-1.5.3-20120402.073645-97.pom

[INFO] snapshot org.apache.rampart:rampart-policy:1.5.3-SNAPSHOT: checking for updates from
apache.snapshots
Downloading: http://repository.apache.org/snapshots/org/apache/rampart/rampart-policy/1.5.3-SNAPSHOT/rampart-policy-1.5.3-20120402.073644-97.pom

[INFO] snapshot org.apache.axis2:mex:1.5.7-SNAPSHOT: checking for updates from apache.snapshots
Downloading: http://repository.apache.org/snapshots/org/apache/axis2/mex/1.5.7-SNAPSHOT/mex-1.5.7-20120402.023520-145.pom

[INFO] snapshot org.apache.rampart:rampart-trust:1.5.3-SNAPSHOT: checking for updates from
apache.snapshots
Downloading: http://repository.apache.org/snapshots/org/apache/rampart/rampart-trust/1.5.3-SNAPSHOT/rampart-trust-1.5.3-20120402.073647-97.pom

Downloading: http://repository.apache.org/snapshots/org/apache/rampart/rampart-core/1.5.3-SNAPSHOT/rampart-core-1.5.3-20120402.073637-97.jar
Downloading: http://repository.apache.org/snapshots/org/apache/axis2/mex/1.5.7-SNAPSHOT/mex-1.5.7-20120402.023520-145-impl.jar
37K downloaded  (mex-1.5.7-20120402.023520-145-impl.jar)
158K downloaded  (rampart-core-1.5.3-20120402.073637-97.jar)
Downloading: http://repository.apache.org/snapshots/org/apache/rampart/rampart-policy/1.5.3-SNAPSHOT/rampart-policy-1.5.3-20120402.073644-97.jar
156K downloaded  (rampart-policy-1.5.3-20120402.073644-97.jar)
Downloading: http://repository.apache.org/snapshots/org/apache/rampart/rampart-trust/1.5.3-SNAPSHOT/rampart-trust-1.5.3-20120402.073647-97.jar
108K downloaded  (rampart-trust-1.5.3-20120402.073647-97.jar)
[INFO] [resources:resources {execution: default-resources}]
[INFO] Using 'UTF-8' encoding to copy filtered resources.
[INFO] skip non existing resourceDirectory <https://builds.apache.org/job/sandesha2-1.4/ws/sandesha2/modules/rampart-integration/src/main/resources>
[INFO] Copying 2 resources
[INFO] [compiler:compile {execution: default-compile}]
Compiling 2 source files to <https://builds.apache.org/job/sandesha2-1.4/ws/sandesha2/modules/rampart-integration/target/classes>
[INFO] [resources:testResources {execution: default-testResources}]
[INFO] Using 'UTF-8' encoding to copy filtered resources.
[INFO] skip non existing resourceDirectory <https://builds.apache.org/job/sandesha2-1.4/ws/sandesha2/modules/rampart-integration/src/test/resources>
[INFO] Copying 2 resources
[INFO] [compiler:testCompile {execution: default-testCompile}]
[INFO] No sources to compile
[INFO] [surefire:test {execution: default-test}]
[INFO] Surefire report directory: <https://builds.apache.org/job/sandesha2-1.4/ws/sandesha2/modules/rampart-integration/target/surefire-reports>

-------------------------------------------------------
 T E S T S
-------------------------------------------------------
There are no tests to run.

Results :
Tests run: 0, Failures: 0, Errors: 0, Skipped: 0

[JENKINS] Recording test results
[INFO] [jar:jar {execution: default-jar}]
[INFO] Building jar: <https://builds.apache.org/job/sandesha2-1.4/ws/sandesha2/modules/rampart-integration/target/sandesha2-rampart-integration-1.4.1-SNAPSHOT.jar>
[INFO] [apache-rat:check {execution: default}]
[INFO] Exclude: dependency-reduced-pom.xml
[INFO] Preparing source:jar
[WARNING] Removing: jar from forked lifecycle, to prevent recursive invocation.
[INFO] No goals needed for project - skipping
[INFO] [source:jar {execution: attach-sources}]
[INFO] Building jar: <https://builds.apache.org/job/sandesha2-1.4/ws/sandesha2/modules/rampart-integration/target/sandesha2-rampart-integration-1.4.1-SNAPSHOT-sources.jar>
[INFO] [install:install {execution: default-install}]
[INFO] Installing <https://builds.apache.org/job/sandesha2-1.4/ws/sandesha2/modules/rampart-integration/target/sandesha2-rampart-integration-1.4.1-SNAPSHOT.jar>
to <https://builds.apache.org/job/sandesha2-1.4/ws/.repository/org/apache/sandesha2/sandesha2-rampart-integration/1.4.1-SNAPSHOT/sandesha2-rampart-integration-1.4.1-SNAPSHOT.jar>
[INFO] Installing <https://builds.apache.org/job/sandesha2-1.4/ws/sandesha2/modules/rampart-integration/target/sandesha2-rampart-integration-1.4.1-SNAPSHOT-sources.jar>
to <https://builds.apache.org/job/sandesha2-1.4/ws/.repository/org/apache/sandesha2/sandesha2-rampart-integration/1.4.1-SNAPSHOT/sandesha2-rampart-integration-1.4.1-SNAPSHOT-sources.jar>
[JENKINS] Archiving <https://builds.apache.org/job/sandesha2-1.4/ws/sandesha2/modules/rampart-integration/pom.xml>
to /home/hudson/hudson/jobs/sandesha2-1.4/modules/org.apache.sandesha2$sandesha2-rampart-integration/builds/2012-04-09_15-04-40/archive/org.apache.sandesha2/sandesha2-rampart-integration/1.4.1-SNAPSHOT/sandesha2-rampart-integration-1.4.1-SNAPSHOT.pom
[JENKINS] Archiving <https://builds.apache.org/job/sandesha2-1.4/ws/sandesha2/modules/rampart-integration/target/sandesha2-rampart-integration-1.4.1-SNAPSHOT.jar>
to /home/hudson/hudson/jobs/sandesha2-1.4/modules/org.apache.sandesha2$sandesha2-rampart-integration/builds/2012-04-09_15-04-40/archive/org.apache.sandesha2/sandesha2-rampart-integration/1.4.1-SNAPSHOT/sandesha2-rampart-integration-1.4.1-SNAPSHOT.jar
[JENKINS] Archiving <https://builds.apache.org/job/sandesha2-1.4/ws/sandesha2/modules/rampart-integration/target/sandesha2-rampart-integration-1.4.1-SNAPSHOT-sources.jar>
to /home/hudson/hudson/jobs/sandesha2-1.4/modules/org.apache.sandesha2$sandesha2-rampart-integration/builds/2012-04-09_15-04-40/archive/org.apache.sandesha2/sandesha2-rampart-integration/1.4.1-SNAPSHOT/sandesha2-rampart-integration-1.4.1-SNAPSHOT-sources.jar
[INFO] ------------------------------------------------------------------------
[INFO] Building Sandesha2 - Samples
[INFO]    task-segment: [clean, install]
[INFO] ------------------------------------------------------------------------
[INFO] [clean:clean {execution: default-clean}]
[INFO] Deleting <https://builds.apache.org/job/sandesha2-1.4/ws/sandesha2/modules/samples/target>
[INFO] [remote-resources:process {execution: default}]
[INFO] snapshot org.apache.axis2:axis2-transport-http:1.5.7-SNAPSHOT: checking for updates
from apache.snapshots
Downloading: http://repository.apache.org/snapshots/org/apache/axis2/axis2-transport-http/1.5.7-SNAPSHOT/axis2-transport-http-1.5.7-20120409.144740-199.pom

Downloading: http://repository.apache.org/snapshots/org/apache/axis2/axis2-transport-http/1.5.7-SNAPSHOT/axis2-transport-http-1.5.7-20120409.144740-199.jar
150K downloaded  (axis2-transport-http-1.5.7-20120409.144740-199.jar)
[INFO] [resources:resources {execution: default-resources}]
[INFO] Using 'UTF-8' encoding to copy filtered resources.
[INFO] Copying 1 resource
[INFO] Copying 2 resources
[INFO] [compiler:compile {execution: default-compile}]
Compiling 13 source files to <https://builds.apache.org/job/sandesha2-1.4/ws/sandesha2/modules/samples/target/classes>
[INFO] [resources:testResources {execution: default-testResources}]
[INFO] Using 'UTF-8' encoding to copy filtered resources.
[INFO] skip non existing resourceDirectory <https://builds.apache.org/job/sandesha2-1.4/ws/sandesha2/modules/samples/src/test/resources>
[INFO] Copying 2 resources
[INFO] [compiler:testCompile {execution: default-testCompile}]
[INFO] No sources to compile
[INFO] [surefire:test {execution: default-test}]
[INFO] Surefire report directory: <https://builds.apache.org/job/sandesha2-1.4/ws/sandesha2/modules/samples/target/surefire-reports>
[JENKINS] Recording test results
[JENKINS] Archiving <https://builds.apache.org/job/sandesha2-1.4/ws/sandesha2/modules/samples/pom.xml>
to /home/hudson/hudson/jobs/sandesha2-1.4/modules/org.apache.sandesha2$sandesha2-samples/builds/2012-04-09_15-04-40/archive/org.apache.sandesha2/sandesha2-samples/1.4.1-SNAPSHOT/sandesha2-samples-1.4.1-SNAPSHOT.pom
[INFO] ------------------------------------------------------------------------
[ERROR] BUILD ERROR
[INFO] ------------------------------------------------------------------------
[INFO] Error creating properties files for forking; nested exception is java.io.IOException:
No space left on device

[INFO] ------------------------------------------------------------------------
[INFO] For more information, run Maven with the -e switch
[INFO] ------------------------------------------------------------------------
[INFO] Total time: 1 minute 3 seconds
[INFO] Finished at: Mon Apr 09 15:06:13 UTC 2012
[INFO] Final Memory: 53M/191M
[INFO] ------------------------------------------------------------------------
Sending e-mails to: java-dev@axis.apache.org
channel stopped
ERROR: Failed to parse POMs
java.io.IOException: Remote call on Channel to Maven [/home/hudson/tools/java/latest1.5/bin/java,
-cp, /home/jenkins/jenkins-slave/maven-agent.jar:/home/jenkins/jenkins-slave/classworlds.jar,
hudson.maven.agent.Main, /home/hudson/tools/maven/apache-maven-2.2.1, /home/jenkins/jenkins-slave/slave.jar,
/home/jenkins/jenkins-slave/maven-interceptor.jar, 41301, /home/jenkins/jenkins-slave/maven2.1-interceptor.jar]
failed
	at hudson.remoting.Channel.call(Channel.java:655)
	at hudson.maven.ProcessCache$MavenProcess.call(ProcessCache.java:156)
	at hudson.maven.MavenModuleSetBuild$RunnerImpl.doRun(MavenModuleSetBuild.java:793)
	at hudson.model.AbstractBuild$AbstractRunner.run(AbstractBuild.java:473)
	at hudson.model.Run.run(Run.java:1413)
	at hudson.maven.MavenModuleSetBuild.run(MavenModuleSetBuild.java:479)
	at hudson.model.ResourceController.execute(ResourceController.java:88)
	at hudson.model.Executor.run(Executor.java:238)
Caused by: java.lang.Error: Unable to load resource hudson/maven/Messages.properties
	at hudson.remoting.RemoteClassLoader.findResource(RemoteClassLoader.java:202)
	at java.lang.ClassLoader.getResource(ClassLoader.java:979)
	at java.lang.Class.getResource(Class.java:2042)
	at org.jvnet.localizer.ResourceBundleHolder.get(ResourceBundleHolder.java:83)
	at org.jvnet.localizer.ResourceBundleHolder.get(ResourceBundleHolder.java:102)
	at org.jvnet.localizer.ResourceBundleHolder.get(ResourceBundleHolder.java:102)
	at org.jvnet.localizer.ResourceBundleHolder.format(ResourceBundleHolder.java:139)
	at hudson.maven.Messages.MavenBuilder_Waiting(Messages.java:443)
	at hudson.maven.AbstractMavenBuilder.waitForAsynchronousExecutions(AbstractMavenBuilder.java:183)
	at hudson.maven.MavenBuilder.call(MavenBuilder.java:156)
	at hudson.maven.Maven2Builder.call(Maven2Builder.java:77)
	at hudson.maven.Maven2Builder.call(Maven2Builder.java:53)
	at hudson.remoting.UserRequest.perform(UserRequest.java:118)
	at hudson.remoting.UserRequest.perform(UserRequest.java:48)
	at hudson.remoting.Request$2.run(Request.java:287)
	at hudson.remoting.InterceptingExecutorService$1.call(InterceptingExecutorService.java:72)
	at java.util.concurrent.FutureTask$Sync.innerRun(FutureTask.java:269)
	at java.util.concurrent.FutureTask.run(FutureTask.java:123)
	at java.util.concurrent.ThreadPoolExecutor$Worker.runTask(ThreadPoolExecutor.java:651)
	at java.util.concurrent.ThreadPoolExecutor$Worker.run(ThreadPoolExecutor.java:676)
	at java.lang.Thread.run(Thread.java:595)
Caused by: java.io.FileNotFoundException: /tmp/hudson-remoting2395542747538717705/hudson/maven/Messages.properties
(No such file or directory)
	at java.io.FileOutputStream.open(Native Method)
	at java.io.FileOutputStream.<init>(FileOutputStream.java:179)
	at java.io.FileOutputStream.<init>(FileOutputStream.java:131)
	at hudson.remoting.RemoteClassLoader.makeResource(RemoteClassLoader.java:270)
	at hudson.remoting.RemoteClassLoader.findResource(RemoteClassLoader.java:198)
	... 20 more

---------------------------------------------------------------------
To unsubscribe, e-mail: java-dev-unsubscribe@axis.apache.org
For additional commands, e-mail: java-dev-help@axis.apache.org


Mime
View raw message