axis-java-dev mailing list archives

Site index · List index
Message view « Date » · « Thread »
Top « Date » · « Thread »
From Apache Jenkins Server <jenk...@builds.apache.org>
Subject Build failed in Jenkins: axis2-transports-trunk #734
Date Mon, 09 Apr 2012 16:41:47 GMT
See <https://builds.apache.org/job/axis2-transports-trunk/734/>

------------------------------------------
Started by upstream project "Axis2" build number 1330
Building remotely on ubuntu4 in workspace <https://builds.apache.org/job/axis2-transports-trunk/ws/>
Updating http://svn.apache.org/repos/asf/axis/axis2/java/transports/trunk
At revision 1311312
no change for http://svn.apache.org/repos/asf/axis/axis2/java/transports/trunk since the previous
build
[axis2-transports-trunk] $ /bin/bash -xe /tmp/hudson2694385130548188724.sh
+ '[' -d <https://builds.apache.org/job/axis2-transports-trunk/ws/.repository> ']'
++ find <https://builds.apache.org/job/axis2-transports-trunk/ws/.repository> -type
d -and -name '*-SNAPSHOT'
+ rm -rf <https://builds.apache.org/job/axis2-transports-trunk/ws/.repository/org/apache/woden/woden/1.0-SNAPSHOT>
<https://builds.apache.org/job/axis2-transports-trunk/ws/.repository/org/apache/woden/woden-impl-dom/1.0-SNAPSHOT>
<https://builds.apache.org/job/axis2-transports-trunk/ws/.repository/org/apache/woden/woden-impl-commons/1.0-SNAPSHOT>
<https://builds.apache.org/job/axis2-transports-trunk/ws/.repository/org/apache/woden/woden-api/1.0-SNAPSHOT>
<https://builds.apache.org/job/axis2-transports-trunk/ws/.repository/org/apache/neethi/neethi/3.0.2-SNAPSHOT>
<https://builds.apache.org/job/axis2-transports-trunk/ws/.repository/org/apache/axis2/addressing/1.7.0-SNAPSHOT>
<https://builds.apache.org/job/axis2-transports-trunk/ws/.repository/org/apache/axis2/axis2-transport-testkit/1.7.0-SNAPSHOT>
<https://builds.apache.org/job/axis2-transports-trunk/ws/.repository/org/apache/axis2/axis2-kernel/1.7.0-SNAPSHOT>
<https://builds.apache.org/job/axis2-transports-trunk/ws/.repository/org/apache/axis2/axis2-transport-xmpp/1.7.0-SNAPSHOT>
<https://builds.apache.org/job/axis2-transports-trunk/ws/.repository/org/apache/axis2/axis2-transport-http/1.7.0-SNAPSHOT>
<https://builds.apache.org/job/axis2-transports-trunk/ws/.repository/org/apache/axis2/axis2-transport-sms/1.7.0-SNAPSHOT>
<https://builds.apache.org/job/axis2-transports-trunk/ws/.repository/org/apache/axis2/axis2-transport-all/1.7.0-SNAPSHOT>
<https://builds.apache.org/job/axis2-transports-trunk/ws/.repository/org/apache/axis2/axis2-transports/1.7.0-SNAPSHOT>
<https://builds.apache.org/job/axis2-transports-trunk/ws/.repository/org/apache/axis2/axis2-transport-mail/1.7.0-SNAPSHOT>
<https://builds.apache.org/job/axis2-transports-trunk/ws/.repository/org/apache/axis2/axis2-transport-udp/1.7.0-SNAPSHOT>
<https://builds.apache.org/job/axis2-transports-trunk/ws/.repository/org/apache/axis2/axis2-transport-tcp/1.7.0-SNAPSHOT>
<https://builds.apache.org/job/axis2-transports-trunk/ws/.repository/org/apache/axis2/axis2-transport-http-tests/1.7.0-SNAPSHOT>
<https://builds.apache.org/job/axis2-transports-trunk/ws/.repository/org/apache/axis2/axis2-transport-jms/1.7.0-SNAPSHOT>
<https://builds.apache.org/job/axis2-transports-trunk/ws/.repository/org/apache/axis2/axis2-transport-base/1.7.0-SNAPSHOT>
<https://builds.apache.org/job/axis2-transports-trunk/ws/.repository/org/apache/axis2/axis2-parent/1.7.0-SNAPSHOT>
<https://builds.apache.org/job/axis2-transports-trunk/ws/.repository/org/apache/ws/commons/schema/XmlSchema/1.4.8-SNAPSHOT>
<https://builds.apache.org/job/axis2-transports-trunk/ws/.repository/org/apache/ws/commons/axiom/axiom-parent/1.2.13-SNAPSHOT>
<https://builds.apache.org/job/axis2-transports-trunk/ws/.repository/org/apache/ws/commons/axiom/axiom-impl/1.2.13-SNAPSHOT>
<https://builds.apache.org/job/axis2-transports-trunk/ws/.repository/org/apache/ws/commons/axiom/axiom-api/1.2.13-SNAPSHOT>
[locks-and-latches] Checking to see if we really have the locks
[locks-and-latches] Have all the locks, build can start
Parsing POMs
Modules changed, recalculating dependency graph
[transports] $ /home/hudson/tools/java/latest1.5/bin/java -cp /home/jenkins/jenkins-slave/maven-agent.jar:/home/jenkins/jenkins-slave/classworlds.jar
hudson.maven.agent.Main /home/hudson/tools/maven/apache-maven-2.2.1 /home/jenkins/jenkins-slave/slave.jar
/home/jenkins/jenkins-slave/maven-interceptor.jar 60871 /home/jenkins/jenkins-slave/maven2.1-interceptor.jar
<===[JENKINS REMOTING CAPACITY]===>channel started
   log4j:WARN No appenders could be found for logger (org.apache.commons.beanutils.converters.BooleanConverter).
log4j:WARN Please initialize the log4j system properly.
Executing Maven:  -B -f <https://builds.apache.org/job/axis2-transports-trunk/ws/transports/pom.xml>
-Dmaven.repo.local=<https://builds.apache.org/job/axis2-transports-trunk/ws/.repository>
clean deploy
[INFO] Scanning for projects...
[INFO] Reactor build order: 
[INFO]   Apache Axis2 - Transport - Root
[INFO]   Apache Axis2 - Transport - Base
[INFO]   Apache Axis2 - Transport - testkit
[INFO]   Apache Axis2 - Transport - HTTP Tests
[INFO]   Apache Axis2 - Transport - TCP
[INFO]   Apache Axis2 - Transport - UDP
[INFO]   Apache Axis2 - Transport - XMPP
[INFO]   Apache Axis2 - Transport - Mail
[INFO]   Apache Axis2 - Transport - JMS
[INFO]   Apache Axis2 - Transport - Sms
[INFO]   Apache Axis2 - Transport - All
[INFO] ------------------------------------------------------------------------
[INFO] Building Apache Axis2 - Transport - Root
[INFO]    task-segment: [clean, deploy]
[INFO] ------------------------------------------------------------------------
[INFO] [clean:clean {execution: default-clean}]
[INFO] Deleting <https://builds.apache.org/job/axis2-transports-trunk/ws/transports/target>
[INFO] Setting property: classpath.resource.loader.class => 'org.codehaus.plexus.velocity.ContextClassLoaderResourceLoader'.
[INFO] Setting property: velocimacro.messages.on => 'false'.
[INFO] Setting property: resource.loader => 'classpath'.
[INFO] Setting property: resource.manager.logwhenfound => 'false'.
[INFO] [remote-resources:process {execution: default}]
[INFO] snapshot org.apache.axis2:axis2-kernel:1.7.0-SNAPSHOT: checking for updates from apache.snapshots
Downloading: http://repository.apache.org/snapshots/org/apache/axis2/axis2-kernel/1.7.0-SNAPSHOT/axis2-kernel-1.7.0-20120409.152358-620.pom

[INFO] snapshot org.apache.axis2:axis2-parent:1.7.0-SNAPSHOT: checking for updates from apache.snapshots
Downloading: http://repository.apache.org/snapshots/org/apache/axis2/axis2-parent/1.7.0-SNAPSHOT/axis2-parent-1.7.0-20120409.152358-627.pom

[INFO] snapshot org.apache.ws.commons.axiom:axiom-api:1.2.14-SNAPSHOT: checking for updates
from apache.snapshots
Downloading: http://repository.apache.org/snapshots/org/apache/ws/commons/axiom/axiom-api/1.2.14-SNAPSHOT/axiom-api-1.2.14-20120409.110701-11.pom

[INFO] snapshot org.apache.ws.commons.axiom:axiom-parent:1.2.14-SNAPSHOT: checking for updates
from apache.snapshots
Downloading: http://repository.apache.org/snapshots/org/apache/ws/commons/axiom/axiom-parent/1.2.14-SNAPSHOT/axiom-parent-1.2.14-20120409.110237-11.pom

[INFO] snapshot org.apache.ws.commons.axiom:axiom-impl:1.2.14-SNAPSHOT: checking for updates
from apache.snapshots
Downloading: http://repository.apache.org/snapshots/org/apache/ws/commons/axiom/axiom-impl/1.2.14-SNAPSHOT/axiom-impl-1.2.14-20120409.111503-11.pom

[INFO] snapshot org.apache.ws.commons.schema:XmlSchema:1.4.8-SNAPSHOT: checking for updates
from apache.snapshots
Downloading: http://repository.apache.org/snapshots/org/apache/ws/commons/schema/XmlSchema/1.4.8-SNAPSHOT/XmlSchema-1.4.8-SNAPSHOT.pom

[INFO] snapshot org.apache.neethi:neethi:3.0.2-SNAPSHOT: checking for updates from apache.snapshots
Downloading: http://repository.apache.org/snapshots/org/apache/neethi/neethi/3.0.2-SNAPSHOT/neethi-3.0.2-20120408.020324-208.pom

[INFO] snapshot org.apache.woden:woden-api:1.0-SNAPSHOT: checking for updates from apache.snapshots
Downloading: http://repository.apache.org/snapshots/org/apache/woden/woden-api/1.0-SNAPSHOT/woden-api-1.0-20120402.023555-405.pom

[INFO] snapshot org.apache.woden:woden:1.0-SNAPSHOT: checking for updates from apache.snapshots
Downloading: http://repository.apache.org/snapshots/org/apache/woden/woden/1.0-SNAPSHOT/woden-1.0-20120402.023554-405.pom

[INFO] snapshot org.apache.woden:woden-impl-dom:1.0-SNAPSHOT: checking for updates from apache.snapshots
Downloading: http://repository.apache.org/snapshots/org/apache/woden/woden-impl-dom/1.0-SNAPSHOT/woden-impl-dom-1.0-20120402.023557-405.pom

[INFO] snapshot org.apache.woden:woden-impl-commons:1.0-SNAPSHOT: checking for updates from
apache.snapshots
Downloading: http://repository.apache.org/snapshots/org/apache/woden/woden-impl-commons/1.0-SNAPSHOT/woden-impl-commons-1.0-20120402.023557-405.pom

Downloading: http://repository.apache.org/snapshots/org/apache/woden/woden-api/1.0-SNAPSHOT/woden-api-1.0-20120402.023555-405.jar
Downloading: http://repository.apache.org/snapshots/org/apache/neethi/neethi/3.0.2-SNAPSHOT/neethi-3.0.2-20120408.020324-208.jar
Downloading: http://repository.apache.org/snapshots/org/apache/axis2/axis2-kernel/1.7.0-SNAPSHOT/axis2-kernel-1.7.0-20120409.152358-620.jar
Downloading: http://repository.apache.org/snapshots/org/apache/ws/commons/schema/XmlSchema/1.4.8-SNAPSHOT/XmlSchema-1.4.8-SNAPSHOT.jar
Downloading: http://repository.apache.org/snapshots/org/apache/ws/commons/axiom/axiom-api/1.2.14-SNAPSHOT/axiom-api-1.2.14-20120409.110701-11.jar
69K downloaded  (neethi-3.0.2-20120408.020324-208.jar)
153K downloaded  (woden-api-1.0-20120402.023555-405.jar)
145K downloaded  (XmlSchema-1.4.8-SNAPSHOT.jar)
Downloading: http://repository.apache.org/snapshots/org/apache/woden/woden-impl-dom/1.0-SNAPSHOT/woden-impl-dom-1.0-20120402.023557-405.jar
47K downloaded  (woden-impl-dom-1.0-20120402.023557-405.jar)
Downloading: http://repository.apache.org/snapshots/org/apache/woden/woden-impl-commons/1.0-SNAPSHOT/woden-impl-commons-1.0-20120402.023557-405.jar
410K downloaded  (axiom-api-1.2.14-20120409.110701-11.jar)
Downloading: http://repository.apache.org/snapshots/org/apache/ws/commons/axiom/axiom-impl/1.2.14-SNAPSHOT/axiom-impl-1.2.14-20120409.111503-11.jar
181K downloaded  (woden-impl-commons-1.0-20120402.023557-405.jar)
154K downloaded  (axiom-impl-1.2.14-20120409.111503-11.jar)
1031K downloaded  (axis2-kernel-1.7.0-20120409.152358-620.jar)
[WARNING] Component manager not found for returned component. Ignored. component=org.apache.maven.wagon.providers.http.LightweightHttpWagon@1f437e
[INFO] [site:attach-descriptor {execution: default-attach-descriptor}]
[INFO] Parent project loaded from repository: org.apache:apache:pom:9
[INFO] Preparing source:jar
[WARNING] Removing: jar from forked lifecycle, to prevent recursive invocation.
[INFO] No goals needed for project - skipping
[INFO] [source:jar {execution: default}]
[INFO] [install:install {execution: default-install}]
[INFO] Installing <https://builds.apache.org/job/axis2-transports-trunk/ws/transports/pom.xml>
to <https://builds.apache.org/job/axis2-transports-trunk/ws/.repository/org/apache/axis2/axis2-transports/1.7.0-SNAPSHOT/axis2-transports-1.7.0-SNAPSHOT.pom>
[INFO] Installing <https://builds.apache.org/job/axis2-transports-trunk/ws/transports/target/axis2-transports-1.7.0-SNAPSHOT-site.xml>
to <https://builds.apache.org/job/axis2-transports-trunk/ws/.repository/org/apache/axis2/axis2-transports/1.7.0-SNAPSHOT/axis2-transports-1.7.0-SNAPSHOT-site.xml>
[INFO] [deploy:deploy {execution: default-deploy}]
[INFO] Retrieving previous build number from apache.snapshots.https
[WARNING] *** CHECKSUM FAILED - Checksum failed on download: local = 'fbe2f7ebc93734c176c4b5b0d032d3f65b59e521';
remote = '2a67cd8fbf53f37ec8a8aff5392be5eb25c5712e' - RETRYING
[WARNING] *** CHECKSUM FAILED - Checksum failed on download: local = 'fbe2f7ebc93734c176c4b5b0d032d3f65b59e521';
remote = '2a67cd8fbf53f37ec8a8aff5392be5eb25c5712e' - IGNORING
Uploading: https://repository.apache.org/content/repositories/snapshots/org/apache/axis2/axis2-transports/1.7.0-SNAPSHOT/axis2-transports-1.7.0-20120409.164131-295.pom
17K uploaded  (axis2-transports-1.7.0-20120409.164131-295.pom)
[INFO] Retrieving previous metadata from apache.snapshots.https
[WARNING] *** CHECKSUM FAILED - Checksum failed on download: local = 'fbe2f7ebc93734c176c4b5b0d032d3f65b59e521';
remote = '2a67cd8fbf53f37ec8a8aff5392be5eb25c5712e' - RETRYING
[WARNING] *** CHECKSUM FAILED - Checksum failed on download: local = 'fbe2f7ebc93734c176c4b5b0d032d3f65b59e521';
remote = '2a67cd8fbf53f37ec8a8aff5392be5eb25c5712e' - IGNORING
[INFO] Uploading repository metadata for: 'snapshot org.apache.axis2:axis2-transports:1.7.0-SNAPSHOT'
[INFO] Retrieving previous metadata from apache.snapshots.https
[INFO] Uploading repository metadata for: 'artifact org.apache.axis2:axis2-transports'
[INFO] Retrieving previous build number from apache.snapshots.https
Uploading: https://repository.apache.org/content/repositories/snapshots/org/apache/axis2/axis2-transports/1.7.0-SNAPSHOT/axis2-transports-1.7.0-20120409.164131-295-site.xml
2K uploaded  (axis2-transports-1.7.0-20120409.164131-295-site.xml)
[JENKINS] Archiving <https://builds.apache.org/job/axis2-transports-trunk/ws/transports/pom.xml>
to /home/hudson/hudson/jobs/axis2-transports-trunk/modules/org.apache.axis2$axis2-transports/builds/2012-04-09_16-40-40/archive/org.apache.axis2/axis2-transports/1.7.0-SNAPSHOT/axis2-transports-1.7.0-SNAPSHOT.pom
[JENKINS] Archiving <https://builds.apache.org/job/axis2-transports-trunk/ws/.repository/org/apache/axis2/axis2-transports/1.7.0-SNAPSHOT/axis2-transports-1.7.0-SNAPSHOT.pom>
to /home/hudson/hudson/jobs/axis2-transports-trunk/modules/org.apache.axis2$axis2-transports/builds/2012-04-09_16-40-40/archive/org.apache.axis2/axis2-transports/1.7.0-20120409.164131-295/axis2-transports-1.7.0-20120409.164131-295.pom
[JENKINS] Archiving <https://builds.apache.org/job/axis2-transports-trunk/ws/transports/target/axis2-transports-1.7.0-SNAPSHOT-site.xml>
to /home/hudson/hudson/jobs/axis2-transports-trunk/modules/org.apache.axis2$axis2-transports/builds/2012-04-09_16-40-40/archive/org.apache.axis2/axis2-transports/1.7.0-20120409.164131-295/axis2-transports-1.7.0-20120409.164131-295-site.xml
[INFO] ------------------------------------------------------------------------
[INFO] Building Apache Axis2 - Transport - Base
[INFO]    task-segment: [clean, deploy]
[INFO] ------------------------------------------------------------------------
[INFO] [clean:clean {execution: default-clean}]
[INFO] Deleting <https://builds.apache.org/job/axis2-transports-trunk/ws/transports/modules/base/target>
[INFO] [remote-resources:process {execution: default}]
[INFO] [resources:resources {execution: default-resources}]
[INFO] Using 'UTF-8' encoding to copy filtered resources.
[INFO] skip non existing resourceDirectory <https://builds.apache.org/job/axis2-transports-trunk/ws/transports/modules/base/src/main/resources>
[INFO] Copying 3 resources
[INFO] [compiler:compile {execution: default-compile}]
[INFO] Compiling 60 source files to <https://builds.apache.org/job/axis2-transports-trunk/ws/transports/modules/base/target/classes>
[INFO] [resources:testResources {execution: default-testResources}]
[INFO] Using 'UTF-8' encoding to copy filtered resources.
[INFO] skip non existing resourceDirectory <https://builds.apache.org/job/axis2-transports-trunk/ws/transports/modules/base/src/test/resources>
[INFO] Copying 3 resources
[INFO] [compiler:testCompile {execution: default-testCompile}]
[INFO] Compiling 3 source files to <https://builds.apache.org/job/axis2-transports-trunk/ws/transports/modules/base/target/test-classes>
[INFO] [surefire:test {execution: default-test}]
[INFO] Surefire report directory: <https://builds.apache.org/job/axis2-transports-trunk/ws/transports/modules/base/target/surefire-reports>

-------------------------------------------------------
 T E S T S
-------------------------------------------------------
Running org.apache.axis2.format.ManagedDataSourceFactoryTest
Tests run: 1, Failures: 0, Errors: 0, Skipped: 0, Time elapsed: 0.036 sec
Running org.apache.axis2.format.PlainTextFormatterTest
Tests run: 4, Failures: 0, Errors: 0, Skipped: 0, Time elapsed: 0.128 sec
Running org.apache.axis2.transport.base.threads.watermark.WaterMarkExecutorTest
Tests run: 2, Failures: 0, Errors: 0, Skipped: 0, Time elapsed: 2.09 sec

Results :

Tests run: 7, Failures: 0, Errors: 0, Skipped: 0

[JENKINS] Archiving <https://builds.apache.org/job/axis2-transports-trunk/ws/transports/modules/base/pom.xml>
to /home/hudson/hudson/jobs/axis2-transports-trunk/modules/org.apache.axis2$axis2-transport-base/builds/2012-04-09_16-40-41/archive/org.apache.axis2/axis2-transport-base/1.7.0-SNAPSHOT/axis2-transport-base-1.7.0-SNAPSHOT.pom
[INFO] ------------------------------------------------------------------------
[ERROR] FATAL ERROR
[INFO] ------------------------------------------------------------------------
[INFO] Failed to load hudson.maven.reporters.Messages
Illegal exception table range in class file hudson/maven/reporters/Messages
[INFO] ------------------------------------------------------------------------
[INFO] Trace
java.lang.ClassFormatError: Failed to load hudson.maven.reporters.Messages
	at hudson.remoting.RemoteClassLoader.loadClassFile(RemoteClassLoader.java:154)
	at hudson.remoting.RemoteClassLoader.findClass(RemoteClassLoader.java:131)
	at java.lang.ClassLoader.loadClass(ClassLoader.java:307)
	at java.lang.ClassLoader.loadClass(ClassLoader.java:252)
	at java.lang.ClassLoader.loadClassInternal(ClassLoader.java:320)
	at hudson.maven.reporters.SurefireArchiver.postExecute(SurefireArchiver.java:108)
	at hudson.maven.Maven2Builder.postExecute(Maven2Builder.java:155)
	at hudson.maven.MavenBuilder$Adapter.postExecute(MavenBuilder.java:310)
	at hudson.maven.agent.PluginManagerInterceptor$1MojoIntercepterImpl.callPost(PluginManagerInterceptor.java:170)
	at hudson.maven.agent.PluginManagerInterceptor.executeMojo(PluginManagerInterceptor.java:183)
	at org.apache.maven.lifecycle.DefaultLifecycleExecutor.executeGoals(DefaultLifecycleExecutor.java:694)
	at org.apache.maven.lifecycle.DefaultLifecycleExecutor.executeGoalWithLifecycle(DefaultLifecycleExecutor.java:556)
	at org.apache.maven.lifecycle.DefaultLifecycleExecutor.executeGoal(DefaultLifecycleExecutor.java:535)
	at org.apache.maven.lifecycle.DefaultLifecycleExecutor.executeGoalAndHandleFailures(DefaultLifecycleExecutor.java:387)
	at org.apache.maven.lifecycle.DefaultLifecycleExecutor.executeTaskSegments(DefaultLifecycleExecutor.java:348)
	at org.apache.maven.lifecycle.DefaultLifecycleExecutor.execute(DefaultLifecycleExecutor.java:180)
	at org.apache.maven.lifecycle.LifecycleExecutorInterceptor.execute(LifecycleExecutorInterceptor.java:65)
	at org.apache.maven.DefaultMaven.doExecute(DefaultMaven.java:328)
	at org.apache.maven.DefaultMaven.execute(DefaultMaven.java:138)
	at org.apache.maven.cli.MavenCli.main(MavenCli.java:362)
	at sun.reflect.NativeMethodAccessorImpl.invoke0(Native Method)
	at sun.reflect.NativeMethodAccessorImpl.invoke(NativeMethodAccessorImpl.java:39)
	at sun.reflect.DelegatingMethodAccessorImpl.invoke(DelegatingMethodAccessorImpl.java:25)
	at java.lang.reflect.Method.invoke(Method.java:592)
	at org.codehaus.classworlds.Launcher.launchEnhanced(Launcher.java:315)
	at org.codehaus.classworlds.Launcher.launch(Launcher.java:255)
	at hudson.maven.agent.Main.launch(Main.java:185)
	at hudson.maven.MavenBuilder.call(MavenBuilder.java:151)
	at hudson.maven.Maven2Builder.call(Maven2Builder.java:77)
	at hudson.maven.Maven2Builder.call(Maven2Builder.java:53)
	at hudson.remoting.UserRequest.perform(UserRequest.java:118)
	at hudson.remoting.UserRequest.perform(UserRequest.java:48)
	at hudson.remoting.Request$2.run(Request.java:287)
	at hudson.remoting.InterceptingExecutorService$1.call(InterceptingExecutorService.java:72)
	at java.util.concurrent.FutureTask$Sync.innerRun(FutureTask.java:269)
	at java.util.concurrent.FutureTask.run(FutureTask.java:123)
	at java.util.concurrent.ThreadPoolExecutor$Worker.runTask(ThreadPoolExecutor.java:651)
	at java.util.concurrent.ThreadPoolExecutor$Worker.run(ThreadPoolExecutor.java:676)
	at java.lang.Thread.run(Thread.java:595)
Caused by: java.lang.ClassFormatError: Illegal exception table range in class file hudson/maven/reporters/Messages
	at java.lang.ClassLoader.defineClass1(Native Method)
	at java.lang.ClassLoader.defineClass(ClassLoader.java:621)
	at java.lang.ClassLoader.defineClass(ClassLoader.java:466)
	at hudson.remoting.RemoteClassLoader.loadClassFile(RemoteClassLoader.java:152)
	... 38 more
[INFO] ------------------------------------------------------------------------
[INFO] Total time: 30 seconds
[INFO] Finished at: Mon Apr 09 16:41:46 UTC 2012
[INFO] Final Memory: 43M/321M
[INFO] ------------------------------------------------------------------------
channel stopped
[locks-and-latches] Releasing all the locks
[locks-and-latches] All the locks released

---------------------------------------------------------------------
To unsubscribe, e-mail: java-dev-unsubscribe@axis.apache.org
For additional commands, e-mail: java-dev-help@axis.apache.org


Mime
View raw message