axis-java-dev mailing list archives

Site index · List index
Message view « Date » · « Thread »
Top « Date » · « Thread »
From Apache Jenkins Server <jenk...@builds.apache.org>
Subject Build failed in Jenkins: axis2-transports-trunk #764
Date Sat, 21 Apr 2012 21:39:16 GMT
See <https://builds.apache.org/job/axis2-transports-trunk/764/>

------------------------------------------
Started by upstream project "Axis2" build number 1377
Building remotely on ubuntu2 in workspace <https://builds.apache.org/job/axis2-transports-trunk/ws/>
Updating http://svn.apache.org/repos/asf/axis/axis2/java/transports/trunk
At revision 1328737
no change for http://svn.apache.org/repos/asf/axis/axis2/java/transports/trunk since the previous
build
[axis2-transports-trunk] $ /bin/bash -xe /tmp/hudson4484998270233483582.sh
+ '[' -d <https://builds.apache.org/job/axis2-transports-trunk/ws/.repository> ']'
++ find <https://builds.apache.org/job/axis2-transports-trunk/ws/.repository> -type
d -and -name '*-SNAPSHOT'
+ rm -rf <https://builds.apache.org/job/axis2-transports-trunk/ws/.repository/org/apache/james/apache-mime4j-project/0.8-SNAPSHOT>
<https://builds.apache.org/job/axis2-transports-trunk/ws/.repository/org/apache/james/apache-mime4j-core/0.8-SNAPSHOT>
<https://builds.apache.org/job/axis2-transports-trunk/ws/.repository/org/apache/ws/commons/schema/XmlSchema/1.4.8-SNAPSHOT>
<https://builds.apache.org/job/axis2-transports-trunk/ws/.repository/org/apache/ws/commons/axiom/axiom-impl/1.2.14-SNAPSHOT>
<https://builds.apache.org/job/axis2-transports-trunk/ws/.repository/org/apache/ws/commons/axiom/axiom-parent/1.2.14-SNAPSHOT>
<https://builds.apache.org/job/axis2-transports-trunk/ws/.repository/org/apache/ws/commons/axiom/axiom-api/1.2.14-SNAPSHOT>
<https://builds.apache.org/job/axis2-transports-trunk/ws/.repository/org/apache/axis2/axis2-transport-all/1.7.0-SNAPSHOT>
<https://builds.apache.org/job/axis2-transports-trunk/ws/.repository/org/apache/axis2/axis2-transport-http/1.7.0-SNAPSHOT>
<https://builds.apache.org/job/axis2-transports-trunk/ws/.repository/org/apache/axis2/addressing/1.7.0-SNAPSHOT>
<https://builds.apache.org/job/axis2-transports-trunk/ws/.repository/org/apache/axis2/axis2-transport-jms/1.7.0-SNAPSHOT>
<https://builds.apache.org/job/axis2-transports-trunk/ws/.repository/org/apache/axis2/axis2-transport-testkit/1.7.0-SNAPSHOT>
<https://builds.apache.org/job/axis2-transports-trunk/ws/.repository/org/apache/axis2/axis2-transport-udp/1.7.0-SNAPSHOT>
<https://builds.apache.org/job/axis2-transports-trunk/ws/.repository/org/apache/axis2/axis2-transport-base/1.7.0-SNAPSHOT>
<https://builds.apache.org/job/axis2-transports-trunk/ws/.repository/org/apache/axis2/axis2-transport-tcp/1.7.0-SNAPSHOT>
<https://builds.apache.org/job/axis2-transports-trunk/ws/.repository/org/apache/axis2/axis2-transports/1.7.0-SNAPSHOT>
<https://builds.apache.org/job/axis2-transports-trunk/ws/.repository/org/apache/axis2/axis2-transport-http-tests/1.7.0-SNAPSHOT>
<https://builds.apache.org/job/axis2-transports-trunk/ws/.repository/org/apache/axis2/axis2-kernel/1.7.0-SNAPSHOT>
<https://builds.apache.org/job/axis2-transports-trunk/ws/.repository/org/apache/axis2/axis2-transport-xmpp/1.7.0-SNAPSHOT>
<https://builds.apache.org/job/axis2-transports-trunk/ws/.repository/org/apache/axis2/axis2-parent/1.7.0-SNAPSHOT>
<https://builds.apache.org/job/axis2-transports-trunk/ws/.repository/org/apache/axis2/axis2-transport-mail/1.7.0-SNAPSHOT>
<https://builds.apache.org/job/axis2-transports-trunk/ws/.repository/org/apache/axis2/axis2-transport-sms/1.7.0-SNAPSHOT>
<https://builds.apache.org/job/axis2-transports-trunk/ws/.repository/org/apache/woden/woden-impl-dom/1.0-SNAPSHOT>
<https://builds.apache.org/job/axis2-transports-trunk/ws/.repository/org/apache/woden/woden-api/1.0-SNAPSHOT>
<https://builds.apache.org/job/axis2-transports-trunk/ws/.repository/org/apache/woden/woden-impl-commons/1.0-SNAPSHOT>
<https://builds.apache.org/job/axis2-transports-trunk/ws/.repository/org/apache/woden/woden/1.0-SNAPSHOT>
<https://builds.apache.org/job/axis2-transports-trunk/ws/.repository/org/apache/neethi/neethi/3.0.3-SNAPSHOT>
[locks-and-latches] Checking to see if we really have the locks
[locks-and-latches] Have all the locks, build can start
Parsing POMs
Modules changed, recalculating dependency graph
[transports] $ /home/hudson/tools/java/latest1.5/bin/java -cp /home/hudson/hudson-slave/maven-agent.jar:/home/hudson/hudson-slave/classworlds.jar
hudson.maven.agent.Main /home/hudson/tools/maven/apache-maven-2.2.1 /home/hudson/hudson-slave/slave.jar
/home/hudson/hudson-slave/maven-interceptor.jar 45083 /home/hudson/hudson-slave/maven2.1-interceptor.jar
<===[JENKINS REMOTING CAPACITY]===>channel started
   log4j:WARN No appenders could be found for logger (org.apache.commons.beanutils.converters.BooleanConverter).
log4j:WARN Please initialize the log4j system properly.
Executing Maven:  -B -f <https://builds.apache.org/job/axis2-transports-trunk/ws/transports/pom.xml>
-Dmaven.repo.local=<https://builds.apache.org/job/axis2-transports-trunk/ws/.repository>
clean deploy
[INFO] Scanning for projects...
[INFO] Reactor build order: 
[INFO]   Apache Axis2 - Transport - Root
[INFO]   Apache Axis2 - Transport - Base
[INFO]   Apache Axis2 - Transport - testkit
[INFO]   Apache Axis2 - Transport - HTTP Tests
[INFO]   Apache Axis2 - Transport - TCP
[INFO]   Apache Axis2 - Transport - UDP
[INFO]   Apache Axis2 - Transport - XMPP
[INFO]   Apache Axis2 - Transport - Mail
[INFO]   Apache Axis2 - Transport - JMS
[INFO]   Apache Axis2 - Transport - Sms
[INFO]   Apache Axis2 - Transport - All
[INFO] ------------------------------------------------------------------------
[INFO] Building Apache Axis2 - Transport - Root
[INFO]    task-segment: [clean, deploy]
[INFO] ------------------------------------------------------------------------
[INFO] [clean:clean {execution: default-clean}]
[INFO] Deleting <https://builds.apache.org/job/axis2-transports-trunk/ws/transports/target>
[INFO] Setting property: classpath.resource.loader.class => 'org.codehaus.plexus.velocity.ContextClassLoaderResourceLoader'.
[INFO] Setting property: velocimacro.messages.on => 'false'.
[INFO] Setting property: resource.loader => 'classpath'.
[INFO] Setting property: resource.manager.logwhenfound => 'false'.
[INFO] [remote-resources:process {execution: default}]
[INFO] snapshot org.apache.axis2:axis2-kernel:1.7.0-SNAPSHOT: checking for updates from apache.snapshots
Downloading: http://repository.apache.org/snapshots/org/apache/axis2/axis2-kernel/1.7.0-SNAPSHOT/axis2-kernel-1.7.0-20120421.202808-665.pom

[INFO] snapshot org.apache.axis2:axis2-parent:1.7.0-SNAPSHOT: checking for updates from apache.snapshots
Downloading: http://repository.apache.org/snapshots/org/apache/axis2/axis2-parent/1.7.0-SNAPSHOT/axis2-parent-1.7.0-20120421.202808-674.pom

[INFO] snapshot org.apache.ws.commons.axiom:axiom-api:1.2.14-SNAPSHOT: checking for updates
from apache.snapshots
Downloading: http://repository.apache.org/snapshots/org/apache/ws/commons/axiom/axiom-api/1.2.14-SNAPSHOT/axiom-api-1.2.14-20120421.170544-50.pom

[INFO] snapshot org.apache.ws.commons.axiom:axiom-parent:1.2.14-SNAPSHOT: checking for updates
from apache.snapshots
Downloading: http://repository.apache.org/snapshots/org/apache/ws/commons/axiom/axiom-parent/1.2.14-SNAPSHOT/axiom-parent-1.2.14-20120421.170204-50.pom

[INFO] snapshot org.apache.james:apache-mime4j-core:0.8-SNAPSHOT: checking for updates from
apache.snapshots
Downloading: http://repository.apache.org/snapshots/org/apache/james/apache-mime4j-core/0.8-SNAPSHOT/apache-mime4j-core-0.8-20120421.004623-244.pom

[INFO] snapshot org.apache.james:apache-mime4j-project:0.8-SNAPSHOT: checking for updates
from apache.snapshots
Downloading: http://repository.apache.org/snapshots/org/apache/james/apache-mime4j-project/0.8-SNAPSHOT/apache-mime4j-project-0.8-20120421.004550-272.pom

[INFO] snapshot org.apache.ws.commons.axiom:axiom-impl:1.2.14-SNAPSHOT: checking for updates
from apache.snapshots
Downloading: http://repository.apache.org/snapshots/org/apache/ws/commons/axiom/axiom-impl/1.2.14-SNAPSHOT/axiom-impl-1.2.14-20120421.171240-50.pom

Downloading: http://repo1.maven.org/maven2/org/codehaus/woodstox/woodstox-core-asl/4.1.2/woodstox-core-asl-4.1.2.pom

Downloading: http://repo1.maven.org/maven2/org/codehaus/woodstox/stax2-api/3.1.1/stax2-api-3.1.1.pom

[INFO] snapshot org.apache.ws.commons.schema:XmlSchema:1.4.8-SNAPSHOT: checking for updates
from apache.snapshots
Downloading: http://repository.apache.org/snapshots/org/apache/ws/commons/schema/XmlSchema/1.4.8-SNAPSHOT/XmlSchema-1.4.8-SNAPSHOT.pom

[INFO] snapshot org.apache.neethi:neethi:3.0.3-SNAPSHOT: checking for updates from apache.snapshots
Downloading: http://repository.apache.org/snapshots/org/apache/neethi/neethi/3.0.3-SNAPSHOT/neethi-3.0.3-20120421.172142-38.pom

[INFO] snapshot org.apache.woden:woden-api:1.0-SNAPSHOT: checking for updates from apache.snapshots
Downloading: http://repository.apache.org/snapshots/org/apache/woden/woden-api/1.0-SNAPSHOT/woden-api-1.0-20120402.023555-405.pom

[INFO] snapshot org.apache.woden:woden:1.0-SNAPSHOT: checking for updates from apache.snapshots
Downloading: http://repository.apache.org/snapshots/org/apache/woden/woden/1.0-SNAPSHOT/woden-1.0-20120402.023554-405.pom

[INFO] snapshot org.apache.woden:woden-impl-dom:1.0-SNAPSHOT: checking for updates from apache.snapshots
Downloading: http://repository.apache.org/snapshots/org/apache/woden/woden-impl-dom/1.0-SNAPSHOT/woden-impl-dom-1.0-20120402.023557-405.pom

[INFO] snapshot org.apache.woden:woden-impl-commons:1.0-SNAPSHOT: checking for updates from
apache.snapshots
Downloading: http://repository.apache.org/snapshots/org/apache/woden/woden-impl-commons/1.0-SNAPSHOT/woden-impl-commons-1.0-20120402.023557-405.pom

Downloading: http://repository.apache.org/snapshots/org/apache/woden/woden-api/1.0-SNAPSHOT/woden-api-1.0-20120402.023555-405.jar
Downloading: http://repository.apache.org/snapshots/org/apache/axis2/axis2-kernel/1.7.0-SNAPSHOT/axis2-kernel-1.7.0-20120421.202808-665.jar
Downloading: http://repository.apache.org/snapshots/org/apache/ws/commons/schema/XmlSchema/1.4.8-SNAPSHOT/XmlSchema-1.4.8-SNAPSHOT.jar
Downloading: http://repository.apache.org/snapshots/org/apache/neethi/neethi/3.0.3-SNAPSHOT/neethi-3.0.3-20120421.172142-38.jar
Downloading: http://repository.apache.org/snapshots/org/apache/ws/commons/axiom/axiom-api/1.2.14-SNAPSHOT/axiom-api-1.2.14-20120421.170544-50.jar
69K downloaded  (neethi-3.0.3-20120421.172142-38.jar)
153K downloaded  (woden-api-1.0-20120402.023555-405.jar)
Downloading: http://repo1.maven.org/maven2/org/codehaus/woodstox/woodstox-core-asl/4.1.2/woodstox-core-asl-4.1.2.jar
145K downloaded  (XmlSchema-1.4.8-SNAPSHOT.jar)
Downloading: http://repository.apache.org/snapshots/org/apache/james/apache-mime4j-core/0.8-SNAPSHOT/apache-mime4j-core-0.8-20120421.004623-244.jar
Downloading: http://repository.apache.org/snapshots/org/apache/woden/woden-impl-dom/1.0-SNAPSHOT/woden-impl-dom-1.0-20120402.023557-405.jar
93K downloaded  (apache-mime4j-core-0.8-20120421.004623-244.jar)
407K downloaded  (axiom-api-1.2.14-20120421.170544-50.jar)
47K downloaded  (woden-impl-dom-1.0-20120402.023557-405.jar)
Downloading: http://repository.apache.org/snapshots/org/apache/ws/commons/axiom/axiom-impl/1.2.14-SNAPSHOT/axiom-impl-1.2.14-20120421.171240-50.jar
Downloading: http://repository.apache.org/snapshots/org/apache/woden/woden-impl-commons/1.0-SNAPSHOT/woden-impl-commons-1.0-20120402.023557-405.jar
154K downloaded  (axiom-impl-1.2.14-20120421.171240-50.jar)
1031K downloaded  (axis2-kernel-1.7.0-20120421.202808-665.jar)
181K downloaded  (woden-impl-commons-1.0-20120402.023557-405.jar)

Downloading: http://repo1.maven.org/maven2/org/codehaus/woodstox/stax2-api/3.1.1/stax2-api-3.1.1.jar

[INFO] [site:attach-descriptor {execution: default-attach-descriptor}]
[INFO] Parent project loaded from repository: org.apache:apache:pom:9
[INFO] Preparing source:jar
[WARNING] Removing: jar from forked lifecycle, to prevent recursive invocation.
[INFO] No goals needed for project - skipping
[INFO] [source:jar {execution: default}]
[INFO] [install:install {execution: default-install}]
[INFO] Installing <https://builds.apache.org/job/axis2-transports-trunk/ws/transports/pom.xml>
to <https://builds.apache.org/job/axis2-transports-trunk/ws/.repository/org/apache/axis2/axis2-transports/1.7.0-SNAPSHOT/axis2-transports-1.7.0-SNAPSHOT.pom>
[INFO] Installing <https://builds.apache.org/job/axis2-transports-trunk/ws/transports/target/axis2-transports-1.7.0-SNAPSHOT-site.xml>
to <https://builds.apache.org/job/axis2-transports-trunk/ws/.repository/org/apache/axis2/axis2-transports/1.7.0-SNAPSHOT/axis2-transports-1.7.0-SNAPSHOT-site.xml>
[INFO] [deploy:deploy {execution: default-deploy}]
[INFO] Retrieving previous build number from apache.snapshots.https
Uploading: https://repository.apache.org/content/repositories/snapshots/org/apache/axis2/axis2-transports/1.7.0-SNAPSHOT/axis2-transports-1.7.0-20120421.213901-323.pom
17K uploaded  (axis2-transports-1.7.0-20120421.213901-323.pom)
[INFO] Retrieving previous metadata from apache.snapshots.https
[INFO] Uploading repository metadata for: 'snapshot org.apache.axis2:axis2-transports:1.7.0-SNAPSHOT'
[INFO] Retrieving previous metadata from apache.snapshots.https
[INFO] Uploading repository metadata for: 'artifact org.apache.axis2:axis2-transports'
[INFO] Retrieving previous build number from apache.snapshots.https
Uploading: https://repository.apache.org/content/repositories/snapshots/org/apache/axis2/axis2-transports/1.7.0-SNAPSHOT/axis2-transports-1.7.0-20120421.213901-323-site.xml
2K uploaded  (axis2-transports-1.7.0-20120421.213901-323-site.xml)
[JENKINS] Archiving <https://builds.apache.org/job/axis2-transports-trunk/ws/transports/pom.xml>
to /home/hudson/hudson/jobs/axis2-transports-trunk/modules/org.apache.axis2$axis2-transports/builds/2012-04-21_21-38-13/archive/org.apache.axis2/axis2-transports/1.7.0-SNAPSHOT/axis2-transports-1.7.0-SNAPSHOT.pom
[JENKINS] Archiving <https://builds.apache.org/job/axis2-transports-trunk/ws/.repository/org/apache/axis2/axis2-transports/1.7.0-SNAPSHOT/axis2-transports-1.7.0-SNAPSHOT.pom>
to /home/hudson/hudson/jobs/axis2-transports-trunk/modules/org.apache.axis2$axis2-transports/builds/2012-04-21_21-38-13/archive/org.apache.axis2/axis2-transports/1.7.0-20120421.213901-323/axis2-transports-1.7.0-20120421.213901-323.pom
[JENKINS] Archiving <https://builds.apache.org/job/axis2-transports-trunk/ws/transports/target/axis2-transports-1.7.0-SNAPSHOT-site.xml>
to /home/hudson/hudson/jobs/axis2-transports-trunk/modules/org.apache.axis2$axis2-transports/builds/2012-04-21_21-38-13/archive/org.apache.axis2/axis2-transports/1.7.0-20120421.213901-323/axis2-transports-1.7.0-20120421.213901-323-site.xml
[INFO] ------------------------------------------------------------------------
[INFO] Building Apache Axis2 - Transport - Base
[INFO]    task-segment: [clean, deploy]
[INFO] ------------------------------------------------------------------------
[INFO] [clean:clean {execution: default-clean}]
[INFO] Deleting <https://builds.apache.org/job/axis2-transports-trunk/ws/transports/modules/base/target>
[INFO] [remote-resources:process {execution: default}]
[INFO] [resources:resources {execution: default-resources}]
[INFO] Using 'UTF-8' encoding to copy filtered resources.
[INFO] skip non existing resourceDirectory <https://builds.apache.org/job/axis2-transports-trunk/ws/transports/modules/base/src/main/resources>
[INFO] Copying 3 resources
[INFO] [compiler:compile {execution: default-compile}]
[INFO] Compiling 60 source files to <https://builds.apache.org/job/axis2-transports-trunk/ws/transports/modules/base/target/classes>
[INFO] -------------------------------------------------------------
[ERROR] COMPILATION ERROR : 
[INFO] -------------------------------------------------------------
[ERROR] <https://builds.apache.org/job/axis2-transports-trunk/ws/transports/modules/base/src/main/java/org/apache/axis2/transport/base/AbstractTransportListener.java>:[37,32]
cannot find symbol
symbol  : class UUIDGenerator
location: package org.apache.axiom.om.util
[ERROR] <https://builds.apache.org/job/axis2-transports-trunk/ws/transports/modules/base/src/main/java/org/apache/axis2/transport/base/AbstractTransportSender.java>:[36,32]
cannot find symbol
symbol  : class UUIDGenerator
location: package org.apache.axiom.om.util
[ERROR] <https://builds.apache.org/job/axis2-transports-trunk/ws/transports/modules/base/src/main/java/org/apache/axis2/transport/base/AbstractTransportListener.java>:[276,28]
cannot find symbol
symbol  : variable UUIDGenerator
location: class org.apache.axis2.transport.base.AbstractTransportListener
[ERROR] <https://builds.apache.org/job/axis2-transports-trunk/ws/transports/modules/base/src/main/java/org/apache/axis2/transport/base/AbstractTransportSender.java>:[188,36]
cannot find symbol
symbol  : variable UUIDGenerator
location: class org.apache.axis2.transport.base.AbstractTransportSender
[INFO] 4 errors 
[INFO] -------------------------------------------------------------
[JENKINS] Archiving <https://builds.apache.org/job/axis2-transports-trunk/ws/transports/modules/base/pom.xml>
to /home/hudson/hudson/jobs/axis2-transports-trunk/modules/org.apache.axis2$axis2-transport-base/builds/2012-04-21_21-38-13/archive/org.apache.axis2/axis2-transport-base/1.7.0-SNAPSHOT/axis2-transport-base-1.7.0-SNAPSHOT.pom
[INFO] ------------------------------------------------------------------------
[ERROR] BUILD FAILURE
[INFO] ------------------------------------------------------------------------
[INFO] Compilation failure

<https://builds.apache.org/job/axis2-transports-trunk/ws/transports/modules/base/src/main/java/org/apache/axis2/transport/base/AbstractTransportListener.java>:[37,32]
cannot find symbol
symbol  : class UUIDGenerator
location: package org.apache.axiom.om.util
<https://builds.apache.org/job/axis2-transports-trunk/ws/transports/modules/base/src/main/java/org/apache/axis2/transport/base/AbstractTransportSender.java>:[36,32]
cannot find symbol
symbol  : class UUIDGenerator
location: package org.apache.axiom.om.util
<https://builds.apache.org/job/axis2-transports-trunk/ws/transports/modules/base/src/main/java/org/apache/axis2/transport/base/AbstractTransportListener.java>:[276,28]
cannot find symbol
symbol  : variable UUIDGenerator
location: class org.apache.axis2.transport.base.AbstractTransportListener
<https://builds.apache.org/job/axis2-transports-trunk/ws/transports/modules/base/src/main/java/org/apache/axis2/transport/base/AbstractTransportSender.java>:[188,36]
cannot find symbol
symbol  : variable UUIDGenerator
location: class org.apache.axis2.transport.base.AbstractTransportSender

[INFO] ------------------------------------------------------------------------
[INFO] For more information, run Maven with the -e switch
[INFO] ------------------------------------------------------------------------
[INFO] Total time: 34 seconds
[INFO] Finished at: Sat Apr 21 21:39:15 UTC 2012
[INFO] Final Memory: 41M/212M
[INFO] ------------------------------------------------------------------------
channel stopped
[locks-and-latches] Releasing all the locks
[locks-and-latches] All the locks released

---------------------------------------------------------------------
To unsubscribe, e-mail: java-dev-unsubscribe@axis.apache.org
For additional commands, e-mail: java-dev-help@axis.apache.org


Mime
View raw message