axis-java-dev mailing list archives

Site index · List index
Message view « Date » · « Thread »
Top « Date » · « Thread »
From Apache Jenkins Server <jenk...@builds.apache.org>
Subject Build failed in Jenkins: axis-trunk #122
Date Thu, 22 Mar 2012 21:32:46 GMT
See <https://builds.apache.org/job/axis-trunk/122/changes>

Changes:

[veithen] Maven site improvements.

------------------------------------------
[...truncated 8258 lines...]
Downloading: http://repo1.maven.org/maven2/org/apache/cxf/cxf-rt-transports-http-jetty/2.4.4/cxf-rt-transports-http-jetty-2.4.4.jar
Downloaded: http://repo1.maven.org/maven2/org/apache/cxf/cxf-rt-transports-common/2.4.4/cxf-rt-transports-common-2.4.4.jar
(18 KB at 7.2 KB/sec)
Downloaded: http://repo1.maven.org/maven2/org/apache/cxf/cxf-rt-ws-addr/2.4.4/cxf-rt-ws-addr-2.4.4.jar
(85 KB at 38.6 KB/sec)
Downloaded: http://repo1.maven.org/maven2/org/springframework/spring-web/3.0.6.RELEASE/spring-web-3.0.6.RELEASE.jar
(389 KB at 142.4 KB/sec)
Downloaded: http://repo1.maven.org/maven2/com/sun/xml/messaging/saaj/saaj-impl/1.3.12/saaj-impl-1.3.12.jar
(284 KB at 113.7 KB/sec)
Downloaded: http://repo1.maven.org/maven2/org/apache/cxf/cxf-rt-transports-http-jetty/2.4.4/cxf-rt-transports-http-jetty-2.4.4.jar
(67 KB at 43.5 KB/sec)
[INFO] 
[INFO] --- maven-clean-plugin:2.4.1:clean (default-clean) @ mtomstub-sample ---
[INFO] 
[INFO] --- maven-remote-resources-plugin:1.1:process (default) @ mtomstub-sample ---
[INFO] Using 'UTF-8' encoding to copy filtered resources.
[INFO] [INFO] Copying 1 resource
[INFO] Copying 3 resources

[INFO] --- maven-resources-plugin:2.4.3:resources (default-resources) @ mtomstub-sample ---
[INFO] [INFO] Compiling 3 source files to <https://builds.apache.org/job/axis-trunk/ws/axis/samples/mtomstub-sample/target/classes>

[INFO] --- maven-compiler-plugin:2.3.2:compile (default-compile) @ mtomstub-sample ---
[INFO] Downloading: http://repo1.maven.org/maven2/org/apache/cxf/cxf-tools-java2ws/2.4.4/cxf-tools-java2ws-2.4.4.pom

[INFO] --- cxf-java2ws-plugin:2.4.4:java2ws (process-classes) @ mtomstub-sample ---
Downloaded: http://repo1.maven.org/maven2/org/apache/cxf/cxf-tools-java2ws/2.4.4/cxf-tools-java2ws-2.4.4.pom
(8 KB at 23.8 KB/sec)
Downloading: http://repo1.maven.org/maven2/org/apache/cxf/cxf-tools-wsdlto-core/2.4.4/cxf-tools-wsdlto-core-2.4.4.pom
Downloaded: http://repo1.maven.org/maven2/org/apache/cxf/cxf-tools-wsdlto-core/2.4.4/cxf-tools-wsdlto-core-2.4.4.pom
(6 KB at 10.9 KB/sec)
Downloading: http://repo1.maven.org/maven2/org/apache/cxf/cxf-tools-validator/2.4.4/cxf-tools-validator-2.4.4.pom
Downloaded: http://repo1.maven.org/maven2/org/apache/cxf/cxf-tools-validator/2.4.4/cxf-tools-validator-2.4.4.pom
(5 KB at 9.2 KB/sec)
Downloading: http://repo1.maven.org/maven2/org/apache/cxf/cxf-tools-wsdlto-databinding-jaxb/2.4.4/cxf-tools-wsdlto-databinding-jaxb-2.4.4.pom
Downloaded: http://repo1.maven.org/maven2/org/apache/cxf/cxf-tools-wsdlto-databinding-jaxb/2.4.4/cxf-tools-wsdlto-databinding-jaxb-2.4.4.pom
(3 KB at 5.0 KB/sec)
Downloading: http://repo1.maven.org/maven2/org/apache/cxf/cxf-tools-wsdlto-frontend-jaxws/2.4.4/cxf-tools-wsdlto-frontend-jaxws-2.4.4.pom
Downloaded: http://repo1.maven.org/maven2/org/apache/cxf/cxf-tools-wsdlto-frontend-jaxws/2.4.4/cxf-tools-wsdlto-frontend-jaxws-2.4.4.pom
(3 KB at 5.6 KB/sec)
Downloading: http://repo1.maven.org/maven2/org/apache/cxf/cxf-rt-javascript/2.4.4/cxf-rt-javascript-2.4.4.pom
Downloaded: http://repo1.maven.org/maven2/org/apache/cxf/cxf-rt-javascript/2.4.4/cxf-rt-javascript-2.4.4.pom
(6 KB at 11.0 KB/sec)
Downloading: http://repo1.maven.org/maven2/org/apache/cxf/cxf-rt-transports-local/2.4.4/cxf-rt-transports-local-2.4.4.pom
Downloaded: http://repo1.maven.org/maven2/org/apache/cxf/cxf-rt-transports-local/2.4.4/cxf-rt-transports-local-2.4.4.pom
(3 KB at 5.0 KB/sec)
Downloading: http://repo1.maven.org/maven2/org/apache/cxf/cxf-rt-databinding-aegis/2.4.4/cxf-rt-databinding-aegis-2.4.4.pom
Downloaded: http://repo1.maven.org/maven2/org/apache/cxf/cxf-rt-databinding-aegis/2.4.4/cxf-rt-databinding-aegis-2.4.4.pom
(5 KB at 9.8 KB/sec)
Downloading: http://repo1.maven.org/maven2/com/sun/xml/bind/jaxb-xjc/2.2.4-1/jaxb-xjc-2.2.4-1.jar
Downloading: http://repo1.maven.org/maven2/org/apache/cxf/cxf-tools-java2ws/2.4.4/cxf-tools-java2ws-2.4.4.jar
Downloading: http://repo1.maven.org/maven2/org/apache/cxf/cxf-tools-wsdlto-core/2.4.4/cxf-tools-wsdlto-core-2.4.4.jar
Downloading: http://repo1.maven.org/maven2/org/apache/cxf/cxf-tools-validator/2.4.4/cxf-tools-validator-2.4.4.jar
Downloading: http://repo1.maven.org/maven2/org/apache/cxf/cxf-tools-wsdlto-databinding-jaxb/2.4.4/cxf-tools-wsdlto-databinding-jaxb-2.4.4.jar
Downloaded: http://repo1.maven.org/maven2/org/apache/cxf/cxf-tools-java2ws/2.4.4/cxf-tools-java2ws-2.4.4.jar
(116 KB at 79.5 KB/sec)
Downloading: http://repo1.maven.org/maven2/org/apache/cxf/cxf-tools-wsdlto-frontend-jaxws/2.4.4/cxf-tools-wsdlto-frontend-jaxws-2.4.4.jar
Downloaded: http://repo1.maven.org/maven2/org/apache/cxf/cxf-tools-wsdlto-core/2.4.4/cxf-tools-wsdlto-core-2.4.4.jar
(50 KB at 29.3 KB/sec)
Downloading: http://repo1.maven.org/maven2/org/apache/cxf/cxf-rt-javascript/2.4.4/cxf-rt-javascript-2.4.4.jar
Downloaded: http://repo1.maven.org/maven2/org/apache/cxf/cxf-tools-validator/2.4.4/cxf-tools-validator-2.4.4.jar
(67 KB at 34.4 KB/sec)
Downloading: http://repo1.maven.org/maven2/org/apache/cxf/cxf-rt-transports-local/2.4.4/cxf-rt-transports-local-2.4.4.jar
Downloaded: http://repo1.maven.org/maven2/org/apache/cxf/cxf-tools-wsdlto-databinding-jaxb/2.4.4/cxf-tools-wsdlto-databinding-jaxb-2.4.4.jar
(39 KB at 17.5 KB/sec)
Downloading: http://repo1.maven.org/maven2/org/apache/cxf/cxf-rt-databinding-aegis/2.4.4/cxf-rt-databinding-aegis-2.4.4.jar
Downloaded: http://repo1.maven.org/maven2/org/apache/cxf/cxf-tools-wsdlto-frontend-jaxws/2.4.4/cxf-tools-wsdlto-frontend-jaxws-2.4.4.jar
(157 KB at 78.4 KB/sec)
Downloaded: http://repo1.maven.org/maven2/com/sun/xml/bind/jaxb-xjc/2.2.4-1/jaxb-xjc-2.2.4-1.jar
(3100 KB at 840.1 KB/sec)
Downloaded: http://repo1.maven.org/maven2/org/apache/cxf/cxf-rt-javascript/2.4.4/cxf-rt-javascript-2.4.4.jar
(68 KB at 30.3 KB/sec)
Downloaded: http://repo1.maven.org/maven2/org/apache/cxf/cxf-rt-transports-local/2.4.4/cxf-rt-transports-local-2.4.4.jar
(24 KB at 10.6 KB/sec)
Downloaded: http://repo1.maven.org/maven2/org/apache/cxf/cxf-rt-databinding-aegis/2.4.4/cxf-rt-databinding-aegis-2.4.4.jar
(232 KB at 102.6 KB/sec)
Mar 22, 2012 9:32:33 PM org.apache.cxf.service.factory.ReflectionServiceFactoryBean buildServiceFromClass
INFO: Creating Service {http://service.mtomstub.samples/}DownloadFileService from class samples.mtomstub.service.DownloadFile
[INFO] [INFO] Processing <https://builds.apache.org/job/axis-trunk/ws/axis/samples/mtomstub-sample/target/generated/wsdl/DownloadFile.wsdl>

[INFO] --- maven-wsdl2java-plugin:1.4.1-SNAPSHOT:wsdl2java-test (default) @ mtomstub-sample
---
[INFO] Using 'UTF-8' encoding to copy filtered resources.
[INFO] [INFO] skip non existing resourceDirectory <https://builds.apache.org/job/axis-trunk/ws/axis/samples/mtomstub-sample/src/test/resources>
[INFO] Copying 3 resources

[INFO] --- maven-resources-plugin:2.4.3:testResources (default-testResources) @ mtomstub-sample
---
[INFO] [INFO] Compiling 7 source files to <https://builds.apache.org/job/axis-trunk/ws/axis/samples/mtomstub-sample/target/test-classes>

[INFO] --- maven-compiler-plugin:2.3.2:testCompile (default-testCompile) @ mtomstub-sample
---
[INFO] [INFO] Surefire report directory: <https://builds.apache.org/job/axis-trunk/ws/axis/samples/mtomstub-sample/target/surefire-reports>

-------------------------------------------------------
 T E S T S
-------------------------------------------------------

[INFO] --- maven-surefire-plugin:2.11:test (default-test) @ mtomstub-sample ---
Running samples.mtomstub.TestDownloadFile
Mar 22, 2012 9:32:36 PM org.apache.cxf.service.factory.ReflectionServiceFactoryBean buildServiceFromClass
INFO: Creating Service {http://service.mtomstub.samples/}DownloadFileWS from class samples.mtomstub.service.DownloadFile
Mar 22, 2012 9:32:37 PM org.apache.cxf.endpoint.ServerImpl initDestination
INFO: Setting the server's publish address to be http://localhost:8080/DownloadFile
SLF4J: Failed to load class "org.slf4j.impl.StaticLoggerBinder".
SLF4J: Defaulting to no-operation (NOP) logger implementation
SLF4J: See http://www.slf4j.org/codes.html#StaticLoggerBinder for further details.
This is the contentTests run: 1, Failures: 0, Errors: 0, Skipped: 0, Time elapsed: 2.017 sec

Results :

Tests run: 1, Failures: 0, Errors: 0, Skipped: 0

[JENKINS] Recording test results
[INFO] 
[INFO] --- maven-jar-plugin:2.3.2:jar (default-jar) @ mtomstub-sample ---
[INFO] Building jar: <https://builds.apache.org/job/axis-trunk/ws/axis/samples/mtomstub-sample/target/mtomstub-sample-1.4.1-SNAPSHOT.jar>
[INFO] [INFO] Skipping the assembly in this project because it's not the Execution Root

[INFO] --- maven-assembly-plugin:2.2.2:single (source-release-assembly) @ mtomstub-sample
---
Mar 22, 2012 9:32:39 PM hudson.maven.ExecutedMojo <init>
WARNING: Failed to getClass for org.apache.maven.plugin.source.SourceJarMojo
[INFO] 
[INFO] --- maven-source-plugin:2.1.2:jar (attach-sources) @ mtomstub-sample ---
[INFO] META-INF already added, skipping
[INFO] META-INF/LICENSE already added, skipping
[INFO] META-INF/NOTICE already added, skipping
[INFO] META-INF/DEPENDENCIES already added, skipping
[INFO] Building jar: <https://builds.apache.org/job/axis-trunk/ws/axis/samples/mtomstub-sample/target/mtomstub-sample-1.4.1-SNAPSHOT-sources.jar>
[INFO] META-INF already added, skipping
[INFO] META-INF/LICENSE already added, skipping
[INFO] META-INF/NOTICE already added, skipping
[INFO] META-INF/DEPENDENCIES already added, skipping
[INFO] 
[INFO] --- maven-javadoc-plugin:2.5:jar (attach-javadocs) @ mtomstub-sample ---
Loading source files for package samples.mtomstub.service...
2 errors
[JENKINS] Archiving <https://builds.apache.org/job/axis-trunk/ws/axis/samples/mtomstub-sample/pom.xml>
to /home/hudson/hudson/jobs/axis-trunk/modules/org.apache.axis$mtomstub-sample/builds/2012-03-22_21-19-43/archive/org.apache.axis/mtomstub-sample/1.4.1-SNAPSHOT/mtomstub-sample-1.4.1-SNAPSHOT.pom
[JENKINS] Archiving <https://builds.apache.org/job/axis-trunk/ws/axis/samples/mtomstub-sample/target/mtomstub-sample-1.4.1-SNAPSHOT.jar>
to /home/hudson/hudson/jobs/axis-trunk/modules/org.apache.axis$mtomstub-sample/builds/2012-03-22_21-19-43/archive/org.apache.axis/mtomstub-sample/1.4.1-SNAPSHOT/mtomstub-sample-1.4.1-SNAPSHOT.jar
[JENKINS] Archiving <https://builds.apache.org/job/axis-trunk/ws/axis/samples/mtomstub-sample/target/generated/wsdl/DownloadFile.wsdl>
to /home/hudson/hudson/jobs/axis-trunk/modules/org.apache.axis$mtomstub-sample/builds/2012-03-22_21-19-43/archive/org.apache.axis/mtomstub-sample/1.4.1-SNAPSHOT/mtomstub-sample-1.4.1-SNAPSHOT.wsdl
[JENKINS] Archiving <https://builds.apache.org/job/axis-trunk/ws/axis/samples/mtomstub-sample/target/mtomstub-sample-1.4.1-SNAPSHOT-sources.jar>
to /home/hudson/hudson/jobs/axis-trunk/modules/org.apache.axis$mtomstub-sample/builds/2012-03-22_21-19-43/archive/org.apache.axis/mtomstub-sample/1.4.1-SNAPSHOT/mtomstub-sample-1.4.1-SNAPSHOT-sources.jar
[INFO] ------------------------------------------------------------------------
[INFO] Reactor Summary:
[INFO] 
[INFO] Axis .............................................. SUCCESS [1:25.111s]
[INFO] Axis :: SAAJ ...................................... SUCCESS [10.088s]
[INFO] Axis :: JAX-RPC ................................... SUCCESS [8.622s]
[INFO] Axis :: Core ...................................... SUCCESS [1:59.653s]
[INFO] Axis :: Ant tasks ................................. SUCCESS [17.823s]
[INFO] Axis :: Maven ..................................... SUCCESS [4.236s]
[INFO] Maven plugin common classes ....................... SUCCESS [6.017s]
[INFO] Axis :: Maven :: maven-wsdl2java-plugin ........... SUCCESS [16.002s]
[INFO] Axis :: Maven :: maven-java2wsdl-plugin ........... SUCCESS [13.466s]
[INFO] Axis :: Maven :: maven-axis-server-plugin ......... SUCCESS [13.203s]
[INFO] Axis :: Stand-alone server ........................ SUCCESS [16.725s]
[INFO] Castor support .................................... SUCCESS [16.108s]
[INFO] java.net HTTP Transport ........................... SUCCESS [22.988s]
[INFO] JMS support ....................................... SUCCESS [16.167s]
[INFO] Axis :: Integration tests ......................... SUCCESS [48.078s]
[INFO] Axis :: WAR ....................................... SUCCESS [43.486s]
[INFO] Samples ........................................... SUCCESS [1.279s]
[INFO] Attachments Sample ................................ SUCCESS [9.552s]
[INFO] Bidbuy Sample ..................................... SUCCESS [10.276s]
[INFO] Echo Sample ....................................... SUCCESS [10.328s]
[INFO] Encoding Sample ................................... SUCCESS [10.224s]
[INFO] Faults Sample ..................................... SUCCESS [9.171s]
[INFO] Handler Sample .................................... SUCCESS [9.557s]
[INFO] JAXM Sample ....................................... SUCCESS [26.877s]
[INFO] Stock Quote Sample ................................ SUCCESS [10.663s]
[INFO] JAX-RPC Sample .................................... SUCCESS [12.885s]
[INFO] Message Sample .................................... SUCCESS [9.036s]
[INFO] MTOM Stub Sample .................................. FAILURE [38.675s]
[INFO] Misc Sample ....................................... SKIPPED
[INFO] Transport Sample .................................. SKIPPED
[INFO] Proxy Sample ...................................... SKIPPED
[INFO] Distribution ...................................... SKIPPED
[INFO] ------------------------------------------------------------------------
[INFO] BUILD FAILURE
[INFO] ------------------------------------------------------------------------
[INFO] Total time: 12:44.409s
[INFO] Finished at: Thu Mar 22 21:32:43 UTC 2012
[INFO] Final Memory: 48M/208M
[INFO] ------------------------------------------------------------------------
Waiting for Jenkins to finish collecting data
mavenExecutionResult exceptions not empty
message : Failed to execute goal org.apache.maven.plugins:maven-javadoc-plugin:2.5:jar (attach-javadocs)
on project mtomstub-sample: MavenReportException: Error while creating archive:Exit code:
1 - <https://builds.apache.org/job/axis-trunk/ws/axis/samples/mtomstub-sample/src/main/java/samples/mtomstub/service/DownloadFile.java>:6:
annotations are not supported in -source 1.4
(try -source 1.5 to enable annotations)
@WebService
 ^
<https://builds.apache.org/job/axis-trunk/ws/axis/samples/mtomstub-sample/src/main/java/samples/mtomstub/service/DownloadFileImpl.java>:7:
annotations are not supported in -source 1.4
(try -source 1.5 to enable annotations)
@WebService(endpointInterface="samples.mtomstub.service.DownloadFile", serviceName = "DownloadFileWS")
 ^

Command line was:/home/jenkins/tools/java/jdk1.5.0_22-32/jre/../bin/javadoc @options @packages
cause : MavenReportException: Error while creating archive:Exit code: 1 - <https://builds.apache.org/job/axis-trunk/ws/axis/samples/mtomstub-sample/src/main/java/samples/mtomstub/service/DownloadFile.java>:6:
annotations are not supported in -source 1.4
(try -source 1.5 to enable annotations)
@WebService
 ^
<https://builds.apache.org/job/axis-trunk/ws/axis/samples/mtomstub-sample/src/main/java/samples/mtomstub/service/DownloadFileImpl.java>:7:
annotations are not supported in -source 1.4
(try -source 1.5 to enable annotations)
@WebService(endpointInterface="samples.mtomstub.service.DownloadFile", serviceName = "DownloadFileWS")
 ^

Command line was:/home/jenkins/tools/java/jdk1.5.0_22-32/jre/../bin/javadoc @options @packages
Stack trace : 
org.apache.maven.lifecycle.LifecycleExecutionException: Failed to execute goal org.apache.maven.plugins:maven-javadoc-plugin:2.5:jar
(attach-javadocs) on project mtomstub-sample: MavenReportException: Error while creating archive:Exit
code: 1 - <https://builds.apache.org/job/axis-trunk/ws/axis/samples/mtomstub-sample/src/main/java/samples/mtomstub/service/DownloadFile.java>:6:
annotations are not supported in -source 1.4
(try -source 1.5 to enable annotations)
@WebService
 ^
<https://builds.apache.org/job/axis-trunk/ws/axis/samples/mtomstub-sample/src/main/java/samples/mtomstub/service/DownloadFileImpl.java>:7:
annotations are not supported in -source 1.4
(try -source 1.5 to enable annotations)
@WebService(endpointInterface="samples.mtomstub.service.DownloadFile", serviceName = "DownloadFileWS")
 ^

Command line was:/home/jenkins/tools/java/jdk1.5.0_22-32/jre/../bin/javadoc @options @packages
	at org.apache.maven.lifecycle.internal.MojoExecutor.execute(MojoExecutor.java:217)
	at org.apache.maven.lifecycle.internal.MojoExecutor.execute(MojoExecutor.java:153)
	at org.apache.maven.lifecycle.internal.MojoExecutor.execute(MojoExecutor.java:145)
	at org.apache.maven.lifecycle.internal.LifecycleModuleBuilder.buildProject(LifecycleModuleBuilder.java:84)
	at org.apache.maven.lifecycle.internal.LifecycleModuleBuilder.buildProject(LifecycleModuleBuilder.java:59)
	at org.apache.maven.lifecycle.internal.LifecycleStarter.singleThreadedBuild(LifecycleStarter.java:183)
	at org.apache.maven.lifecycle.internal.LifecycleStarter.execute(LifecycleStarter.java:161)
	at org.apache.maven.DefaultMaven.doExecute(DefaultMaven.java:319)
	at org.apache.maven.DefaultMaven.execute(DefaultMaven.java:156)
	at org.jvnet.hudson.maven3.launcher.Maven3Launcher.main(Maven3Launcher.java:79)
	at sun.reflect.NativeMethodAccessorImpl.invoke0(Native Method)
	at sun.reflect.NativeMethodAccessorImpl.invoke(NativeMethodAccessorImpl.java:39)
	at sun.reflect.DelegatingMethodAccessorImpl.invoke(DelegatingMethodAccessorImpl.java:25)
	at java.lang.reflect.Method.invoke(Method.java:592)
	at org.codehaus.plexus.classworlds.launcher.Launcher.launchStandard(Launcher.java:329)
	at org.codehaus.plexus.classworlds.launcher.Launcher.launch(Launcher.java:239)
	at org.jvnet.hudson.maven3.agent.Maven3Main.launch(Maven3Main.java:158)
	at hudson.maven.Maven3Builder.call(Maven3Builder.java:104)
	at hudson.maven.Maven3Builder.call(Maven3Builder.java:70)
	at hudson.remoting.UserRequest.perform(UserRequest.java:118)
	at hudson.remoting.UserRequest.perform(UserRequest.java:48)
	at hudson.remoting.Request$2.run(Request.java:287)
	at hudson.remoting.InterceptingExecutorService$1.call(InterceptingExecutorService.java:72)
	at java.util.concurrent.FutureTask$Sync.innerRun(FutureTask.java:269)
	at java.util.concurrent.FutureTask.run(FutureTask.java:123)
	at java.util.concurrent.ThreadPoolExecutor$Worker.runTask(ThreadPoolExecutor.java:651)
	at java.util.concurrent.ThreadPoolExecutor$Worker.run(ThreadPoolExecutor.java:676)
	at java.lang.Thread.run(Thread.java:595)
Caused by: org.apache.maven.plugin.MojoExecutionException: MavenReportException: Error while
creating archive:Exit code: 1 - <https://builds.apache.org/job/axis-trunk/ws/axis/samples/mtomstub-sample/src/main/java/samples/mtomstub/service/DownloadFile.java>:6:
annotations are not supported in -source 1.4
(try -source 1.5 to enable annotations)
@WebService
 ^
<https://builds.apache.org/job/axis-trunk/ws/axis/samples/mtomstub-sample/src/main/java/samples/mtomstub/service/DownloadFileImpl.java>:7:
annotations are not supported in -source 1.4
(try -source 1.5 to enable annotations)
@WebService(endpointInterface="samples.mtomstub.service.DownloadFile", serviceName = "DownloadFileWS")
 ^

Command line was:/home/jenkins/tools/java/jdk1.5.0_22-32/jre/../bin/javadoc @options @packages
	at org.apache.maven.plugin.javadoc.JavadocJar.execute(JavadocJar.java:226)
	at org.apache.maven.plugin.DefaultBuildPluginManager.executeMojo(DefaultBuildPluginManager.java:101)
	at org.apache.maven.lifecycle.internal.MojoExecutor.execute(MojoExecutor.java:209)
	... 27 more
Caused by: org.apache.maven.reporting.MavenReportException: Exit code: 1 - <https://builds.apache.org/job/axis-trunk/ws/axis/samples/mtomstub-sample/src/main/java/samples/mtomstub/service/DownloadFile.java>:6:
annotations are not supported in -source 1.4
(try -source 1.5 to enable annotations)
@WebService
 ^
<https://builds.apache.org/job/axis-trunk/ws/axis/samples/mtomstub-sample/src/main/java/samples/mtomstub/service/DownloadFileImpl.java>:7:
annotations are not supported in -source 1.4
(try -source 1.5 to enable annotations)
@WebService(endpointInterface="samples.mtomstub.service.DownloadFile", serviceName = "DownloadFileWS")
 ^

Command line was:/home/jenkins/tools/java/jdk1.5.0_22-32/jre/../bin/javadoc @options @packages
	at org.apache.maven.plugin.javadoc.AbstractJavadocMojo.executeJavadocCommandLine(AbstractJavadocMojo.java:4013)
	at org.apache.maven.plugin.javadoc.AbstractJavadocMojo.executeReport(AbstractJavadocMojo.java:1593)
	at org.apache.maven.plugin.javadoc.JavadocJar.execute(JavadocJar.java:182)
	... 29 more
Sending e-mails to: java-dev@axis.apache.org
channel stopped

---------------------------------------------------------------------
To unsubscribe, e-mail: java-dev-unsubscribe@axis.apache.org
For additional commands, e-mail: java-dev-help@axis.apache.org


Mime
View raw message