axis-java-dev mailing list archives

Site index · List index
Message view « Date » · « Thread »
Top « Date » · « Thread »
From Apache Jenkins Server <jenk...@builds.apache.org>
Subject Build failed in Jenkins: axis2-1.5 #346
Date Fri, 02 Mar 2012 07:33:07 GMT
See <https://builds.apache.org/job/axis2-1.5/346/>

------------------------------------------
[...truncated 9999 lines...]
Generating <https://builds.apache.org/job/axis2-1.5/ws/axis2/modules/scripting/target/apidocs/org/apache/axis2/scripting/class-use//ScriptMessageContext.html...>
Generating <https://builds.apache.org/job/axis2-1.5/ws/axis2/modules/scripting/target/apidocs/org/apache/axis2/scripting/class-use//ScriptInvoker.html...>
Generating <https://builds.apache.org/job/axis2-1.5/ws/axis2/modules/scripting/target/apidocs/org/apache/axis2/scripting/class-use//ScriptReceiver.html...>
Generating <https://builds.apache.org/job/axis2-1.5/ws/axis2/modules/scripting/target/apidocs/org/apache/axis2/scripting/class-use//ScriptModule.html...>
Generating <https://builds.apache.org/job/axis2-1.5/ws/axis2/modules/scripting/target/apidocs/org/apache/axis2/scripting/class-use//ScriptDeploymentEngine.html...>
Generating <https://builds.apache.org/job/axis2-1.5/ws/axis2/modules/scripting/target/apidocs/org/apache/axis2/scripting/class-use//ScriptRepositoryListener.html...>
Generating <https://builds.apache.org/job/axis2-1.5/ws/axis2/modules/scripting/target/apidocs/org/apache/axis2/scripting/convertors/class-use//DefaultOMElementConvertor.html...>
Generating <https://builds.apache.org/job/axis2-1.5/ws/axis2/modules/scripting/target/apidocs/org/apache/axis2/scripting/convertors/class-use//RBOMElementConvertor.html...>
Generating <https://builds.apache.org/job/axis2-1.5/ws/axis2/modules/scripting/target/apidocs/org/apache/axis2/scripting/convertors/class-use//ConvertorFactory.html...>
Generating <https://builds.apache.org/job/axis2-1.5/ws/axis2/modules/scripting/target/apidocs/org/apache/axis2/scripting/convertors/class-use//OMElementConvertor.html...>
Generating <https://builds.apache.org/job/axis2-1.5/ws/axis2/modules/scripting/target/apidocs/org/apache/axis2/scripting/convertors/class-use//JSOMElementConvertor.html...>
Generating <https://builds.apache.org/job/axis2-1.5/ws/axis2/modules/scripting/target/apidocs/org/apache/axis2/scripting//package-use.html...>
Generating <https://builds.apache.org/job/axis2-1.5/ws/axis2/modules/scripting/target/apidocs/org/apache/axis2/scripting/convertors//package-use.html...>
Building index for all the packages and classes...
Generating <https://builds.apache.org/job/axis2-1.5/ws/axis2/modules/scripting/target/apidocs/overview-tree.html...>
Generating <https://builds.apache.org/job/axis2-1.5/ws/axis2/modules/scripting/target/apidocs/index-all.html...>
Generating <https://builds.apache.org/job/axis2-1.5/ws/axis2/modules/scripting/target/apidocs/deprecated-list.html...>
Building index for all classes...
Generating <https://builds.apache.org/job/axis2-1.5/ws/axis2/modules/scripting/target/apidocs/allclasses-frame.html...>
Generating <https://builds.apache.org/job/axis2-1.5/ws/axis2/modules/scripting/target/apidocs/allclasses-noframe.html...>
Generating <https://builds.apache.org/job/axis2-1.5/ws/axis2/modules/scripting/target/apidocs/index.html...>
Generating <https://builds.apache.org/job/axis2-1.5/ws/axis2/modules/scripting/target/apidocs/overview-summary.html...>
Generating <https://builds.apache.org/job/axis2-1.5/ws/axis2/modules/scripting/target/apidocs/help-doc.html...>
Generating <https://builds.apache.org/job/axis2-1.5/ws/axis2/modules/scripting/target/apidocs/stylesheet.css...>
[INFO] Building jar: <https://builds.apache.org/job/axis2-1.5/ws/axis2/modules/scripting/target/scripting-1.5.7-SNAPSHOT-javadoc.jar>
[INFO] [gpg:sign {execution: default}]
[INFO] [install:install {execution: default-install}]
[INFO] Installing <https://builds.apache.org/job/axis2-1.5/ws/axis2/modules/scripting/target/scripting-1.5.7-SNAPSHOT.mar>
to /home/jenkins/jenkins-slave/maven-repositories/0/org/apache/axis2/scripting/1.5.7-SNAPSHOT/scripting-1.5.7-SNAPSHOT.mar
[INFO] Installing <https://builds.apache.org/job/axis2-1.5/ws/axis2/modules/scripting/target/scripting-1.5.7-SNAPSHOT-sources.jar>
to /home/jenkins/jenkins-slave/maven-repositories/0/org/apache/axis2/scripting/1.5.7-SNAPSHOT/scripting-1.5.7-SNAPSHOT-sources.jar
[INFO] Installing <https://builds.apache.org/job/axis2-1.5/ws/axis2/modules/scripting/target/scripting-1.5.7-SNAPSHOT-javadoc.jar>
to /home/jenkins/jenkins-slave/maven-repositories/0/org/apache/axis2/scripting/1.5.7-SNAPSHOT/scripting-1.5.7-SNAPSHOT-javadoc.jar
[INFO] [deploy:deploy {execution: default-deploy}]
[INFO] Retrieving previous build number from apache.snapshots.https
[WARNING] *** CHECKSUM FAILED - Checksum failed on download: local = 'c6a66a65dde9baa81d1f09f63acdad530328f079';
remote = '17eef3fc179e907e2afa2f65dea69579c0af61ba' - RETRYING
[WARNING] *** CHECKSUM FAILED - Checksum failed on download: local = 'c6a66a65dde9baa81d1f09f63acdad530328f079';
remote = '17eef3fc179e907e2afa2f65dea69579c0af61ba' - IGNORING
Uploading: https://repository.apache.org/content/repositories/snapshots/org/apache/axis2/scripting/1.5.7-SNAPSHOT/scripting-1.5.7-20120302.071929-163.mar
33K uploaded  (scripting-1.5.7-20120302.071929-163.mar)
[INFO] Retrieving previous metadata from apache.snapshots.https
[INFO] Uploading repository metadata for: 'artifact org.apache.axis2:scripting'
[INFO] Retrieving previous metadata from apache.snapshots.https
[WARNING] *** CHECKSUM FAILED - Checksum failed on download: local = 'c6a66a65dde9baa81d1f09f63acdad530328f079';
remote = '17eef3fc179e907e2afa2f65dea69579c0af61ba' - RETRYING
[WARNING] *** CHECKSUM FAILED - Checksum failed on download: local = 'c6a66a65dde9baa81d1f09f63acdad530328f079';
remote = '17eef3fc179e907e2afa2f65dea69579c0af61ba' - IGNORING
[INFO] Uploading repository metadata for: 'snapshot org.apache.axis2:scripting:1.5.7-SNAPSHOT'
[INFO] Uploading project information for scripting 1.5.7-20120302.071929-163
[INFO] Retrieving previous build number from apache.snapshots.https
Uploading: https://repository.apache.org/content/repositories/snapshots/org/apache/axis2/scripting/1.5.7-SNAPSHOT/scripting-1.5.7-20120302.071929-163-sources.jar
28K uploaded  (scripting-1.5.7-20120302.071929-163-sources.jar)
[INFO] Retrieving previous build number from apache.snapshots.https
Uploading: https://repository.apache.org/content/repositories/snapshots/org/apache/axis2/scripting/1.5.7-SNAPSHOT/scripting-1.5.7-20120302.071929-163-javadoc.jar
97K uploaded  (scripting-1.5.7-20120302.071929-163-javadoc.jar)
[JENKINS] Archiving <https://builds.apache.org/job/axis2-1.5/ws/axis2/modules/scripting/pom.xml>
to /home/hudson/hudson/jobs/axis2-1.5/modules/org.apache.axis2$scripting/builds/2012-03-02_07-17-49/archive/org.apache.axis2/scripting/1.5.7-SNAPSHOT/scripting-1.5.7-SNAPSHOT.pom
[JENKINS] Archiving <https://builds.apache.org/job/axis2-1.5/ws/axis2/modules/scripting/target/scripting-1.5.7-SNAPSHOT.mar>
to /home/hudson/hudson/jobs/axis2-1.5/modules/org.apache.axis2$scripting/builds/2012-03-02_07-17-49/archive/org.apache.axis2/scripting/1.5.7-20120302.071929-163/scripting-1.5.7-20120302.071929-163.mar
[JENKINS] Archiving <https://builds.apache.org/job/axis2-1.5/ws/axis2/modules/scripting/target/scripting-1.5.7-SNAPSHOT-sources.jar>
to /home/hudson/hudson/jobs/axis2-1.5/modules/org.apache.axis2$scripting/builds/2012-03-02_07-17-49/archive/org.apache.axis2/scripting/1.5.7-20120302.071929-163/scripting-1.5.7-20120302.071929-163-sources.jar
[JENKINS] Archiving <https://builds.apache.org/job/axis2-1.5/ws/axis2/modules/scripting/target/scripting-1.5.7-SNAPSHOT-javadoc.jar>
to /home/hudson/hudson/jobs/axis2-1.5/modules/org.apache.axis2$scripting/builds/2012-03-02_07-17-49/archive/org.apache.axis2/scripting/1.5.7-20120302.071929-163/scripting-1.5.7-20120302.071929-163-javadoc.jar
[INFO] ------------------------------------------------------------------------
[INFO] Building Apache Axis2 - JAXB-RI Data Binding
[INFO]    task-segment: [clean, deploy]
[INFO] ------------------------------------------------------------------------
[INFO] [clean:clean {execution: default-clean}]
[INFO] [remote-resources:process {execution: default}]
Downloading: http://repo1.maven.org/maven2/com/sun/xml/bind/jaxb-impl/2.1.7/jaxb-impl-2.1.7.pom

Downloading: http://repo1.maven.org/maven2/com/sun/xml/bind/jaxb-xjc/2.1.7/jaxb-xjc-2.1.7.pom

Downloading: http://repo1.maven.org/maven2/com/sun/xml/bind/jaxb-impl/2.1.7/jaxb-impl-2.1.7.jar

Downloading: http://repo1.maven.org/maven2/com/sun/xml/bind/jaxb-xjc/2.1.7/jaxb-xjc-2.1.7.jar

[INFO] [resources:resources {execution: default-resources}]
[INFO] Using 'UTF-8' encoding to copy filtered resources.
[INFO] skip non existing resourceDirectory <https://builds.apache.org/job/axis2-1.5/ws/axis2/modules/jaxbri/conf>
[INFO] Copying 1 resource
[INFO] Copying 4 resources
[INFO] [compiler:compile {execution: default-compile}]
[INFO] Compiling 3 source files to <https://builds.apache.org/job/axis2-1.5/ws/axis2/modules/jaxbri/target/classes>
[INFO] [antrun:run {execution: gen-ts}]
[INFO] Executing tasks
    [mkdir] Created dir: <https://builds.apache.org/job/axis2-1.5/ws/axis2/modules/jaxbri/target/schema>
    [mkdir] Created dir: <https://builds.apache.org/job/axis2-1.5/ws/axis2/modules/jaxbri/target/schema/src>
    [mkdir] Created dir: <https://builds.apache.org/job/axis2-1.5/ws/axis2/modules/jaxbri/target/schema/classes>
     [echo] Generating JAX-B classes for DocLitBareService test
     [echo] Generating Service / Service Client for Test01 test
     [java] Retrieving document at 'test-resources/wsdl/Test01.wsdl'.

init:
    [mkdir] Created dir: <https://builds.apache.org/job/axis2-1.5/ws/axis2/modules/jaxbri/target/wsdl/Test01/build>
    [mkdir] Created dir: <https://builds.apache.org/job/axis2-1.5/ws/axis2/modules/jaxbri/target/wsdl/Test01/build/classes>
    [mkdir] Created dir: <https://builds.apache.org/job/axis2-1.5/ws/axis2/modules/jaxbri/target/wsdl/Test01/build/lib>
    [mkdir] Created dir: <https://builds.apache.org/job/axis2-1.5/ws/axis2/modules/jaxbri/target/wsdl/Test01/test>

pre.compile.test:
     [echo] JAX-B RI Availability = true
     [echo] Stax Availability= true
     [echo] Axis2 Availability= true

compile.src:
    [javac] Compiling 5 source files to <https://builds.apache.org/job/axis2-1.5/ws/axis2/modules/jaxbri/target/wsdl/Test01/build/classes>
    [javac] Note: <https://builds.apache.org/job/axis2-1.5/ws/axis2/modules/jaxbri/target/wsdl/Test01/src/com/foo/wsns/axis2/test01/Test01MessageReceiverInOut.java>
uses unchecked or unsafe operations.
    [javac] Note: Recompile with -Xlint:unchecked for details.

echo.classpath.problem:

jar.server:
     [copy] Copying 2 files to <https://builds.apache.org/job/axis2-1.5/ws/axis2/modules/jaxbri/target/wsdl/Test01/build/classes/META-INF>
      [jar] Building jar: <https://builds.apache.org/job/axis2-1.5/ws/axis2/modules/jaxbri/target/wsdl/Test01/build/lib/Test01.aar>
[INFO] Executed tasks
[INFO] [resources:testResources {execution: default-testResources}]
[INFO] Using 'UTF-8' encoding to copy filtered resources.
[INFO] Copying 2 resources to ../test-resources
[INFO] Copying 4 resources
[INFO] [build-helper:add-test-source {execution: add-test-source}]
[INFO] Test Source directory: <https://builds.apache.org/job/axis2-1.5/ws/axis2/modules/jaxbri/target/schema/src>
added.
[INFO] [compiler:testCompile {execution: default-testCompile}]
[INFO] Compiling 76 source files to <https://builds.apache.org/job/axis2-1.5/ws/axis2/modules/jaxbri/target/test-classes>
[INFO] [surefire:test {execution: default-test}]
[INFO] Surefire report directory: <https://builds.apache.org/job/axis2-1.5/ws/axis2/modules/jaxbri/target/surefire-reports>

-------------------------------------------------------
 T E S T S
-------------------------------------------------------
Running org.temp.doclitbare.DocLitBareWSDLTest
Tests run: 1, Failures: 0, Errors: 0, Skipped: 0, Time elapsed: 1.739 sec

Results :

Tests run: 1, Failures: 0, Errors: 0, Skipped: 0

[JENKINS] Recording test results
[INFO] [jar:jar {execution: default-jar}]
[INFO] Building jar: <https://builds.apache.org/job/axis2-1.5/ws/axis2/modules/jaxbri/target/axis2-jaxbri-1.5.7-SNAPSHOT.jar>
[INFO] [assembly:single {execution: source-release-assembly}]
[INFO] Skipping the assembly in this project because it's not the Execution Root
[INFO] Preparing source:jar
[WARNING] Removing: jar from forked lifecycle, to prevent recursive invocation.
[INFO] No goals needed for project - skipping
[INFO] [source:jar {execution: attach-sources}]
[INFO] Building jar: <https://builds.apache.org/job/axis2-1.5/ws/axis2/modules/jaxbri/target/axis2-jaxbri-1.5.7-SNAPSHOT-sources.jar>
[INFO] [javadoc:jar {execution: attach-javadocs}]
Loading source files for package org.apache.axis2.jaxbri...
Constructing Javadoc information...
Standard Doclet version 1.5.0_22
Building tree for all the packages and classes...
Generating <https://builds.apache.org/job/axis2-1.5/ws/axis2/modules/jaxbri/target/apidocs/org/apache/axis2/jaxbri//CodeGenerationUtility.html...>
Generating <https://builds.apache.org/job/axis2-1.5/ws/axis2/modules/jaxbri/target/apidocs/org/apache/axis2/jaxbri//DocLitBareJaxbSchemaGenerator.html...>
Generating <https://builds.apache.org/job/axis2-1.5/ws/axis2/modules/jaxbri/target/apidocs/org/apache/axis2/jaxbri//JaxbSchemaGenerator.html...>
Generating <https://builds.apache.org/job/axis2-1.5/ws/axis2/modules/jaxbri/target/apidocs/org/apache/axis2/jaxbri//package-frame.html...>
Generating <https://builds.apache.org/job/axis2-1.5/ws/axis2/modules/jaxbri/target/apidocs/org/apache/axis2/jaxbri//package-summary.html...>
Generating <https://builds.apache.org/job/axis2-1.5/ws/axis2/modules/jaxbri/target/apidocs/org/apache/axis2/jaxbri//package-tree.html...>
Generating <https://builds.apache.org/job/axis2-1.5/ws/axis2/modules/jaxbri/target/apidocs/constant-values.html...>
Generating <https://builds.apache.org/job/axis2-1.5/ws/axis2/modules/jaxbri/target/apidocs/org/apache/axis2/jaxbri/class-use//JaxbSchemaGenerator.html...>
Generating <https://builds.apache.org/job/axis2-1.5/ws/axis2/modules/jaxbri/target/apidocs/org/apache/axis2/jaxbri/class-use//CodeGenerationUtility.html...>
Generating <https://builds.apache.org/job/axis2-1.5/ws/axis2/modules/jaxbri/target/apidocs/org/apache/axis2/jaxbri/class-use//DocLitBareJaxbSchemaGenerator.html...>
Generating <https://builds.apache.org/job/axis2-1.5/ws/axis2/modules/jaxbri/target/apidocs/org/apache/axis2/jaxbri//package-use.html...>
Building index for all the packages and classes...
Generating <https://builds.apache.org/job/axis2-1.5/ws/axis2/modules/jaxbri/target/apidocs/overview-tree.html...>
Generating <https://builds.apache.org/job/axis2-1.5/ws/axis2/modules/jaxbri/target/apidocs/index-all.html...>
Generating <https://builds.apache.org/job/axis2-1.5/ws/axis2/modules/jaxbri/target/apidocs/deprecated-list.html...>
Building index for all classes...
Generating <https://builds.apache.org/job/axis2-1.5/ws/axis2/modules/jaxbri/target/apidocs/allclasses-frame.html...>
Generating <https://builds.apache.org/job/axis2-1.5/ws/axis2/modules/jaxbri/target/apidocs/allclasses-noframe.html...>
Generating <https://builds.apache.org/job/axis2-1.5/ws/axis2/modules/jaxbri/target/apidocs/index.html...>
Generating <https://builds.apache.org/job/axis2-1.5/ws/axis2/modules/jaxbri/target/apidocs/help-doc.html...>
Generating <https://builds.apache.org/job/axis2-1.5/ws/axis2/modules/jaxbri/target/apidocs/stylesheet.css...>
[INFO] Building jar: <https://builds.apache.org/job/axis2-1.5/ws/axis2/modules/jaxbri/target/axis2-jaxbri-1.5.7-SNAPSHOT-javadoc.jar>
[INFO] [gpg:sign {execution: default}]
[INFO] [install:install {execution: default-install}]
[INFO] Installing <https://builds.apache.org/job/axis2-1.5/ws/axis2/modules/jaxbri/target/axis2-jaxbri-1.5.7-SNAPSHOT.jar>
to /home/jenkins/jenkins-slave/maven-repositories/0/org/apache/axis2/axis2-jaxbri/1.5.7-SNAPSHOT/axis2-jaxbri-1.5.7-SNAPSHOT.jar
[INFO] Installing <https://builds.apache.org/job/axis2-1.5/ws/axis2/modules/jaxbri/target/axis2-jaxbri-1.5.7-SNAPSHOT-sources.jar>
to /home/jenkins/jenkins-slave/maven-repositories/0/org/apache/axis2/axis2-jaxbri/1.5.7-SNAPSHOT/axis2-jaxbri-1.5.7-SNAPSHOT-sources.jar
[INFO] Installing <https://builds.apache.org/job/axis2-1.5/ws/axis2/modules/jaxbri/target/axis2-jaxbri-1.5.7-SNAPSHOT-javadoc.jar>
to /home/jenkins/jenkins-slave/maven-repositories/0/org/apache/axis2/axis2-jaxbri/1.5.7-SNAPSHOT/axis2-jaxbri-1.5.7-SNAPSHOT-javadoc.jar
[INFO] [deploy:deploy {execution: default-deploy}]
[INFO] Retrieving previous build number from apache.snapshots.https
[WARNING] *** CHECKSUM FAILED - Checksum failed on download: local = '912321a9d897d7094540efc8df23386224c72935';
remote = 'a1ce64539eef55c3e1d8e5c82cd1d43135a234f2' - RETRYING
[WARNING] *** CHECKSUM FAILED - Checksum failed on download: local = '912321a9d897d7094540efc8df23386224c72935';
remote = 'a1ce64539eef55c3e1d8e5c82cd1d43135a234f2' - IGNORING
Uploading: https://repository.apache.org/content/repositories/snapshots/org/apache/axis2/axis2-jaxbri/1.5.7-SNAPSHOT/axis2-jaxbri-1.5.7-20120302.071929-162.jar
30K uploaded  (axis2-jaxbri-1.5.7-20120302.071929-162.jar)
[INFO] Retrieving previous metadata from apache.snapshots.https
[WARNING] *** CHECKSUM FAILED - Checksum failed on download: local = '912321a9d897d7094540efc8df23386224c72935';
remote = 'a1ce64539eef55c3e1d8e5c82cd1d43135a234f2' - RETRYING
[WARNING] *** CHECKSUM FAILED - Checksum failed on download: local = '912321a9d897d7094540efc8df23386224c72935';
remote = 'a1ce64539eef55c3e1d8e5c82cd1d43135a234f2' - IGNORING
[INFO] Uploading repository metadata for: 'snapshot org.apache.axis2:axis2-jaxbri:1.5.7-SNAPSHOT'
[INFO] Retrieving previous metadata from apache.snapshots.https
[INFO] Uploading repository metadata for: 'artifact org.apache.axis2:axis2-jaxbri'
[INFO] Uploading project information for axis2-jaxbri 1.5.7-20120302.071929-162
[INFO] Retrieving previous build number from apache.snapshots.https
Uploading: https://repository.apache.org/content/repositories/snapshots/org/apache/axis2/axis2-jaxbri/1.5.7-SNAPSHOT/axis2-jaxbri-1.5.7-20120302.071929-162-sources.jar
20K uploaded  (axis2-jaxbri-1.5.7-20120302.071929-162-sources.jar)
[INFO] Retrieving previous build number from apache.snapshots.https
Uploading: https://repository.apache.org/content/repositories/snapshots/org/apache/axis2/axis2-jaxbri/1.5.7-SNAPSHOT/axis2-jaxbri-1.5.7-20120302.071929-162-javadoc.jar
46K uploaded  (axis2-jaxbri-1.5.7-20120302.071929-162-javadoc.jar)
[JENKINS] Archiving <https://builds.apache.org/job/axis2-1.5/ws/axis2/modules/jaxbri/pom.xml>
to /home/hudson/hudson/jobs/axis2-1.5/modules/org.apache.axis2$axis2-jaxbri/builds/2012-03-02_07-17-49/archive/org.apache.axis2/axis2-jaxbri/1.5.7-SNAPSHOT/axis2-jaxbri-1.5.7-SNAPSHOT.pom
[JENKINS] Archiving <https://builds.apache.org/job/axis2-1.5/ws/axis2/modules/jaxbri/target/axis2-jaxbri-1.5.7-SNAPSHOT.jar>
to /home/hudson/hudson/jobs/axis2-1.5/modules/org.apache.axis2$axis2-jaxbri/builds/2012-03-02_07-17-49/archive/org.apache.axis2/axis2-jaxbri/1.5.7-20120302.071929-162/axis2-jaxbri-1.5.7-20120302.071929-162.jar
[JENKINS] Archiving <https://builds.apache.org/job/axis2-1.5/ws/axis2/modules/jaxbri/target/axis2-jaxbri-1.5.7-SNAPSHOT-sources.jar>
to /home/hudson/hudson/jobs/axis2-1.5/modules/org.apache.axis2$axis2-jaxbri/builds/2012-03-02_07-17-49/archive/org.apache.axis2/axis2-jaxbri/1.5.7-20120302.071929-162/axis2-jaxbri-1.5.7-20120302.071929-162-sources.jar
[JENKINS] Archiving <https://builds.apache.org/job/axis2-1.5/ws/axis2/modules/jaxbri/target/axis2-jaxbri-1.5.7-SNAPSHOT-javadoc.jar>
to /home/hudson/hudson/jobs/axis2-1.5/modules/org.apache.axis2$axis2-jaxbri/builds/2012-03-02_07-17-49/archive/org.apache.axis2/axis2-jaxbri/1.5.7-20120302.071929-162/axis2-jaxbri-1.5.7-20120302.071929-162-javadoc.jar
[INFO] ------------------------------------------------------------------------
[INFO] Building Apache Axis2 - SAAJ
[INFO]    task-segment: [clean, deploy]
[INFO] ------------------------------------------------------------------------
[INFO] [clean:clean {execution: default-clean}]
[INFO] [remote-resources:process {execution: default}]
Downloading: http://repo1.maven.org/maven2/org/apache/geronimo/specs/geronimo-saaj_1.3_spec/1.0.1/geronimo-saaj_1.3_spec-1.0.1.pom

Downloading: http://repo1.maven.org/maven2/com/sun/xml/messaging/saaj/saaj-impl/1.3.2/saaj-impl-1.3.2.pom

Downloading: http://repo1.maven.org/maven2/com/sun/xml/parsers/jaxp-ri/1.4.2/jaxp-ri-1.4.2.pom

Downloading: http://repo1.maven.org/maven2/javax/xml/parsers/jaxp-api/1.4.2/jaxp-api-1.4.2.pom

Downloading: http://repo1.maven.org/maven2/com/sun/xml/parsers/jaxp-ri/1.4.2/jaxp-ri-1.4.2.jar
Downloading: http://repo1.maven.org/maven2/javax/xml/parsers/jaxp-api/1.4.2/jaxp-api-1.4.2.jar
Downloading: http://repo1.maven.org/maven2/org/apache/geronimo/specs/geronimo-saaj_1.3_spec/1.0.1/geronimo-saaj_1.3_spec-1.0.1.jar
Downloading: http://repo1.maven.org/maven2/com/sun/xml/messaging/saaj/saaj-impl/1.3.2/saaj-impl-1.3.2.jar




[INFO] [resources:resources {execution: default-resources}]
[INFO] Using 'UTF-8' encoding to copy filtered resources.
[INFO] Copying 4 resources
[INFO] Copying 4 resources
[INFO] [compiler:compile {execution: default-compile}]
[INFO] Compiling 27 source files to <https://builds.apache.org/job/axis2-1.5/ws/axis2/modules/saaj/target/classes>
[INFO] -------------------------------------------------------------
[ERROR] COMPILATION ERROR : 
[INFO] -------------------------------------------------------------
[ERROR] <https://builds.apache.org/job/axis2-1.5/ws/axis2/modules/saaj/src/org/apache/axis2/saaj/SOAPEnvelopeImpl.java>:[204,12]
cannot find symbol
symbol  : method setPreviousOMSibling(org.apache.axiom.om.impl.dom.TextImpl)
location: class org.apache.axiom.om.impl.dom.NodeImpl

[INFO] 1error
[INFO] -------------------------------------------------------------
[JENKINS] Archiving <https://builds.apache.org/job/axis2-1.5/ws/axis2/modules/saaj/pom.xml>
to /home/hudson/hudson/jobs/axis2-1.5/modules/org.apache.axis2$axis2-saaj/builds/2012-03-02_07-17-49/archive/org.apache.axis2/axis2-saaj/1.5.7-SNAPSHOT/axis2-saaj-1.5.7-SNAPSHOT.pom
[INFO] ------------------------------------------------------------------------
[ERROR] BUILD FAILURE
[INFO] ------------------------------------------------------------------------
[INFO] Compilation failure
<https://builds.apache.org/job/axis2-1.5/ws/axis2/modules/saaj/src/org/apache/axis2/saaj/SOAPEnvelopeImpl.java>:[204,12]
cannot find symbol
symbol  : method setPreviousOMSibling(org.apache.axiom.om.impl.dom.TextImpl)
location: class org.apache.axiom.om.impl.dom.NodeImpl


[INFO] ------------------------------------------------------------------------
[INFO] For more information, run Maven with the -e switch
[INFO] ------------------------------------------------------------------------
[INFO] Total time: 14 minutes 18 seconds
[INFO] Finished at: Fri Mar 02 07:32:59 UTC 2012
[INFO] Final Memory: 75M/233M
[INFO] ------------------------------------------------------------------------
Sending e-mails to: java-dev@axis.apache.org
channel stopped
[locks-and-latches] Releasing all the locks
[locks-and-latches] All the locks released


---------------------------------------------------------------------
To unsubscribe, e-mail: java-dev-unsubscribe@axis.apache.org
For additional commands, e-mail: java-dev-help@axis.apache.org


Mime
View raw message