axis-java-dev mailing list archives

Site index · List index
Message view « Date » · « Thread »
Top « Date » · « Thread »
From Apache Jenkins Server <jenk...@builds.apache.org>
Subject Build failed in Jenkins: axis2-1.6 #254
Date Tue, 06 Mar 2012 15:24:46 GMT
See <https://builds.apache.org/job/axis2-1.6/254/changes>

Changes:

[sagara] Merged r1297344,r1297348 to the 1.6 branch.

[sagara] Merged r1297132 to the 1.6 branch.

------------------------------------------
[...truncated 1387 lines...]
Generating <https://builds.apache.org/job/axis2-1.6/ws/axis2/modules/kernel/target/apidocs/org/apache/axis2/transport/class-use//RequestResponseTransport.html...>
Generating <https://builds.apache.org/job/axis2-1.6/ws/axis2/modules/kernel/target/apidocs/org/apache/axis2/transport/class-use//RequestResponseTransport.RequestResponseTransportStatus.html...>
Generating <https://builds.apache.org/job/axis2-1.6/ws/axis2/modules/kernel/target/apidocs/org/apache/axis2/transport/http/class-use//MultipartFormDataFormatter.html...>
Generating <https://builds.apache.org/job/axis2-1.6/ws/axis2/modules/kernel/target/apidocs/org/apache/axis2/transport/http/class-use//XFormURLEncodedFormatter.html...>
Generating <https://builds.apache.org/job/axis2-1.6/ws/axis2/modules/kernel/target/apidocs/org/apache/axis2/transport/http/class-use//SOAPMessageFormatter.html...>
Generating <https://builds.apache.org/job/axis2-1.6/ws/axis2/modules/kernel/target/apidocs/org/apache/axis2/transport/http/class-use//ApplicationXMLFormatter.html...>
Generating <https://builds.apache.org/job/axis2-1.6/ws/axis2/modules/kernel/target/apidocs/org/apache/axis2/transport/http/class-use//HTTPConstants.html...>
Generating <https://builds.apache.org/job/axis2-1.6/ws/axis2/modules/kernel/target/apidocs/org/apache/axis2/transport/http/util/class-use//QueryStringParser.html...>
Generating <https://builds.apache.org/job/axis2-1.6/ws/axis2/modules/kernel/target/apidocs/org/apache/axis2/transport/http/util/class-use//URLTemplatingUtil.html...>
Generating <https://builds.apache.org/job/axis2-1.6/ws/axis2/modules/kernel/target/apidocs/org/apache/axis2/transport/http/util/class-use//URIEncoderDecoder.html...>
Generating <https://builds.apache.org/job/axis2-1.6/ws/axis2/modules/kernel/target/apidocs/org/apache/axis2/transport/http/util/class-use//ComplexPart.html...>
Generating <https://builds.apache.org/job/axis2-1.6/ws/axis2/modules/kernel/target/apidocs/org/apache/axis2/jaxrs/class-use//JAXRSModel.html...>
Generating <https://builds.apache.org/job/axis2-1.6/ws/axis2/modules/kernel/target/apidocs/org/apache/axis2/jaxrs/class-use//JAXRSUtils.html...>
Generating <https://builds.apache.org/job/axis2-1.6/ws/axis2/modules/kernel/target/apidocs/org/apache/axis2/deployment/class-use//DeploymentConstants.html...>
Generating <https://builds.apache.org/job/axis2-1.6/ws/axis2/modules/kernel/target/apidocs/org/apache/axis2/deployment/class-use//ModuleBuilder.html...>
Generating <https://builds.apache.org/job/axis2-1.6/ws/axis2/modules/kernel/target/apidocs/org/apache/axis2/deployment/class-use//AxisConfigBuilder.html...>
Generating <https://builds.apache.org/job/axis2-1.6/ws/axis2/modules/kernel/target/apidocs/org/apache/axis2/deployment/class-use//AbstractDeployer.html...>
Generating <https://builds.apache.org/job/axis2-1.6/ws/axis2/modules/kernel/target/apidocs/org/apache/axis2/deployment/class-use//ServiceBuilder.html...>
Generating <https://builds.apache.org/job/axis2-1.6/ws/axis2/modules/kernel/target/apidocs/org/apache/axis2/deployment/class-use//ClusterBuilder.html...>
Generating <https://builds.apache.org/job/axis2-1.6/ws/axis2/modules/kernel/target/apidocs/org/apache/axis2/deployment/class-use//TransportDeployer.html...>
Generating <https://builds.apache.org/job/axis2-1.6/ws/axis2/modules/kernel/target/apidocs/org/apache/axis2/deployment/class-use//FileSystemConfigurator.html...>
Generating <https://builds.apache.org/job/axis2-1.6/ws/axis2/modules/kernel/target/apidocs/org/apache/axis2/deployment/class-use//RepositoryListener.html...>
Generating <https://builds.apache.org/job/axis2-1.6/ws/axis2/modules/kernel/target/apidocs/org/apache/axis2/deployment/class-use//DeploymentLifeCycleListener.html...>
Generating <https://builds.apache.org/job/axis2-1.6/ws/axis2/modules/kernel/target/apidocs/org/apache/axis2/deployment/class-use//POJODeployer.html...>
Generating <https://builds.apache.org/job/axis2-1.6/ws/axis2/modules/kernel/target/apidocs/org/apache/axis2/deployment/class-use//WarBasedAxisConfigurator.html...>
Generating <https://builds.apache.org/job/axis2-1.6/ws/axis2/modules/kernel/target/apidocs/org/apache/axis2/deployment/class-use//URLBasedAxisConfigurator.html...>
Generating <https://builds.apache.org/job/axis2-1.6/ws/axis2/modules/kernel/target/apidocs/org/apache/axis2/deployment/class-use//ServiceDeployer.html...>
Generating <https://builds.apache.org/job/axis2-1.6/ws/axis2/modules/kernel/target/apidocs/org/apache/axis2/deployment/class-use//DeploymentEngine.html...>
Generating <https://builds.apache.org/job/axis2-1.6/ws/axis2/modules/kernel/target/apidocs/org/apache/axis2/deployment/class-use//ModuleDeployer.html...>
Generating <https://builds.apache.org/job/axis2-1.6/ws/axis2/modules/kernel/target/apidocs/org/apache/axis2/deployment/class-use//Deployer.html...>
Generating <https://builds.apache.org/job/axis2-1.6/ws/axis2/modules/kernel/target/apidocs/org/apache/axis2/deployment/class-use//DescriptionBuilder.html...>
Generating <https://builds.apache.org/job/axis2-1.6/ws/axis2/modules/kernel/target/apidocs/org/apache/axis2/deployment/class-use//DeploymentException.html...>
Generating <https://builds.apache.org/job/axis2-1.6/ws/axis2/modules/kernel/target/apidocs/org/apache/axis2/deployment/class-use//DeploymentClassLoader.html...>
Generating <https://builds.apache.org/job/axis2-1.6/ws/axis2/modules/kernel/target/apidocs/org/apache/axis2/deployment/class-use//DeploymentClassLoader.ByteUrlStreamHandler.html...>
Generating <https://builds.apache.org/job/axis2-1.6/ws/axis2/modules/kernel/target/apidocs/org/apache/axis2/deployment/class-use//DeploymentClassLoader.ByteURLConnection.html...>
Generating <https://builds.apache.org/job/axis2-1.6/ws/axis2/modules/kernel/target/apidocs/org/apache/axis2/deployment/class-use//ServiceGroupBuilder.html...>
Generating <https://builds.apache.org/job/axis2-1.6/ws/axis2/modules/kernel/target/apidocs/org/apache/axis2/deployment/class-use//DeploymentErrorMsgs.html...>
Generating <https://builds.apache.org/job/axis2-1.6/ws/axis2/modules/kernel/target/apidocs/org/apache/axis2/deployment/resolver/class-use//AARFileBasedURIResolver.html...>
Generating <https://builds.apache.org/job/axis2-1.6/ws/axis2/modules/kernel/target/apidocs/org/apache/axis2/deployment/resolver/class-use//WarBasedWSDLLocator.html...>
Generating <https://builds.apache.org/job/axis2-1.6/ws/axis2/modules/kernel/target/apidocs/org/apache/axis2/deployment/resolver/class-use//AARBasedWSDLLocator.html...>
Generating <https://builds.apache.org/job/axis2-1.6/ws/axis2/modules/kernel/target/apidocs/org/apache/axis2/deployment/resolver/class-use//WarFileBasedURIResolver.html...>
Generating <https://builds.apache.org/job/axis2-1.6/ws/axis2/modules/kernel/target/apidocs/org/apache/axis2/deployment/util/class-use//TempFileManager.html...>
Generating <https://builds.apache.org/job/axis2-1.6/ws/axis2/modules/kernel/target/apidocs/org/apache/axis2/deployment/util/class-use//BeanExcludeInfo.html...>
Generating <https://builds.apache.org/job/axis2-1.6/ws/axis2/modules/kernel/target/apidocs/org/apache/axis2/deployment/util/class-use//ExcludeInfo.html...>
Generating <https://builds.apache.org/job/axis2-1.6/ws/axis2/modules/kernel/target/apidocs/org/apache/axis2/deployment/util/class-use//Utils.html...>
Generating <https://builds.apache.org/job/axis2-1.6/ws/axis2/modules/kernel/target/apidocs/org/apache/axis2/deployment/util/class-use//PhasesInfo.html...>
Generating <https://builds.apache.org/job/axis2-1.6/ws/axis2/modules/kernel/target/apidocs/org/apache/axis2/deployment/scheduler/class-use//Scheduler.html...>
Generating <https://builds.apache.org/job/axis2-1.6/ws/axis2/modules/kernel/target/apidocs/org/apache/axis2/deployment/scheduler/class-use//Scheduler.SchedulerTimerTask.html...>
Generating <https://builds.apache.org/job/axis2-1.6/ws/axis2/modules/kernel/target/apidocs/org/apache/axis2/deployment/scheduler/class-use//SchedulerTask.html...>
Generating <https://builds.apache.org/job/axis2-1.6/ws/axis2/modules/kernel/target/apidocs/org/apache/axis2/deployment/scheduler/class-use//DeploymentIterator.html...>
Generating <https://builds.apache.org/job/axis2-1.6/ws/axis2/modules/kernel/target/apidocs/org/apache/axis2/deployment/repository/util/class-use//ArchiveReader.html...>
Generating <https://builds.apache.org/job/axis2-1.6/ws/axis2/modules/kernel/target/apidocs/org/apache/axis2/deployment/repository/util/class-use//WSInfoList.html...>
Generating <https://builds.apache.org/job/axis2-1.6/ws/axis2/modules/kernel/target/apidocs/org/apache/axis2/deployment/repository/util/class-use//DeploymentFileData.html...>
Generating <https://builds.apache.org/job/axis2-1.6/ws/axis2/modules/kernel/target/apidocs/org/apache/axis2/deployment/repository/util/class-use//WSInfo.html...>
Generating <https://builds.apache.org/job/axis2-1.6/ws/axis2/modules/kernel/target/apidocs/org/apache/axis2//package-use.html...>
Generating <https://builds.apache.org/job/axis2-1.6/ws/axis2/modules/kernel/target/apidocs/org/apache/axis2/addressing//package-use.html...>
Generating <https://builds.apache.org/job/axis2-1.6/ws/axis2/modules/kernel/target/apidocs/org/apache/axis2/addressing/i18n//package-use.html...>
Generating <https://builds.apache.org/job/axis2-1.6/ws/axis2/modules/kernel/target/apidocs/org/apache/axis2/addressing/metadata//package-use.html...>
Generating <https://builds.apache.org/job/axis2-1.6/ws/axis2/modules/kernel/target/apidocs/org/apache/axis2/addressing/wsdl//package-use.html...>
Generating <https://builds.apache.org/job/axis2-1.6/ws/axis2/modules/kernel/target/apidocs/org/apache/axis2/builder//package-use.html...>
Generating <https://builds.apache.org/job/axis2-1.6/ws/axis2/modules/kernel/target/apidocs/org/apache/axis2/builder/unknowncontent//package-use.html...>
Generating <https://builds.apache.org/job/axis2-1.6/ws/axis2/modules/kernel/target/apidocs/org/apache/axis2/classloader//package-use.html...>
Generating <https://builds.apache.org/job/axis2-1.6/ws/axis2/modules/kernel/target/apidocs/org/apache/axis2/client//package-use.html...>
Generating <https://builds.apache.org/job/axis2-1.6/ws/axis2/modules/kernel/target/apidocs/org/apache/axis2/client/async//package-use.html...>
Generating <https://builds.apache.org/job/axis2-1.6/ws/axis2/modules/kernel/target/apidocs/org/apache/axis2/clustering//package-use.html...>
Generating <https://builds.apache.org/job/axis2-1.6/ws/axis2/modules/kernel/target/apidocs/org/apache/axis2/clustering/management//package-use.html...>
Generating <https://builds.apache.org/job/axis2-1.6/ws/axis2/modules/kernel/target/apidocs/org/apache/axis2/clustering/state//package-use.html...>
Generating <https://builds.apache.org/job/axis2-1.6/ws/axis2/modules/kernel/target/apidocs/org/apache/axis2/context//package-use.html...>
Generating <https://builds.apache.org/job/axis2-1.6/ws/axis2/modules/kernel/target/apidocs/org/apache/axis2/context/externalize//package-use.html...>
Generating <https://builds.apache.org/job/axis2-1.6/ws/axis2/modules/kernel/target/apidocs/org/apache/axis2/dataretrieval//package-use.html...>
Generating <https://builds.apache.org/job/axis2-1.6/ws/axis2/modules/kernel/target/apidocs/org/apache/axis2/dataretrieval/client//package-use.html...>
Generating <https://builds.apache.org/job/axis2-1.6/ws/axis2/modules/kernel/target/apidocs/org/apache/axis2/deployment//package-use.html...>
Generating <https://builds.apache.org/job/axis2-1.6/ws/axis2/modules/kernel/target/apidocs/org/apache/axis2/deployment/repository/util//package-use.html...>
Generating <https://builds.apache.org/job/axis2-1.6/ws/axis2/modules/kernel/target/apidocs/org/apache/axis2/deployment/resolver//package-use.html...>
Generating <https://builds.apache.org/job/axis2-1.6/ws/axis2/modules/kernel/target/apidocs/org/apache/axis2/deployment/scheduler//package-use.html...>
Generating <https://builds.apache.org/job/axis2-1.6/ws/axis2/modules/kernel/target/apidocs/org/apache/axis2/deployment/util//package-use.html...>
Generating <https://builds.apache.org/job/axis2-1.6/ws/axis2/modules/kernel/target/apidocs/org/apache/axis2/description//package-use.html...>
Generating <https://builds.apache.org/job/axis2-1.6/ws/axis2/modules/kernel/target/apidocs/org/apache/axis2/description/java2wsdl//package-use.html...>
Generating <https://builds.apache.org/job/axis2-1.6/ws/axis2/modules/kernel/target/apidocs/org/apache/axis2/description/java2wsdl/bytecode//package-use.html...>
Generating <https://builds.apache.org/job/axis2-1.6/ws/axis2/modules/kernel/target/apidocs/org/apache/axis2/dispatchers//package-use.html...>
Generating <https://builds.apache.org/job/axis2-1.6/ws/axis2/modules/kernel/target/apidocs/org/apache/axis2/engine//package-use.html...>
Generating <https://builds.apache.org/job/axis2-1.6/ws/axis2/modules/kernel/target/apidocs/org/apache/axis2/handlers//package-use.html...>
Generating <https://builds.apache.org/job/axis2-1.6/ws/axis2/modules/kernel/target/apidocs/org/apache/axis2/i18n//package-use.html...>
Generating <https://builds.apache.org/job/axis2-1.6/ws/axis2/modules/kernel/target/apidocs/org/apache/axis2/java/security//package-use.html...>
Generating <https://builds.apache.org/job/axis2-1.6/ws/axis2/modules/kernel/target/apidocs/org/apache/axis2/jaxrs//package-use.html...>
Generating <https://builds.apache.org/job/axis2-1.6/ws/axis2/modules/kernel/target/apidocs/org/apache/axis2/jsr181//package-use.html...>
Generating <https://builds.apache.org/job/axis2-1.6/ws/axis2/modules/kernel/target/apidocs/org/apache/axis2/modules//package-use.html...>
Generating <https://builds.apache.org/job/axis2-1.6/ws/axis2/modules/kernel/target/apidocs/org/apache/axis2/namespace//package-use.html...>
Generating <https://builds.apache.org/job/axis2-1.6/ws/axis2/modules/kernel/target/apidocs/org/apache/axis2/phaseresolver//package-use.html...>
Generating <https://builds.apache.org/job/axis2-1.6/ws/axis2/modules/kernel/target/apidocs/org/apache/axis2/receivers//package-use.html...>
Generating <https://builds.apache.org/job/axis2-1.6/ws/axis2/modules/kernel/target/apidocs/org/apache/axis2/service//package-use.html...>
Generating <https://builds.apache.org/job/axis2-1.6/ws/axis2/modules/kernel/target/apidocs/org/apache/axis2/transaction//package-use.html...>
Generating <https://builds.apache.org/job/axis2-1.6/ws/axis2/modules/kernel/target/apidocs/org/apache/axis2/transport//package-use.html...>
Generating <https://builds.apache.org/job/axis2-1.6/ws/axis2/modules/kernel/target/apidocs/org/apache/axis2/transport/http//package-use.html...>
Generating <https://builds.apache.org/job/axis2-1.6/ws/axis2/modules/kernel/target/apidocs/org/apache/axis2/transport/http/util//package-use.html...>
Generating <https://builds.apache.org/job/axis2-1.6/ws/axis2/modules/kernel/target/apidocs/org/apache/axis2/util//package-use.html...>
Generating <https://builds.apache.org/job/axis2-1.6/ws/axis2/modules/kernel/target/apidocs/org/apache/axis2/util/threadpool//package-use.html...>
Generating <https://builds.apache.org/job/axis2-1.6/ws/axis2/modules/kernel/target/apidocs/org/apache/axis2/wsdl//package-use.html...>
Generating <https://builds.apache.org/job/axis2-1.6/ws/axis2/modules/kernel/target/apidocs/org/apache/axis2/wsdl/util//package-use.html...>
Building index for all the packages and classes...
Generating <https://builds.apache.org/job/axis2-1.6/ws/axis2/modules/kernel/target/apidocs/overview-tree.html...>
Generating <https://builds.apache.org/job/axis2-1.6/ws/axis2/modules/kernel/target/apidocs/index-all.html...>
Generating <https://builds.apache.org/job/axis2-1.6/ws/axis2/modules/kernel/target/apidocs/deprecated-list.html...>
Building index for all classes...
Generating <https://builds.apache.org/job/axis2-1.6/ws/axis2/modules/kernel/target/apidocs/allclasses-frame.html...>
Generating <https://builds.apache.org/job/axis2-1.6/ws/axis2/modules/kernel/target/apidocs/allclasses-noframe.html...>
Generating <https://builds.apache.org/job/axis2-1.6/ws/axis2/modules/kernel/target/apidocs/index.html...>
Generating <https://builds.apache.org/job/axis2-1.6/ws/axis2/modules/kernel/target/apidocs/overview-summary.html...>
Generating <https://builds.apache.org/job/axis2-1.6/ws/axis2/modules/kernel/target/apidocs/help-doc.html...>
Generating <https://builds.apache.org/job/axis2-1.6/ws/axis2/modules/kernel/target/apidocs/stylesheet.css...>
96 warnings
[WARNING] Javadoc Warnings
[WARNING] <https://builds.apache.org/job/axis2-1.6/ws/axis2/modules/kernel/src/org/apache/axis2/addressing/AddressingFaultsHelper.java>:56:
warning - @return tag has no arguments.
[WARNING] <https://builds.apache.org/job/axis2-1.6/ws/axis2/modules/kernel/src/org/apache/axis2/addressing/EndpointReference.java>:453:
warning - Tag @link: can't find toOM(EndpointReference, QName, String) in org.apache.axis2.addressing.EndpointReferenceHelper
[WARNING] <https://builds.apache.org/job/axis2-1.6/ws/axis2/modules/kernel/src/org/apache/axis2/addressing/EndpointReferenceHelper.java>:196:
warning - @return tag has no arguments.
[WARNING] <https://builds.apache.org/job/axis2-1.6/ws/axis2/modules/kernel/src/org/apache/axis2/addressing/RelatesTo.java>:114:
warning - Tag @link: reference not found: AddressingConstants.Final.WSA_DEFAULT_RELATIONSHIP_TYPE
[WARNING] <https://builds.apache.org/job/axis2-1.6/ws/axis2/modules/kernel/src/org/apache/axis2/addressing/RelatesTo.java>:175:
warning - @param argument "out" is not a parameter name.
[WARNING] <https://builds.apache.org/job/axis2-1.6/ws/axis2/modules/kernel/src/org/apache/axis2/addressing/RelatesTo.java>:227:
warning - @param argument "in" is not a parameter name.
[WARNING] <https://builds.apache.org/job/axis2-1.6/ws/axis2/modules/kernel/src/org/apache/axis2/util/JavaUtils.java>:97:
warning - @return tag has no arguments.
[WARNING] <https://builds.apache.org/job/axis2-1.6/ws/axis2/modules/kernel/src/org/apache/axis2/util/JavaUtils.java>:573:
warning - @return tag has no arguments.
[WARNING] <https://builds.apache.org/job/axis2-1.6/ws/axis2/modules/kernel/src/org/apache/axis2/util/MessageContextBuilder.java>:767:
warning - @return tag has no arguments.
[WARNING] <https://builds.apache.org/job/axis2-1.6/ws/axis2/modules/kernel/src/org/apache/axis2/util/MetaDataEntry.java>:259:
warning - @param argument "out" is not a parameter name.
[WARNING] <https://builds.apache.org/job/axis2-1.6/ws/axis2/modules/kernel/src/org/apache/axis2/util/MetaDataEntry.java>:296:
warning - @param argument "in" is not a parameter name.
[WARNING] <https://builds.apache.org/job/axis2-1.6/ws/axis2/modules/kernel/src/org/apache/axis2/util/MultipleEntryHashMap.java>:44:
warning - @return tag has no arguments.
[WARNING] <https://builds.apache.org/job/axis2-1.6/ws/axis2/modules/kernel/src/org/apache/axis2/util/ObjectStateUtils.java>:189:
warning - @param argument "in" is not a parameter name.
[WARNING] <https://builds.apache.org/job/axis2-1.6/ws/axis2/modules/kernel/src/org/apache/axis2/util/ObjectStateUtils.java>:205:
warning - @param argument "list" is not a parameter name.
[WARNING] <https://builds.apache.org/job/axis2-1.6/ws/axis2/modules/kernel/src/org/apache/axis2/util/ObjectStateUtils.java>:223:
warning - @param argument "in" is not a parameter name.
[WARNING] <https://builds.apache.org/job/axis2-1.6/ws/axis2/modules/kernel/src/org/apache/axis2/util/ObjectStateUtils.java>:313:
warning - @param argument "handlerClassName" is not a parameter name.
[WARNING] <https://builds.apache.org/job/axis2-1.6/ws/axis2/modules/kernel/src/org/apache/axis2/util/Utils.java>:93:
warning - Tag @see:illegal character: "58" in "org.apache.axis2.util.MessageContextBuilder:createOutMessageContext()"
[WARNING] <https://builds.apache.org/job/axis2-1.6/ws/axis2/modules/kernel/src/org/apache/axis2/util/Utils.java>:93:
warning - Tag @see: missing '#': "org.apache.axis2.util.MessageContextBuilder:createOutMessageContext()"
[WARNING] <https://builds.apache.org/job/axis2-1.6/ws/axis2/modules/kernel/src/org/apache/axis2/util/Utils.java>:93:
warning - Tag @see: can't find org.apache.axis2.util.MessageContextBuilder:createOutMessageContext()
in org.apache.axis2.util.Utils
[WARNING] <https://builds.apache.org/job/axis2-1.6/ws/axis2/modules/kernel/src/org/apache/axis2/util/Utils.java>:521:
warning - @return tag has no arguments.
[WARNING] <https://builds.apache.org/job/axis2-1.6/ws/axis2/modules/kernel/src/org/apache/axis2/util/Utils.java>:818:
warning - @return tag has no arguments.
[WARNING] <https://builds.apache.org/job/axis2-1.6/ws/axis2/modules/kernel/src/org/apache/axis2/util/XMLUtils.java>:523:
warning - @return tag has no arguments.
[WARNING] <https://builds.apache.org/job/axis2-1.6/ws/axis2/modules/kernel/src/org/apache/axis2/util/XMLUtils.java>:610:
warning - @return tag has no arguments.
[WARNING] <https://builds.apache.org/job/axis2-1.6/ws/axis2/modules/kernel/src/org/apache/axis2/classloader/JarFileClassLoader.java>:178:
warning - @inheritDoc used but internalfindResources(String) does not override or implement
any method.
[WARNING] <https://builds.apache.org/job/axis2-1.6/ws/axis2/modules/kernel/src/org/apache/axis2/classloader/JarFileClassLoader.java>:178:
warning - @inheritDoc used but internalfindResources(String) does not override or implement
any method.
[WARNING] <https://builds.apache.org/job/axis2-1.6/ws/axis2/modules/kernel/src/org/apache/axis2/handlers/AbstractTemplatedHandler.java>:67:
warning - Tag @link: reference not found: InvocationResponse#CONTINUE
[WARNING] <https://builds.apache.org/job/axis2-1.6/ws/axis2/modules/kernel/src/org/apache/axis2/handlers/AbstractTemplatedHandler.java>:67:
warning - Tag @link: reference not found: InvocationResponse#ABORT
[WARNING] <https://builds.apache.org/job/axis2-1.6/ws/axis2/modules/kernel/src/org/apache/axis2/handlers/AbstractTemplatedHandler.java>:67:
warning - Tag @link: reference not found: InvocationResponse#SUSPEND
[WARNING] <https://builds.apache.org/job/axis2-1.6/ws/axis2/modules/kernel/src/org/apache/axis2/engine/AxisConfiguration.java>:1338:
warning - @param argument "dialect-" is not a parameter name.
[WARNING] <https://builds.apache.org/job/axis2-1.6/ws/axis2/modules/kernel/src/org/apache/axis2/engine/AxisConfiguration.java>:1350:
warning - @param argument "dialect-" is not a parameter name.
[WARNING] <https://builds.apache.org/job/axis2-1.6/ws/axis2/modules/kernel/src/org/apache/axis2/engine/ObjectSupplier.java>:34:
warning - @return tag has no arguments.
[WARNING] <https://builds.apache.org/job/axis2-1.6/ws/axis2/modules/kernel/src/org/apache/axis2/dispatchers/AddressingBasedDispatcher.java>:71:
warning - @noinspection is an unknown tag.
[WARNING] <https://builds.apache.org/job/axis2-1.6/ws/axis2/modules/kernel/src/org/apache/axis2/client/Options.java>:1087:
warning - @param argument "out" is not a parameter name.
[WARNING] <https://builds.apache.org/job/axis2-1.6/ws/axis2/modules/kernel/src/org/apache/axis2/client/Options.java>:1211:
warning - @param argument "in" is not a parameter name.
[WARNING] <https://builds.apache.org/job/axis2-1.6/ws/axis2/modules/kernel/src/org/apache/axis2/dataretrieval/Data.java>:58:
warning - @return tag has no arguments.
[WARNING] <https://builds.apache.org/job/axis2-1.6/ws/axis2/modules/kernel/src/org/apache/axis2/description/AxisMessage.java>:183:
warning - @return tag has no arguments.
[WARNING] <https://builds.apache.org/job/axis2-1.6/ws/axis2/modules/kernel/src/org/apache/axis2/description/AxisService.java>:1813:
warning - @return tag has no arguments.
[WARNING] <https://builds.apache.org/job/axis2-1.6/ws/axis2/modules/kernel/src/org/apache/axis2/description/AxisService.java>:2126:
warning - @return tag has no arguments.
[WARNING] <https://builds.apache.org/job/axis2-1.6/ws/axis2/modules/kernel/src/org/apache/axis2/description/AxisService.java>:1422:
warning - @return tag has no arguments.
[WARNING] <https://builds.apache.org/job/axis2-1.6/ws/axis2/modules/kernel/src/org/apache/axis2/description/AxisService.java>:3016:
warning - @param argument "dialect-" is not a parameter name.
[WARNING] <https://builds.apache.org/job/axis2-1.6/ws/axis2/modules/kernel/src/org/apache/axis2/description/Parameter.java>:271:
warning - @param argument "out" is not a parameter name.
[WARNING] <https://builds.apache.org/job/axis2-1.6/ws/axis2/modules/kernel/src/org/apache/axis2/description/Parameter.java>:329:
warning - @param argument "in" is not a parameter name.
[WARNING] <https://builds.apache.org/job/axis2-1.6/ws/axis2/modules/kernel/src/org/apache/axis2/description/ParameterIncludeImpl.java>:255:
warning - @param argument "out" is not a parameter name.
[WARNING] <https://builds.apache.org/job/axis2-1.6/ws/axis2/modules/kernel/src/org/apache/axis2/description/ParameterIncludeImpl.java>:289:
warning - @param argument "in" is not a parameter name.
[WARNING] <https://builds.apache.org/job/axis2-1.6/ws/axis2/modules/kernel/src/org/apache/axis2/description/WSDL11ToAxisServiceBuilder.java>:266:
warning - Tag @see: reference not found: setCustomWSDLResolver
[WARNING] <https://builds.apache.org/job/axis2-1.6/ws/axis2/modules/kernel/src/org/apache/axis2/description/WSDLToAxisServiceBuilder.java>:256:
warning - @return tag has no arguments.
[WARNING] <https://builds.apache.org/job/axis2-1.6/ws/axis2/modules/kernel/src/org/apache/axis2/context/OperationContext.java>:278:
warning - Tag @link: reference not found: WSDLConstants
[WARNING] <https://builds.apache.org/job/axis2-1.6/ws/axis2/modules/kernel/src/org/apache/axis2/context/OperationContext.java>:353:
warning - @param argument "out" is not a parameter name.
[WARNING] <https://builds.apache.org/job/axis2-1.6/ws/axis2/modules/kernel/src/org/apache/axis2/context/OperationContext.java>:533:
warning - @param argument "in" is not a parameter name.
[WARNING] <https://builds.apache.org/job/axis2-1.6/ws/axis2/modules/kernel/src/org/apache/axis2/context/ServiceContext.java>:197:
warning - @return tag has no arguments.
[WARNING] <https://builds.apache.org/job/axis2-1.6/ws/axis2/modules/kernel/src/org/apache/axis2/context/ServiceContext.java>:305:
warning - @param argument "out" is not a parameter name.
[WARNING] <https://builds.apache.org/job/axis2-1.6/ws/axis2/modules/kernel/src/org/apache/axis2/context/ServiceContext.java>:370:
warning - @param argument "in" is not a parameter name.
[WARNING] <https://builds.apache.org/job/axis2-1.6/ws/axis2/modules/kernel/src/org/apache/axis2/context/ServiceGroupContext.java>:275:
warning - @param argument "out" is not a parameter name.
[WARNING] <https://builds.apache.org/job/axis2-1.6/ws/axis2/modules/kernel/src/org/apache/axis2/context/ServiceGroupContext.java>:341:
warning - @param argument "in" is not a parameter name.
[WARNING] <https://builds.apache.org/job/axis2-1.6/ws/axis2/modules/kernel/src/org/apache/axis2/context/SessionContext.java>:187:
warning - @param argument "out" is not a parameter name.
[WARNING] <https://builds.apache.org/job/axis2-1.6/ws/axis2/modules/kernel/src/org/apache/axis2/context/SessionContext.java>:242:
warning - @param argument "in" is not a parameter name.
[WARNING] <https://builds.apache.org/job/axis2-1.6/ws/axis2/modules/kernel/src/org/apache/axis2/context/externalize/ActivateUtils.java>:557:
warning - @param argument "handlerClassName" is not a parameter name.
[WARNING] <https://builds.apache.org/job/axis2-1.6/ws/axis2/modules/kernel/src/org/apache/axis2/context/externalize/MessageExternalizeUtils.java>:182:
warning - @return tag has no arguments.
[WARNING] <https://builds.apache.org/job/axis2-1.6/ws/axis2/modules/kernel/src/org/apache/axis2/context/externalize/SafeObjectInputStream.java>:43:
warning - Tag @see: reference not found: SafeObjectInput
[WARNING] <https://builds.apache.org/job/axis2-1.6/ws/axis2/modules/kernel/src/org/apache/axis2/context/externalize/SafeObjectInputStream.java>:61:
warning - @return tag has no arguments.
[WARNING] <https://builds.apache.org/job/axis2-1.6/ws/axis2/modules/kernel/src/org/apache/axis2/context/externalize/SafeObjectInputStream.java>:228:
warning - Tag @see: missing '#': "SafeObjectInputStream.writeList()"
[WARNING] <https://builds.apache.org/job/axis2-1.6/ws/axis2/modules/kernel/src/org/apache/axis2/context/externalize/SafeObjectInputStream.java>:228:
warning - Tag @see: can't find SafeObjectInputStream.writeList() in org.apache.axis2.context.externalize.SafeObjectInputStream
[WARNING] <https://builds.apache.org/job/axis2-1.6/ws/axis2/modules/kernel/src/org/apache/axis2/context/externalize/SafeObjectInputStream.java>:159:
warning - Tag @see: missing '#': "SafeObjectOutputStream.writeMap()"
[WARNING] <https://builds.apache.org/job/axis2-1.6/ws/axis2/modules/kernel/src/org/apache/axis2/context/externalize/SafeObjectInputStream.java>:159:
warning - Tag @see: can't find SafeObjectOutputStream.writeMap() in org.apache.axis2.context.externalize.SafeObjectInputStream
[WARNING] <https://builds.apache.org/job/axis2-1.6/ws/axis2/modules/kernel/src/org/apache/axis2/context/externalize/SafeObjectInputStream.java>:239:
warning - Tag @see: missing '#': "SafeObjectInputStream.writeList()"
[WARNING] <https://builds.apache.org/job/axis2-1.6/ws/axis2/modules/kernel/src/org/apache/axis2/context/externalize/SafeObjectInputStream.java>:239:
warning - Tag @see: can't find SafeObjectInputStream.writeList() in org.apache.axis2.context.externalize.SafeObjectInputStream
[WARNING] <https://builds.apache.org/job/axis2-1.6/ws/axis2/modules/kernel/src/org/apache/axis2/context/externalize/SafeObjectInputStream.java>:251:
warning - Tag @see: missing '#': "SafeObjectInputStream.writeList()"
[WARNING] <https://builds.apache.org/job/axis2-1.6/ws/axis2/modules/kernel/src/org/apache/axis2/context/externalize/SafeObjectInputStream.java>:251:
warning - Tag @see: can't find SafeObjectInputStream.writeList() in org.apache.axis2.context.externalize.SafeObjectInputStream
[WARNING] <https://builds.apache.org/job/axis2-1.6/ws/axis2/modules/kernel/src/org/apache/axis2/context/externalize/SafeObjectInputStream.java>:172:
warning - Tag @see: missing '#': "SafeObjectOutputStream.writeMap()"
[WARNING] <https://builds.apache.org/job/axis2-1.6/ws/axis2/modules/kernel/src/org/apache/axis2/context/externalize/SafeObjectInputStream.java>:172:
warning - Tag @see: can't find SafeObjectOutputStream.writeMap() in org.apache.axis2.context.externalize.SafeObjectInputStream
[WARNING] <https://builds.apache.org/job/axis2-1.6/ws/axis2/modules/kernel/src/org/apache/axis2/context/externalize/SafeObjectOutputStream.java>:87:
warning - @return tag has no arguments.
[WARNING] <https://builds.apache.org/job/axis2-1.6/ws/axis2/modules/kernel/src/org/apache/axis2/context/externalize/SafeObjectOutputStream.java>:279:
warning - @return tag has no arguments.
[WARNING] <https://builds.apache.org/job/axis2-1.6/ws/axis2/modules/kernel/src/org/apache/axis2/context/externalize/SafeObjectOutputStream.java>:245:
warning - @return tag has no arguments.
[WARNING] <https://builds.apache.org/job/axis2-1.6/ws/axis2/modules/kernel/src/org/apache/axis2/context/externalize/SafeObjectOutputStream.java>:245:
warning - @param argument "ll" is not a parameter name.
[WARNING] <https://builds.apache.org/job/axis2-1.6/ws/axis2/modules/kernel/src/org/apache/axis2/context/externalize/SafeObjectOutputStream.java>:279:
warning - @param argument "ll" is not a parameter name.
[WARNING] <https://builds.apache.org/job/axis2-1.6/ws/axis2/modules/kernel/src/org/apache/axis2/context/externalize/SafeObjectOutputStream.java>:427:
warning - @returns is an unknown tag.
[WARNING] <https://builds.apache.org/job/axis2-1.6/ws/axis2/modules/kernel/src/org/apache/axis2/context/externalize/SafeObjectOutputStream.java>:504:
warning - @returns is an unknown tag.
[WARNING] <https://builds.apache.org/job/axis2-1.6/ws/axis2/modules/kernel/src/org/apache/axis2/context/externalize/SafeObjectOutputStream.java>:504:
warning - @param argument "obj1" is not a parameter name.
[WARNING] <https://builds.apache.org/job/axis2-1.6/ws/axis2/modules/kernel/src/org/apache/axis2/context/externalize/SafeObjectOutputStream.java>:504:
warning - @param argument "isSafe1" is not a parameter name.
[WARNING] <https://builds.apache.org/job/axis2-1.6/ws/axis2/modules/kernel/src/org/apache/axis2/context/externalize/SafeObjectOutputStream.java>:504:
warning - @param argument "obj2" is not a parameter name.
[WARNING] <https://builds.apache.org/job/axis2-1.6/ws/axis2/modules/kernel/src/org/apache/axis2/context/externalize/SafeObjectOutputStream.java>:504:
warning - @param argument "isSafe2" is not a parameter name.
[WARNING] <https://builds.apache.org/job/axis2-1.6/ws/axis2/modules/kernel/src/org/apache/axis2/context/externalize/SafeSerializable.java>:32:
warning - @See is an unknown tag -- same as a known tag except for case.
[WARNING] <https://builds.apache.org/job/axis2-1.6/ws/axis2/modules/kernel/src/org/apache/axis2/wsdl/WSDLUtil.java>:101:
warning - @return tag has no arguments.
[WARNING] <https://builds.apache.org/job/axis2-1.6/ws/axis2/modules/kernel/src/org/apache/axis2/transport/RequestResponseTransport.java>:84:
warning - @return tag has no arguments.
[WARNING] <https://builds.apache.org/job/axis2-1.6/ws/axis2/modules/kernel/src/org/apache/axis2/transport/http/ApplicationXMLFormatter.java>:63:
warning - @return tag has no arguments.
[WARNING] <https://builds.apache.org/job/axis2-1.6/ws/axis2/modules/kernel/src/org/apache/axis2/transport/http/MultipartFormDataFormatter.java>:81:
warning - @@@@-@@-@@ is an unknown tag.
[WARNING] <https://builds.apache.org/job/axis2-1.6/ws/axis2/modules/kernel/src/org/apache/axis2/transport/http/util/QueryStringParser.java>:84:
warning - @return tag has no arguments.
[WARNING] <https://builds.apache.org/job/axis2-1.6/ws/axis2/modules/kernel/src/org/apache/axis2/jaxrs/JAXRSModel.java>:70:
warning - @return tag has no arguments.
[WARNING] <https://builds.apache.org/job/axis2-1.6/ws/axis2/modules/kernel/src/org/apache/axis2/jaxrs/JAXRSModel.java>:89:
warning - @return tag has no arguments.
[WARNING] <https://builds.apache.org/job/axis2-1.6/ws/axis2/modules/kernel/src/org/apache/axis2/jaxrs/JAXRSUtils.java>:48:
warning - @return tag has no arguments.
[WARNING] <https://builds.apache.org/job/axis2-1.6/ws/axis2/modules/kernel/src/org/apache/axis2/jaxrs/JAXRSUtils.java>:78:
warning - @return tag has no arguments.
[WARNING] <https://builds.apache.org/job/axis2-1.6/ws/axis2/modules/kernel/src/org/apache/axis2/deployment/util/Utils.java>:1842:
warning - @return tag has no arguments.
[WARNING] <https://builds.apache.org/job/axis2-1.6/ws/axis2/modules/kernel/src/org/apache/axis2/deployment/util/Utils.java>:1790:
warning - @return tag has no arguments.
[WARNING] <https://builds.apache.org/job/axis2-1.6/ws/axis2/modules/kernel/src/org/apache/axis2/deployment/util/Utils.java>:1816:
warning - @return tag has no arguments.
[WARNING] <https://builds.apache.org/job/axis2-1.6/ws/axis2/modules/kernel/src/org/apache/axis2/deployment/util/Utils.java>:1871:
warning - @return tag has no arguments.
[WARNING] <https://builds.apache.org/job/axis2-1.6/ws/axis2/modules/kernel/src/org/apache/axis2/classloader/JarFileClassLoader.java>:178:
warning - @inheritDoc used but internalfindResources(String) does not override or implement
any method.
[INFO] Building jar: <https://builds.apache.org/job/axis2-1.6/ws/axis2/modules/kernel/target/axis2-kernel-1.6.2-SNAPSHOT-javadoc.jar>
[INFO] [gpg:sign {execution: default}]
[INFO] [install:install {execution: default-install}]
[INFO] Installing <https://builds.apache.org/job/axis2-1.6/ws/axis2/modules/kernel/target/axis2-kernel-1.6.2-SNAPSHOT.jar>
to <https://builds.apache.org/job/axis2-1.6/ws/.repository/org/apache/axis2/axis2-kernel/1.6.2-SNAPSHOT/axis2-kernel-1.6.2-SNAPSHOT.jar>
[INFO] Installing <https://builds.apache.org/job/axis2-1.6/ws/axis2/modules/kernel/target/axis2-kernel-1.6.2-SNAPSHOT-sources.jar>
to <https://builds.apache.org/job/axis2-1.6/ws/.repository/org/apache/axis2/axis2-kernel/1.6.2-SNAPSHOT/axis2-kernel-1.6.2-SNAPSHOT-sources.jar>
[INFO] Installing <https://builds.apache.org/job/axis2-1.6/ws/axis2/modules/kernel/target/axis2-kernel-1.6.2-SNAPSHOT-javadoc.jar>
to <https://builds.apache.org/job/axis2-1.6/ws/.repository/org/apache/axis2/axis2-kernel/1.6.2-SNAPSHOT/axis2-kernel-1.6.2-SNAPSHOT-javadoc.jar>
[INFO] [deploy:deploy {execution: default-deploy}]
[INFO] Retrieving previous build number from apache.snapshots.https
[WARNING] *** CHECKSUM FAILED - Checksum failed on download: local = '647e45739372d65fb92470b877249f3c059016ad';
remote = 'b7a8ec2be1b5318a1a7356f4f673434841f99236' - RETRYING
[WARNING] *** CHECKSUM FAILED - Checksum failed on download: local = '647e45739372d65fb92470b877249f3c059016ad';
remote = 'b7a8ec2be1b5318a1a7356f4f673434841f99236' - IGNORING
Uploading: https://repository.apache.org/content/repositories/snapshots/org/apache/axis2/axis2-kernel/1.6.2-SNAPSHOT/axis2-kernel-1.6.2-20120306.152329-171.jar
1021K uploaded  (axis2-kernel-1.6.2-20120306.152329-171.jar)
[INFO] Uploading project information for axis2-kernel 1.6.2-20120306.152329-171
[INFO] Retrieving previous metadata from apache.snapshots.https
[WARNING] *** CHECKSUM FAILED - Checksum failed on download: local = '48bcdc836786038d546318b6386bb581c7fe9465';
remote = '8134da000d5897466b2ac387843134f58b2e1fb1' - RETRYING
[WARNING] *** CHECKSUM FAILED - Checksum failed on download: local = '48bcdc836786038d546318b6386bb581c7fe9465';
remote = '8134da000d5897466b2ac387843134f58b2e1fb1' - IGNORING
[INFO] Uploading repository metadata for: 'artifact org.apache.axis2:axis2-kernel'
[INFO] Retrieving previous metadata from apache.snapshots.https
[WARNING] *** CHECKSUM FAILED - Checksum failed on download: local = '647e45739372d65fb92470b877249f3c059016ad';
remote = 'b7a8ec2be1b5318a1a7356f4f673434841f99236' - RETRYING
[WARNING] *** CHECKSUM FAILED - Checksum failed on download: local = '647e45739372d65fb92470b877249f3c059016ad';
remote = 'b7a8ec2be1b5318a1a7356f4f673434841f99236' - IGNORING
[INFO] Uploading repository metadata for: 'snapshot org.apache.axis2:axis2-kernel:1.6.2-SNAPSHOT'
[INFO] Retrieving previous build number from apache.snapshots.https
Uploading: https://repository.apache.org/content/repositories/snapshots/org/apache/axis2/axis2-kernel/1.6.2-SNAPSHOT/axis2-kernel-1.6.2-20120306.152329-171-sources.jar
899K uploaded  (axis2-kernel-1.6.2-20120306.152329-171-sources.jar)
[INFO] Retrieving previous build number from apache.snapshots.https
Uploading: https://repository.apache.org/content/repositories/snapshots/org/apache/axis2/axis2-kernel/1.6.2-SNAPSHOT/axis2-kernel-1.6.2-20120306.152329-171-javadoc.jar
2598K uploaded  (axis2-kernel-1.6.2-20120306.152329-171-javadoc.jar)
Mar 6, 2012 3:24:44 PM hudson.remoting.Channel$ReaderThread run
SEVERE: I/O error in channel channel
java.io.StreamCorruptedException
	at java.io.ObjectInputStream.readObject0(ObjectInputStream.java:1332)
	at java.io.ObjectInputStream.readObject(ObjectInputStream.java:348)
	at hudson.remoting.Channel$ReaderThread.run(Channel.java:1127)
channel stopped
[INFO] ------------------------------------------------------------------------
[ERROR] FATAL ERROR
[INFO] ------------------------------------------------------------------------
[locks-and-latches] Releasing all the locks
[locks-and-latches] All the locks released
ERROR: Maven JVM terminated unexpectedly with exit code 0



---------------------------------------------------------------------
To unsubscribe, e-mail: java-dev-unsubscribe@axis.apache.org
For additional commands, e-mail: java-dev-help@axis.apache.org


Mime
View raw message