axis-java-dev mailing list archives

Site index · List index
Message view « Date » · « Thread »
Top « Date » · « Thread »
From Apache Jenkins Server <jenk...@builds.apache.org>
Subject Build failed in Jenkins: Axis2 » Apache Axis2 - SAAJ #1285
Date Tue, 06 Mar 2012 21:27:11 GMT
See <https://builds.apache.org/job/Axis2/org.apache.axis2$axis2-saaj/1285/>

------------------------------------------
[INFO] ------------------------------------------------------------------------
[INFO] Building Apache Axis2 - SAAJ
[INFO]    task-segment: [clean, deploy]
[INFO] ------------------------------------------------------------------------
[INFO] [clean:clean {execution: default-clean}]
[INFO] Deleting directory <https://builds.apache.org/job/Axis2/org.apache.axis2$axis2-saaj/ws/target>
[INFO] [remote-resources:process {execution: default}]
[INFO] [resources:resources {execution: default-resources}]
[INFO] Using 'UTF-8' encoding to copy filtered resources.
[INFO] Copying 4 resources
[INFO] Copying 2 resources
[INFO] [compiler:compile {execution: default-compile}]
[INFO] Compiling 27 source files to <https://builds.apache.org/job/Axis2/org.apache.axis2$axis2-saaj/ws/target/classes>
[INFO] -------------------------------------------------------------
[ERROR] COMPILATION ERROR : 
[INFO] -------------------------------------------------------------
[ERROR] <https://builds.apache.org/job/Axis2/org.apache.axis2$axis2-saaj/ws/src/org/apache/axis2/saaj/TextImplEx.java>:[32,7]
org.apache.axis2.saaj.TextImplEx is not abstract and does not override abstract method getParentNode()
in org.w3c.dom.Node

[ERROR] <https://builds.apache.org/job/Axis2/org.apache.axis2$axis2-saaj/ws/src/org/apache/axis2/saaj/CommentImpl.java>:[26,7]
org.apache.axis2.saaj.CommentImpl is not abstract and does not override abstract method getParentNode()
in org.w3c.dom.Node

[INFO] 2 errors 
[INFO] -------------------------------------------------------------
[JENKINS] Archiving <https://builds.apache.org/job/Axis2/org.apache.axis2$axis2-saaj/ws/pom.xml>
to /home/hudson/hudson/jobs/Axis2/modules/org.apache.axis2$axis2-saaj/builds/2012-03-06_21-23-18/archive/org.apache.axis2/axis2-saaj/1.7.0-SNAPSHOT/axis2-saaj-1.7.0-SNAPSHOT.pom
[INFO] ------------------------------------------------------------------------
[ERROR] BUILD FAILURE
[INFO] ------------------------------------------------------------------------
[INFO] Compilation failure

<https://builds.apache.org/job/Axis2/org.apache.axis2$axis2-saaj/ws/src/org/apache/axis2/saaj/TextImplEx.java>:[32,7]
org.apache.axis2.saaj.TextImplEx is not abstract and does not override abstract method getParentNode()
in org.w3c.dom.Node

<https://builds.apache.org/job/Axis2/org.apache.axis2$axis2-saaj/ws/src/org/apache/axis2/saaj/CommentImpl.java>:[26,7]
org.apache.axis2.saaj.CommentImpl is not abstract and does not override abstract method getParentNode()
in org.w3c.dom.Node


[INFO] ------------------------------------------------------------------------
[INFO] For more information, run Maven with the -e switch
[INFO] ------------------------------------------------------------------------
[INFO] Total time: 3 minutes 46 seconds
[INFO] Finished at: Tue Mar 06 21:27:10 GMT 2012
[INFO] Final Memory: 92M/249M
[INFO] ------------------------------------------------------------------------


---------------------------------------------------------------------
To unsubscribe, e-mail: java-dev-unsubscribe@axis.apache.org
For additional commands, e-mail: java-dev-help@axis.apache.org


Mime
View raw message