axis-java-dev mailing list archives

Site index · List index
Message view « Date » · « Thread »
Top « Date » · « Thread »
From Apache Jenkins Server <jenk...@builds.apache.org>
Subject Build failed in Jenkins: axis-trunk » Axis :: WAR #123
Date Sat, 24 Mar 2012 10:06:19 GMT
See <https://builds.apache.org/job/axis-trunk/org.apache.axis$axis-war/123/>

------------------------------------------
[...truncated 903 lines...]
SEVERE: Exception:
java.io.IOException: Non nillable element 'city' is null.
	at org.apache.axis.encoding.ser.BeanSerializer.serialize(BeanSerializer.java:215)
	at org.apache.axis.encoding.SerializationContext.serializeActual(SerializationContext.java:1504)
	at org.apache.axis.encoding.SerializationContext.serialize(SerializationContext.java:980)
	at org.apache.axis.encoding.SerializationContext.outputMultiRefs(SerializationContext.java:1055)
	at org.apache.axis.message.SOAPBody.outputImpl(SOAPBody.java:145)
	at org.apache.axis.message.SOAPEnvelope.outputImpl(SOAPEnvelope.java:478)
	at org.apache.axis.message.MessageElement.output(MessageElement.java:1208)
	at org.apache.axis.SOAPPart.writeTo(SOAPPart.java:315)
	at org.apache.axis.SOAPPart.writeTo(SOAPPart.java:269)
	at org.apache.axis.SOAPPart.saveChanges(SOAPPart.java:530)
	at org.apache.axis.attachments.AttachmentsImpl.getAttachmentCount(AttachmentsImpl.java:554)
	at org.apache.axis.Message.getContentType(Message.java:486)
	at org.apache.axis.transport.http.HTTPSender.writeToSocket(HTTPSender.java:343)
	at org.apache.axis.transport.http.HTTPSender.invoke(HTTPSender.java:138)
	at org.apache.axis.strategies.InvocationStrategy.visit(InvocationStrategy.java:32)
	at org.apache.axis.SimpleChain.doVisiting(SimpleChain.java:118)
	at org.apache.axis.SimpleChain.invoke(SimpleChain.java:83)
	at org.apache.axis.client.AxisClient.invoke(AxisClient.java:165)
	at org.apache.axis.client.Call$2.run(Call.java:2832)
	at java.lang.Thread.run(Thread.java:595)
Mar 24, 2012 10:05:52 AM org.apache.axis.attachments.AttachmentsImpl getAttachmentCount
WARNING: Exception:
AxisFault
 faultCode: {http://schemas.xmlsoap.org/soap/envelope/}Server.userException
 faultSubcode: 
 faultString: java.io.IOException: java.io.IOException: Non nillable element 'city' is null.
 faultActor: 
 faultNode: 
 faultDetail: 
	{http://xml.apache.org/axis/}stackTrace:java.io.IOException: java.io.IOException: Non nillable
element 'city' is null.
	at org.apache.axis.encoding.ser.BeanSerializer.serialize(BeanSerializer.java:275)
	at org.apache.axis.encoding.SerializationContext.serializeActual(SerializationContext.java:1504)
	at org.apache.axis.encoding.SerializationContext.serialize(SerializationContext.java:980)
	at org.apache.axis.encoding.SerializationContext.outputMultiRefs(SerializationContext.java:1055)
	at org.apache.axis.message.SOAPBody.outputImpl(SOAPBody.java:145)
	at org.apache.axis.message.SOAPEnvelope.outputImpl(SOAPEnvelope.java:478)
	at org.apache.axis.message.MessageElement.output(MessageElement.java:1208)
	at org.apache.axis.SOAPPart.writeTo(SOAPPart.java:315)
	at org.apache.axis.SOAPPart.writeTo(SOAPPart.java:269)
	at org.apache.axis.SOAPPart.saveChanges(SOAPPart.java:530)
	at org.apache.axis.attachments.AttachmentsImpl.getAttachmentCount(AttachmentsImpl.java:554)
	at org.apache.axis.Message.getContentType(Message.java:486)
	at org.apache.axis.transport.http.HTTPSender.writeToSocket(HTTPSender.java:343)
	at org.apache.axis.transport.http.HTTPSender.invoke(HTTPSender.java:138)
	at org.apache.axis.strategies.InvocationStrategy.visit(InvocationStrategy.java:32)
	at org.apache.axis.SimpleChain.doVisiting(SimpleChain.java:118)
	at org.apache.axis.SimpleChain.invoke(SimpleChain.java:83)
	at org.apache.axis.client.AxisClient.invoke(AxisClient.java:165)
	at org.apache.axis.client.Call$2.run(Call.java:2832)
	at java.lang.Thread.run(Thread.java:595)

	{http://xml.apache.org/axis/}hostname:hemera

java.io.IOException: java.io.IOException: Non nillable element 'city' is null.
	at org.apache.axis.AxisFault.makeFault(AxisFault.java:101)
	at org.apache.axis.SOAPPart.writeTo(SOAPPart.java:317)
	at org.apache.axis.SOAPPart.writeTo(SOAPPart.java:269)
	at org.apache.axis.SOAPPart.saveChanges(SOAPPart.java:530)
	at org.apache.axis.attachments.AttachmentsImpl.getAttachmentCount(AttachmentsImpl.java:554)
	at org.apache.axis.Message.getContentType(Message.java:486)
	at org.apache.axis.transport.http.HTTPSender.writeToSocket(HTTPSender.java:343)
	at org.apache.axis.transport.http.HTTPSender.invoke(HTTPSender.java:138)
	at org.apache.axis.strategies.InvocationStrategy.visit(InvocationStrategy.java:32)
	at org.apache.axis.SimpleChain.doVisiting(SimpleChain.java:118)
	at org.apache.axis.SimpleChain.invoke(SimpleChain.java:83)
	at org.apache.axis.client.AxisClient.invoke(AxisClient.java:165)
	at org.apache.axis.client.Call$2.run(Call.java:2832)
	at java.lang.Thread.run(Thread.java:595)
Caused by: java.io.IOException: java.io.IOException: Non nillable element 'city' is null.
	at org.apache.axis.encoding.ser.BeanSerializer.serialize(BeanSerializer.java:275)
	at org.apache.axis.encoding.SerializationContext.serializeActual(SerializationContext.java:1504)
	at org.apache.axis.encoding.SerializationContext.serialize(SerializationContext.java:980)
	at org.apache.axis.encoding.SerializationContext.outputMultiRefs(SerializationContext.java:1055)
	at org.apache.axis.message.SOAPBody.outputImpl(SOAPBody.java:145)
	at org.apache.axis.message.SOAPEnvelope.outputImpl(SOAPEnvelope.java:478)
	at org.apache.axis.message.MessageElement.output(MessageElement.java:1208)
	at org.apache.axis.SOAPPart.writeTo(SOAPPart.java:315)
	... 12 more
Mar 24, 2012 10:05:52 AM org.apache.axis.encoding.ser.BeanSerializer serialize
SEVERE: Exception:
java.io.IOException: Non nillable element 'city' is null.
	at org.apache.axis.encoding.ser.BeanSerializer.serialize(BeanSerializer.java:215)
	at org.apache.axis.encoding.SerializationContext.serializeActual(SerializationContext.java:1504)
	at org.apache.axis.encoding.SerializationContext.serialize(SerializationContext.java:980)
	at org.apache.axis.encoding.SerializationContext.outputMultiRefs(SerializationContext.java:1055)
	at org.apache.axis.message.SOAPBody.outputImpl(SOAPBody.java:145)
	at org.apache.axis.message.SOAPEnvelope.outputImpl(SOAPEnvelope.java:478)
	at org.apache.axis.message.MessageElement.output(MessageElement.java:1208)
	at org.apache.axis.SOAPPart.writeTo(SOAPPart.java:315)
	at org.apache.axis.SOAPPart.writeTo(SOAPPart.java:269)
	at org.apache.axis.SOAPPart.saveChanges(SOAPPart.java:530)
	at org.apache.axis.SOAPPart.getContentLength(SOAPPart.java:229)
	at org.apache.axis.Message.getContentLength(Message.java:510)
	at org.apache.axis.transport.http.HTTPSender.writeToSocket(HTTPSender.java:371)
	at org.apache.axis.transport.http.HTTPSender.invoke(HTTPSender.java:138)
	at org.apache.axis.strategies.InvocationStrategy.visit(InvocationStrategy.java:32)
	at org.apache.axis.SimpleChain.doVisiting(SimpleChain.java:118)
	at org.apache.axis.SimpleChain.invoke(SimpleChain.java:83)
	at org.apache.axis.client.AxisClient.invoke(AxisClient.java:165)
	at org.apache.axis.client.Call$2.run(Call.java:2832)
	at java.lang.Thread.run(Thread.java:595)
Tests run: 3, Failures: 0, Errors: 0, Skipped: 0, Time elapsed: 0.066 sec
Running test.wsdl.jaxrpchandler2.JAXRPCHandler2TestCase
Tests run: 2, Failures: 0, Errors: 0, Skipped: 0, Time elapsed: 0.009 sec
Running test.wsdl.getPort.GetPortTestCase
Tests run: 5, Failures: 0, Errors: 0, Skipped: 0, Time elapsed: 0.012 sec
Running test.wsdl.nested.Nested2ServiceTestCase
Tests run: 1, Failures: 0, Errors: 0, Skipped: 0, Time elapsed: 0.015 sec
Running test.wsdl.primitiveWrappers.TypeWrapper_ServiceTestCase
Tests run: 2, Failures: 0, Errors: 0, Skipped: 0, Time elapsed: 0.018 sec
Running test.wsdl.attrGroup.AttrGroupServiceTestCase
Tests run: 1, Failures: 0, Errors: 0, Skipped: 0, Time elapsed: 0.042 sec
Running test.import2.ImportServiceTestCase
Tests run: 6, Failures: 0, Errors: 0, Skipped: 0, Time elapsed: 0.025 sec
Running test.encoding.TestDeser2000
Tests run: 43, Failures: 0, Errors: 0, Skipped: 0, Time elapsed: 0.078 sec
Running test.encoding.TestDeser
Tests run: 39, Failures: 0, Errors: 0, Skipped: 0, Time elapsed: 0.066 sec
Running test.encoding.TestDeser2001
Tests run: 77, Failures: 0, Errors: 0, Skipped: 0, Time elapsed: 0.137 sec
Running test.encoding.TestDeser1999
Tests run: 43, Failures: 0, Errors: 0, Skipped: 0, Time elapsed: 0.065 sec

Results :

Tests run: 541, Failures: 0, Errors: 0, Skipped: 0

[WARNING] File encoding has not been set, using platform encoding ANSI_X3.4-1968, i.e. build
is platform dependent!
[JENKINS] Recording test results
[INFO] 
[INFO] Mar 24, 2012 10:05:54 AM org.apache.axis.utils.Admin processWSDD
SEVERE: Administration service requested to quit, quitting.
--- maven-axis-server-plugin:1.4.1-SNAPSHOT:stop-all (stop-server) @ integration ---
2012-03-24 10:05:54.017:INFO::Graceful shutdown SocketConnector@0.0.0.0:56273
2012-03-24 10:05:54.017:INFO::Graceful shutdown org.mortbay.jetty.servlet.Context@126456a{/axis,file:/x1/jenkins/jenkins-slave/workspace/axis-trunk/axis/integration/target/axis-server/56273/;file:/x1/jenkins/jenkins-slave/workspace/axis-trunk/axis/axis-war/src/main/webapp/;file:/x1/jenkins/jenkins-slave/workspace/axis-trunk/axis/integration/src/test/jws/;}
2012-03-24 10:05:55.018:INFO::Stopped SocketConnector@0.0.0.0:56273
[INFO] Server on port 56273 stopped
[INFO] [INFO] Failsafe report directory: /home/jenkins/jenkins-slave/workspace/axis-trunk/axis/integration/target/failsafe-reports
[WARNING] File encoding has not been set, using platform encoding ANSI_X3.4-1968, i.e. build
is platform dependent!

[INFO] --- maven-failsafe-plugin:2.11:verify (default) @ integration ---
[INFO] 
[INFO] --- maven-gpg-plugin:1.1:sign (default) @ integration ---
[INFO] [INFO] Installing /home/jenkins/jenkins-slave/workspace/axis-trunk/axis/integration/target/integration-1.4.1-SNAPSHOT.jar
to /home/jenkins/jenkins-slave/maven-repositories/0/org/apache/axis/integration/1.4.1-SNAPSHOT/integration-1.4.1-SNAPSHOT.jar
[INFO] Installing /home/jenkins/jenkins-slave/workspace/axis-trunk/axis/integration/pom.xml
to /home/jenkins/jenkins-slave/maven-repositories/0/org/apache/axis/integration/1.4.1-SNAPSHOT/integration-1.4.1-SNAPSHOT.pom
[INFO] Installing /home/jenkins/jenkins-slave/workspace/axis-trunk/axis/integration/target/integration-1.4.1-SNAPSHOT-sources.jar
to /home/jenkins/jenkins-slave/maven-repositories/0/org/apache/axis/integration/1.4.1-SNAPSHOT/integration-1.4.1-SNAPSHOT-sources.jar

[INFO] Installing /home/jenkins/jenkins-slave/workspace/axis-trunk/axis/integration/target/integration-1.4.1-SNAPSHOT-javadoc.jar
to /home/jenkins/jenkins-slave/maven-repositories/0/org/apache/axis/integration/1.4.1-SNAPSHOT/integration-1.4.1-SNAPSHOT-javadoc.jar
[INFO] --- maven-install-plugin:2.3.1:install (default-install) @ integration ---
[INFO] [INFO] Skipping artifact deployment

[INFO] --- maven-deploy-plugin:2.5:deploy (default-deploy) @ integration ---
[INFO] 
[INFO] [INFO] maven.site.skip = true: Skipping site generation
--- maven-site-plugin:3.0:site (default-site) @ integration ---
[JENKINS] Archiving /home/jenkins/jenkins-slave/workspace/axis-trunk/axis/integration/target/integration-1.4.1-SNAPSHOT-sources.jar
to /home/hudson/hudson/jobs/axis-trunk/modules/org.apache.axis$integration/builds/2012-03-24_10-01-28/archive/org.apache.axis/integration/1.4.1-SNAPSHOT/integration-1.4.1-SNAPSHOT-sources.jar
[JENKINS] Archiving /home/jenkins/jenkins-slave/workspace/axis-trunk/axis/integration/target/integration-1.4.1-SNAPSHOT-javadoc.jar
to /home/hudson/hudson/jobs/axis-trunk/modules/org.apache.axis$integration/builds/2012-03-24_10-01-28/archive/org.apache.axis/integration/1.4.1-SNAPSHOT/integration-1.4.1-SNAPSHOT-javadoc.jar
[INFO]                                                                         
[INFO] ------------------------------------------------------------------------
[INFO] Building Axis :: WAR 1.4.1-SNAPSHOT
[INFO] ------------------------------------------------------------------------
Downloading: http://repo1.maven.org/maven2/org/mortbay/jetty/jetty-maven-plugin/7.5.4.v20111024/jetty-maven-plugin-7.5.4.v20111024.pom
Downloaded: http://repo1.maven.org/maven2/org/mortbay/jetty/jetty-maven-plugin/7.5.4.v20111024/jetty-maven-plugin-7.5.4.v20111024.pom
(7 KB at 18.6 KB/sec)
Downloading: http://repo1.maven.org/maven2/org/mortbay/jetty/jetty-integration-project/7.5.4.v20111024/jetty-integration-project-7.5.4.v20111024.pom
Downloaded: http://repo1.maven.org/maven2/org/mortbay/jetty/jetty-integration-project/7.5.4.v20111024/jetty-integration-project-7.5.4.v20111024.pom
(8 KB at 15.3 KB/sec)
Downloading: http://repo1.maven.org/maven2/org/mortbay/jetty/jetty-maven-plugin/7.5.4.v20111024/jetty-maven-plugin-7.5.4.v20111024.jar
Downloaded: http://repo1.maven.org/maven2/org/mortbay/jetty/jetty-maven-plugin/7.5.4.v20111024/jetty-maven-plugin-7.5.4.v20111024.jar
(66 KB at 140.7 KB/sec)
Downloading: http://repo1.maven.org/maven2/httpunit/httpunit/1.6.1/httpunit-1.6.1.pom
Downloaded: http://repo1.maven.org/maven2/httpunit/httpunit/1.6.1/httpunit-1.6.1.pom (3 KB
at 4.3 KB/sec)
Downloading: http://repo1.maven.org/maven2/httpunit/httpunit/1.6.1/httpunit-1.6.1.jar
Downloaded: http://repo1.maven.org/maven2/httpunit/httpunit/1.6.1/httpunit-1.6.1.jar (398
KB at 577.9 KB/sec)
[INFO] 
[INFO] --- maven-clean-plugin:2.4.1:clean (default-clean) @ axis-war ---
[INFO] 
[INFO] --- maven-remote-resources-plugin:1.1:process (default) @ axis-war ---
[INFO] [INFO] Using 'UTF-8' encoding to copy filtered resources.
[INFO] Copying 5 resources

[INFO] [INFO] Copying 3 resources
--- maven-resources-plugin:2.4.3:resources (default-resources) @ axis-war ---
[INFO] [INFO] No sources to compile

[INFO] --- maven-compiler-plugin:2.3.2:compile (default-compile) @ axis-war ---
[INFO] [INFO] Using 'UTF-8' encoding to copy filtered resources.
[INFO] skip non existing resourceDirectory <https://builds.apache.org/job/axis-trunk/org.apache.axis$axis-war/ws/src/test/resources>
[INFO] Copying 3 resources

[INFO] --- maven-resources-plugin:2.4.3:testResources (default-testResources) @ axis-war ---
[INFO] 
[INFO] [INFO] Compiling 5 source files to <https://builds.apache.org/job/axis-trunk/org.apache.axis$axis-war/ws/target/test-classes>
--- maven-compiler-plugin:2.3.2:testCompile (default-testCompile) @ axis-war ---
[INFO] [INFO] Tests are skipped.

[INFO] --- maven-surefire-plugin:2.11:test (default-test) @ axis-war ---
[INFO] 
[INFO] --- maven-war-plugin:2.1.1:war (default-war) @ axis-war ---
[INFO] Packaging webapp
[INFO] Assembling webapp [axis-war] in [<https://builds.apache.org/job/axis-trunk/org.apache.axis$axis-war/ws/target/axis-war-1.4.1-SNAPSHOT]>
[INFO] Processing war project
[INFO] Copying webapp resources [<https://builds.apache.org/job/axis-trunk/org.apache.axis$axis-war/ws/src/main/webapp]>
[INFO] Webapp assembled in [43 msecs]
[INFO] Building war: <https://builds.apache.org/job/axis-trunk/org.apache.axis$axis-war/ws/target/axis-war-1.4.1-SNAPSHOT.war>
[INFO] WEB-INF/web.xml already added, skipping
[INFO] 
[INFO] [INFO] Skipping the assembly in this project because it's not the Execution Root
--- maven-assembly-plugin:2.2.2:single (source-release-assembly) @ axis-war ---
Mar 24, 2012 10:06:00 AM hudson.maven.ExecutedMojo <init>
WARNING: Failed to getClass for org.apache.maven.plugin.source.SourceJarMojo
[INFO] 
[INFO] --- maven-source-plugin:2.1.2:jar (attach-sources) @ axis-war ---
[INFO] META-INF already added, skipping
[INFO] META-INF/DEPENDENCIES already added, skipping
[INFO] META-INF/NOTICE already added, skipping
[INFO] META-INF/LICENSE already added, skipping
[INFO] Building jar: <https://builds.apache.org/job/axis-trunk/org.apache.axis$axis-war/ws/target/axis-war-1.4.1-SNAPSHOT-sources.jar>
[INFO] META-INF already added, skipping
[INFO] META-INF/DEPENDENCIES already added, skipping
[INFO] META-INF/NOTICE already added, skipping
[INFO] META-INF/LICENSE already added, skipping
[INFO] 
[INFO] --- maven-javadoc-plugin:2.5:jar (attach-javadocs) @ axis-war ---
[INFO] 
[INFO] --- maven-resources-plugin:2.4.3:copy-resources (copy-web-xml) @ axis-war ---
[INFO] Using 'UTF-8' encoding to copy filtered resources.
[INFO] Copying 1 resource
[INFO] 
[INFO] --- maven-remote-resources-plugin:1.1:process (default) @ axis-war ---
[INFO] [INFO] Using 'UTF-8' encoding to copy filtered resources.
[INFO] Copying 5 resources

[INFO] Copying 3 resources
[INFO] [INFO] Copying 3 resources
--- maven-resources-plugin:2.4.3:resources (default-resources) @ axis-war ---
[INFO] [INFO] No sources to compile

[INFO] --- maven-compiler-plugin:2.3.2:compile (default-compile) @ axis-war ---
[INFO] [INFO] Using 'UTF-8' encoding to copy filtered resources.
[INFO] skip non existing resourceDirectory <https://builds.apache.org/job/axis-trunk/org.apache.axis$axis-war/ws/src/test/resources>
[INFO] Copying 3 resources
[INFO] Copying 3 resources

[INFO] --- maven-resources-plugin:2.4.3:testResources (default-testResources) @ axis-war ---
[INFO] 
[INFO] --- maven-compiler-plugin:2.3.2:testCompile (default-testCompile) @ axis-war ---[INFO]
Nothing to compile - all classes are up to date

[JENKINS] Archiving <https://builds.apache.org/job/axis-trunk/org.apache.axis$axis-war/ws/pom.xml>
to /home/hudson/hudson/jobs/axis-trunk/modules/org.apache.axis$axis-war/builds/2012-03-24_10-01-28/archive/org.apache.axis/axis-war/1.4.1-SNAPSHOT/axis-war-1.4.1-SNAPSHOT.pom
[JENKINS] Archiving <https://builds.apache.org/job/axis-trunk/org.apache.axis$axis-war/ws/target/axis-war-1.4.1-SNAPSHOT-sources.jar>
to /home/hudson/hudson/jobs/axis-trunk/modules/org.apache.axis$axis-war/builds/2012-03-24_10-01-28/archive/org.apache.axis/axis-war/1.4.1-SNAPSHOT/axis-war-1.4.1-SNAPSHOT-sources.jar

---------------------------------------------------------------------
To unsubscribe, e-mail: java-dev-unsubscribe@axis.apache.org
For additional commands, e-mail: java-dev-help@axis.apache.org


Mime
View raw message