axis-java-dev mailing list archives

Site index · List index
Message view « Date » · « Thread »
Top « Date » · « Thread »
From Apache Jenkins Server <jenk...@builds.apache.org>
Subject Build failed in Jenkins: axis2-1.6 #242
Date Sat, 25 Feb 2012 18:04:18 GMT
See <https://builds.apache.org/job/axis2-1.6/242/>

------------------------------------------
[...truncated 14462 lines...]
[INFO] [install:install {execution: default-install}]
[INFO] Installing <https://builds.apache.org/job/axis2-1.6/ws/axis2/modules/jaxws/target/axis2-jaxws-1.6.2-SNAPSHOT.jar>
to <https://builds.apache.org/job/axis2-1.6/ws/.repository/org/apache/axis2/axis2-jaxws/1.6.2-SNAPSHOT/axis2-jaxws-1.6.2-SNAPSHOT.jar>
[INFO] Installing <https://builds.apache.org/job/axis2-1.6/ws/axis2/modules/jaxws/target/axis2-jaxws-1.6.2-SNAPSHOT-sources.jar>
to <https://builds.apache.org/job/axis2-1.6/ws/.repository/org/apache/axis2/axis2-jaxws/1.6.2-SNAPSHOT/axis2-jaxws-1.6.2-SNAPSHOT-sources.jar>
[INFO] Installing <https://builds.apache.org/job/axis2-1.6/ws/axis2/modules/jaxws/target/axis2-jaxws-1.6.2-SNAPSHOT-javadoc.jar>
to <https://builds.apache.org/job/axis2-1.6/ws/.repository/org/apache/axis2/axis2-jaxws/1.6.2-SNAPSHOT/axis2-jaxws-1.6.2-SNAPSHOT-javadoc.jar>
[INFO] [deploy:deploy {execution: default-deploy}]
[INFO] Retrieving previous build number from apache.snapshots.https
[WARNING] *** CHECKSUM FAILED - Checksum failed on download: local = 'cd562032efaae0edfae143eb2fa1d2fd7b9cc3c1';
remote = '64641e9974fa78cacc55fdeea5d62e16b51e5205' - RETRYING
[WARNING] *** CHECKSUM FAILED - Checksum failed on download: local = 'cd562032efaae0edfae143eb2fa1d2fd7b9cc3c1';
remote = '64641e9974fa78cacc55fdeea5d62e16b51e5205' - IGNORING
Uploading: https://repository.apache.org/content/repositories/snapshots/org/apache/axis2/axis2-jaxws/1.6.2-SNAPSHOT/axis2-jaxws-1.6.2-20120225.175209-149.jar
726K uploaded  (axis2-jaxws-1.6.2-20120225.175209-149.jar)
[INFO] Retrieving previous metadata from apache.snapshots.https
[WARNING] *** CHECKSUM FAILED - Checksum failed on download: local = '9104c396e274492b7d95f0a8b6082151897774cd';
remote = '80f29fed66102a7f1d0684ceda088b41c1c85a1c' - RETRYING
[WARNING] *** CHECKSUM FAILED - Checksum failed on download: local = '9104c396e274492b7d95f0a8b6082151897774cd';
remote = '80f29fed66102a7f1d0684ceda088b41c1c85a1c' - IGNORING
[INFO] Uploading repository metadata for: 'artifact org.apache.axis2:axis2-jaxws'
[INFO] Uploading project information for axis2-jaxws 1.6.2-20120225.175209-149
[INFO] Retrieving previous metadata from apache.snapshots.https
[WARNING] *** CHECKSUM FAILED - Checksum failed on download: local = 'cd562032efaae0edfae143eb2fa1d2fd7b9cc3c1';
remote = '64641e9974fa78cacc55fdeea5d62e16b51e5205' - RETRYING
[WARNING] *** CHECKSUM FAILED - Checksum failed on download: local = 'cd562032efaae0edfae143eb2fa1d2fd7b9cc3c1';
remote = '64641e9974fa78cacc55fdeea5d62e16b51e5205' - IGNORING
[INFO] Uploading repository metadata for: 'snapshot org.apache.axis2:axis2-jaxws:1.6.2-SNAPSHOT'
[INFO] Retrieving previous build number from apache.snapshots.https
Uploading: https://repository.apache.org/content/repositories/snapshots/org/apache/axis2/axis2-jaxws/1.6.2-SNAPSHOT/axis2-jaxws-1.6.2-20120225.175209-149-sources.jar
630K uploaded  (axis2-jaxws-1.6.2-20120225.175209-149-sources.jar)
[INFO] Retrieving previous build number from apache.snapshots.https
Uploading: https://repository.apache.org/content/repositories/snapshots/org/apache/axis2/axis2-jaxws/1.6.2-SNAPSHOT/axis2-jaxws-1.6.2-20120225.175209-149-javadoc.jar
1852K uploaded  (axis2-jaxws-1.6.2-20120225.175209-149-javadoc.jar)
[JENKINS] Archiving <https://builds.apache.org/job/axis2-1.6/ws/axis2/modules/jaxws/pom.xml>
to /home/hudson/hudson/jobs/axis2-1.6/modules/org.apache.axis2$axis2-jaxws/builds/2012-02-25_17-48-09/archive/org.apache.axis2/axis2-jaxws/1.6.2-SNAPSHOT/axis2-jaxws-1.6.2-SNAPSHOT.pom
[JENKINS] Archiving <https://builds.apache.org/job/axis2-1.6/ws/axis2/modules/jaxws/target/axis2-jaxws-1.6.2-SNAPSHOT.jar>
to /home/hudson/hudson/jobs/axis2-1.6/modules/org.apache.axis2$axis2-jaxws/builds/2012-02-25_17-48-09/archive/org.apache.axis2/axis2-jaxws/1.6.2-20120225.175209-149/axis2-jaxws-1.6.2-20120225.175209-149.jar
[JENKINS] Archiving <https://builds.apache.org/job/axis2-1.6/ws/axis2/modules/jaxws/target/axis2-jaxws-1.6.2-SNAPSHOT-sources.jar>
to /home/hudson/hudson/jobs/axis2-1.6/modules/org.apache.axis2$axis2-jaxws/builds/2012-02-25_17-48-09/archive/org.apache.axis2/axis2-jaxws/1.6.2-20120225.175209-149/axis2-jaxws-1.6.2-20120225.175209-149-sources.jar
[JENKINS] Archiving <https://builds.apache.org/job/axis2-1.6/ws/axis2/modules/jaxws/target/axis2-jaxws-1.6.2-SNAPSHOT-javadoc.jar>
to /home/hudson/hudson/jobs/axis2-1.6/modules/org.apache.axis2$axis2-jaxws/builds/2012-02-25_17-48-09/archive/org.apache.axis2/axis2-jaxws/1.6.2-20120225.175209-149/axis2-jaxws-1.6.2-20120225.175209-149-javadoc.jar
[INFO] ------------------------------------------------------------------------
[INFO] Building Apache Axis2 - Test Utilities
[INFO]    task-segment: [clean, deploy]
[INFO] ------------------------------------------------------------------------
[INFO] [clean:clean {execution: default-clean}]
[INFO] [remote-resources:process {execution: default}]
[INFO] [resources:resources {execution: default-resources}]
[INFO] Using 'UTF-8' encoding to copy filtered resources.
[INFO] skip non existing resourceDirectory <https://builds.apache.org/job/axis2-1.6/ws/axis2/modules/testutils/src/main/resources>
[INFO] Copying 2 resources
[INFO] [compiler:compile {execution: default-compile}]
[INFO] Compiling 6 source files to <https://builds.apache.org/job/axis2-1.6/ws/axis2/modules/testutils/target/classes>
[INFO] [resources:testResources {execution: default-testResources}]
[INFO] Using 'UTF-8' encoding to copy filtered resources.
[INFO] skip non existing resourceDirectory <https://builds.apache.org/job/axis2-1.6/ws/axis2/modules/testutils/src/test/resources>
[INFO] Copying 2 resources
[INFO] [compiler:testCompile {execution: default-testCompile}]
[INFO] No sources to compile
[INFO] [surefire:test {execution: default-test}]
[INFO] Surefire report directory: <https://builds.apache.org/job/axis2-1.6/ws/axis2/modules/testutils/target/surefire-reports>

-------------------------------------------------------
 T E S T S
-------------------------------------------------------
There are no tests to run.

Results :

Tests run: 0, Failures: 0, Errors: 0, Skipped: 0

[JENKINS] Recording test results
[INFO] [jar:jar {execution: default-jar}]
[INFO] Building jar: <https://builds.apache.org/job/axis2-1.6/ws/axis2/modules/testutils/target/axis2-testutils-1.6.2-SNAPSHOT.jar>
[INFO] [assembly:single {execution: source-release-assembly}]
[INFO] Skipping the assembly in this project because it's not the Execution Root
[INFO] Preparing source:jar
[WARNING] Removing: jar from forked lifecycle, to prevent recursive invocation.
[INFO] No goals needed for project - skipping
[INFO] [source:jar {execution: attach-sources}]
[INFO] Building jar: <https://builds.apache.org/job/axis2-1.6/ws/axis2/modules/testutils/target/axis2-testutils-1.6.2-SNAPSHOT-sources.jar>
[INFO] [javadoc:jar {execution: attach-javadocs}]
Loading source files for package org.apache.axis2.testutils...
Constructing Javadoc information...
Standard Doclet version 1.5.0_22
Building tree for all the packages and classes...
Generating <https://builds.apache.org/job/axis2-1.6/ws/axis2/modules/testutils/target/apidocs/org/apache/axis2/testutils//AllTestsWithRuntimeIgnore.html...>
Generating <https://builds.apache.org/job/axis2-1.6/ws/axis2/modules/testutils/target/apidocs/org/apache/axis2/testutils//JUnit38ClassRunnerWithRuntimeIgnore.html...>
Generating <https://builds.apache.org/job/axis2-1.6/ws/axis2/modules/testutils/target/apidocs/org/apache/axis2/testutils//PortAllocator.html...>
Generating <https://builds.apache.org/job/axis2-1.6/ws/axis2/modules/testutils/target/apidocs/org/apache/axis2/testutils//RuntimeIgnoreException.html...>
Generating <https://builds.apache.org/job/axis2-1.6/ws/axis2/modules/testutils/target/apidocs/org/apache/axis2/testutils//package-frame.html...>
Generating <https://builds.apache.org/job/axis2-1.6/ws/axis2/modules/testutils/target/apidocs/org/apache/axis2/testutils//package-summary.html...>
Generating <https://builds.apache.org/job/axis2-1.6/ws/axis2/modules/testutils/target/apidocs/org/apache/axis2/testutils//package-tree.html...>
Generating <https://builds.apache.org/job/axis2-1.6/ws/axis2/modules/testutils/target/apidocs/constant-values.html...>
Generating <https://builds.apache.org/job/axis2-1.6/ws/axis2/modules/testutils/target/apidocs/serialized-form.html...>
Generating <https://builds.apache.org/job/axis2-1.6/ws/axis2/modules/testutils/target/apidocs/org/apache/axis2/testutils/class-use//JUnit38ClassRunnerWithRuntimeIgnore.html...>
Generating <https://builds.apache.org/job/axis2-1.6/ws/axis2/modules/testutils/target/apidocs/org/apache/axis2/testutils/class-use//PortAllocator.html...>
Generating <https://builds.apache.org/job/axis2-1.6/ws/axis2/modules/testutils/target/apidocs/org/apache/axis2/testutils/class-use//RuntimeIgnoreException.html...>
Generating <https://builds.apache.org/job/axis2-1.6/ws/axis2/modules/testutils/target/apidocs/org/apache/axis2/testutils/class-use//AllTestsWithRuntimeIgnore.html...>
Generating <https://builds.apache.org/job/axis2-1.6/ws/axis2/modules/testutils/target/apidocs/org/apache/axis2/testutils//package-use.html...>
Building index for all the packages and classes...
Generating <https://builds.apache.org/job/axis2-1.6/ws/axis2/modules/testutils/target/apidocs/overview-tree.html...>
Generating <https://builds.apache.org/job/axis2-1.6/ws/axis2/modules/testutils/target/apidocs/index-all.html...>
Generating <https://builds.apache.org/job/axis2-1.6/ws/axis2/modules/testutils/target/apidocs/deprecated-list.html...>
Building index for all classes...
Generating <https://builds.apache.org/job/axis2-1.6/ws/axis2/modules/testutils/target/apidocs/allclasses-frame.html...>
Generating <https://builds.apache.org/job/axis2-1.6/ws/axis2/modules/testutils/target/apidocs/allclasses-noframe.html...>
Generating <https://builds.apache.org/job/axis2-1.6/ws/axis2/modules/testutils/target/apidocs/index.html...>
Generating <https://builds.apache.org/job/axis2-1.6/ws/axis2/modules/testutils/target/apidocs/help-doc.html...>
Generating <https://builds.apache.org/job/axis2-1.6/ws/axis2/modules/testutils/target/apidocs/stylesheet.css...>
[INFO] Building jar: <https://builds.apache.org/job/axis2-1.6/ws/axis2/modules/testutils/target/axis2-testutils-1.6.2-SNAPSHOT-javadoc.jar>
[INFO] [gpg:sign {execution: default}]
[INFO] [install:install {execution: default-install}]
[INFO] Installing <https://builds.apache.org/job/axis2-1.6/ws/axis2/modules/testutils/target/axis2-testutils-1.6.2-SNAPSHOT.jar>
to <https://builds.apache.org/job/axis2-1.6/ws/.repository/org/apache/axis2/axis2-testutils/1.6.2-SNAPSHOT/axis2-testutils-1.6.2-SNAPSHOT.jar>
[INFO] Installing <https://builds.apache.org/job/axis2-1.6/ws/axis2/modules/testutils/target/axis2-testutils-1.6.2-SNAPSHOT-sources.jar>
to <https://builds.apache.org/job/axis2-1.6/ws/.repository/org/apache/axis2/axis2-testutils/1.6.2-SNAPSHOT/axis2-testutils-1.6.2-SNAPSHOT-sources.jar>
[INFO] Installing <https://builds.apache.org/job/axis2-1.6/ws/axis2/modules/testutils/target/axis2-testutils-1.6.2-SNAPSHOT-javadoc.jar>
to <https://builds.apache.org/job/axis2-1.6/ws/.repository/org/apache/axis2/axis2-testutils/1.6.2-SNAPSHOT/axis2-testutils-1.6.2-SNAPSHOT-javadoc.jar>
[INFO] [deploy:deploy {execution: default-deploy}]
[INFO] Retrieving previous build number from apache.snapshots.https
[WARNING] *** CHECKSUM FAILED - Checksum failed on download: local = '239089f7bbe2829759bb792002d89ac8c25b27a4';
remote = '677e53af2db8e395362875bc2300a87b5e774be3' - RETRYING
[WARNING] *** CHECKSUM FAILED - Checksum failed on download: local = '239089f7bbe2829759bb792002d89ac8c25b27a4';
remote = '677e53af2db8e395362875bc2300a87b5e774be3' - IGNORING
Uploading: https://repository.apache.org/content/repositories/snapshots/org/apache/axis2/axis2-testutils/1.6.2-SNAPSHOT/axis2-testutils-1.6.2-20120225.175209-148.jar
10K uploaded  (axis2-testutils-1.6.2-20120225.175209-148.jar)
[INFO] Retrieving previous metadata from apache.snapshots.https
[WARNING] *** CHECKSUM FAILED - Checksum failed on download: local = '239089f7bbe2829759bb792002d89ac8c25b27a4';
remote = '677e53af2db8e395362875bc2300a87b5e774be3' - RETRYING
[WARNING] *** CHECKSUM FAILED - Checksum failed on download: local = '239089f7bbe2829759bb792002d89ac8c25b27a4';
remote = '677e53af2db8e395362875bc2300a87b5e774be3' - IGNORING
[INFO] Uploading repository metadata for: 'snapshot org.apache.axis2:axis2-testutils:1.6.2-SNAPSHOT'
[INFO] Uploading project information for axis2-testutils 1.6.2-20120225.175209-148
[INFO] Retrieving previous metadata from apache.snapshots.https
[WARNING] *** CHECKSUM FAILED - Checksum failed on download: local = '9be9457f890f7c04604ffa0c92fdad36f7596a9f';
remote = '6a6ab975ef1593e965bcaf5de88dc5f90517ab2f' - RETRYING
[WARNING] *** CHECKSUM FAILED - Checksum failed on download: local = '9be9457f890f7c04604ffa0c92fdad36f7596a9f';
remote = '6a6ab975ef1593e965bcaf5de88dc5f90517ab2f' - IGNORING
[INFO] Uploading repository metadata for: 'artifact org.apache.axis2:axis2-testutils'
[INFO] Retrieving previous build number from apache.snapshots.https
Uploading: https://repository.apache.org/content/repositories/snapshots/org/apache/axis2/axis2-testutils/1.6.2-SNAPSHOT/axis2-testutils-1.6.2-20120225.175209-148-sources.jar
10K uploaded  (axis2-testutils-1.6.2-20120225.175209-148-sources.jar)
[INFO] Retrieving previous build number from apache.snapshots.https
Uploading: https://repository.apache.org/content/repositories/snapshots/org/apache/axis2/axis2-testutils/1.6.2-SNAPSHOT/axis2-testutils-1.6.2-20120225.175209-148-javadoc.jar
40K uploaded  (axis2-testutils-1.6.2-20120225.175209-148-javadoc.jar)
[JENKINS] Archiving <https://builds.apache.org/job/axis2-1.6/ws/axis2/modules/testutils/pom.xml>
to /home/hudson/hudson/jobs/axis2-1.6/modules/org.apache.axis2$axis2-testutils/builds/2012-02-25_17-48-09/archive/org.apache.axis2/axis2-testutils/1.6.2-SNAPSHOT/axis2-testutils-1.6.2-SNAPSHOT.pom
[JENKINS] Archiving <https://builds.apache.org/job/axis2-1.6/ws/axis2/modules/testutils/target/axis2-testutils-1.6.2-SNAPSHOT.jar>
to /home/hudson/hudson/jobs/axis2-1.6/modules/org.apache.axis2$axis2-testutils/builds/2012-02-25_17-48-09/archive/org.apache.axis2/axis2-testutils/1.6.2-20120225.175209-148/axis2-testutils-1.6.2-20120225.175209-148.jar
[JENKINS] Archiving <https://builds.apache.org/job/axis2-1.6/ws/axis2/modules/testutils/target/axis2-testutils-1.6.2-SNAPSHOT-sources.jar>
to /home/hudson/hudson/jobs/axis2-1.6/modules/org.apache.axis2$axis2-testutils/builds/2012-02-25_17-48-09/archive/org.apache.axis2/axis2-testutils/1.6.2-20120225.175209-148/axis2-testutils-1.6.2-20120225.175209-148-sources.jar
[JENKINS] Archiving <https://builds.apache.org/job/axis2-1.6/ws/axis2/modules/testutils/target/axis2-testutils-1.6.2-SNAPSHOT-javadoc.jar>
to /home/hudson/hudson/jobs/axis2-1.6/modules/org.apache.axis2$axis2-testutils/builds/2012-02-25_17-48-09/archive/org.apache.axis2/axis2-testutils/1.6.2-20120225.175209-148/axis2-testutils-1.6.2-20120225.175209-148-javadoc.jar
[INFO] ------------------------------------------------------------------------
[INFO] Building Apache Axis2 - XMLBeans Data Binding
[INFO]    task-segment: [clean, deploy]
[INFO] ------------------------------------------------------------------------
[INFO] [clean:clean {execution: default-clean}]
[INFO] [remote-resources:process {execution: default}]
[INFO] [resources:resources {execution: default-resources}]
[INFO] Using 'UTF-8' encoding to copy filtered resources.
[INFO] Copying 1 resource
[INFO] Copying 2 resources
[INFO] [compiler:compile {execution: default-compile}]
[INFO] Compiling 3 source files to <https://builds.apache.org/job/axis2-1.6/ws/axis2/modules/xmlbeans/target/classes>
[INFO] [antrun:run {execution: gen-cp}]
[INFO] Executing tasks
[INFO] Executed tasks
[INFO] [resources:testResources {execution: default-testResources}]
[INFO] Using 'UTF-8' encoding to copy filtered resources.
[INFO] Copying 23 resources to ../test-resources
[INFO] Copying 2 resources
[INFO] [compiler:testCompile {execution: default-testCompile}]
[INFO] Compiling 16 source files to <https://builds.apache.org/job/axis2-1.6/ws/axis2/modules/xmlbeans/target/test-classes>
[INFO] [surefire:test {execution: default-test}]
[INFO] Surefire report directory: <https://builds.apache.org/job/axis2-1.6/ws/axis2/modules/xmlbeans/target/surefire-reports>

-------------------------------------------------------
 T E S T S
-------------------------------------------------------
Running org.apache.axis2.xmlbeans.WSDL2Java10Test
Tests run: 1, Failures: 0, Errors: 0, Skipped: 0, Time elapsed: 6.608 sec
Running org.apache.axis2.xmlbeans.WSDL2Java1Test
Tests run: 1, Failures: 0, Errors: 0, Skipped: 0, Time elapsed: 4.832 sec
Running org.apache.axis2.xmlbeans.WSDL2Java5Test
Tests run: 1, Failures: 0, Errors: 0, Skipped: 0, Time elapsed: 4.845 sec
Running org.apache.axis2.xmlbeans.WSDL2Java12Test
Tests run: 1, Failures: 0, Errors: 0, Skipped: 0, Time elapsed: 0.459 sec
Running org.apache.axis2.xmlbeans.WSDL2Java3Test
Tests run: 1, Failures: 0, Errors: 0, Skipped: 0, Time elapsed: 3.797 sec
Running org.apache.axis2.xmlbeans.WSDL2Java7Test
Tests run: 1, Failures: 0, Errors: 0, Skipped: 0, Time elapsed: 4.405 sec
Running org.apache.axis2.xmlbeans.WSDL2Java9Test
Tests run: 1, Failures: 0, Errors: 0, Skipped: 0, Time elapsed: 4.275 sec
Running org.apache.axis2.xmlbeans.WSDL2Java8Test
Tests run: 1, Failures: 0, Errors: 0, Skipped: 0, Time elapsed: 4.516 sec
Running org.apache.axis2.xmlbeans.WSDL2Java4Test
Tests run: 1, Failures: 0, Errors: 0, Skipped: 0, Time elapsed: 4.428 sec
Running org.apache.axis2.xmlbeans.WSDL2Java13Test
Tests run: 1, Failures: 0, Errors: 0, Skipped: 0, Time elapsed: 0.007 sec
Running org.apache.axis2.xmlbeans.WSDL2Java6Test
Tests run: 1, Failures: 0, Errors: 0, Skipped: 0, Time elapsed: 4.344 sec
Running org.apache.axis2.xmlbeans.WSDL2Java11Test
Tests run: 1, Failures: 0, Errors: 0, Skipped: 0, Time elapsed: 3.562 sec
Running org.apache.axis2.xmlbeans.WSDL2Java2Test
Tests run: 1, Failures: 0, Errors: 0, Skipped: 0, Time elapsed: 0.006 sec

Results :

Tests run: 13, Failures: 0, Errors: 0, Skipped: 0

[JENKINS] Recording test results
Feb 25, 2012 6:04:15 PM hudson.remoting.Channel$ReaderThread run
SEVERE: I/O error in channel channel
java.io.StreamCorruptedException
	at java.io.ObjectInputStream.readObject0(ObjectInputStream.java:1332)
	at java.io.ObjectInputStream.readObject(ObjectInputStream.java:348)
	at hudson.remoting.Channel$ReaderThread.run(Channel.java:1127)
channel stopped
[INFO] ------------------------------------------------------------------------
[ERROR] FATAL ERROR
[INFO] ------------------------------------------------------------------------
[INFO] null
[INFO] ------------------------------------------------------------------------
[INFO] Trace
java.lang.reflect.UndeclaredThrowableException
	at $Proxy2.isArchivingDisabled(Unknown Source)
	at hudson.maven.MavenBuildProxy$Filter.isArchivingDisabled(MavenBuildProxy.java:227)
	at hudson.maven.reporters.MavenArtifact.archive(MavenArtifact.java:216)
	at hudson.maven.reporters.MavenArtifactArchiver.postBuild(MavenArtifactArchiver.java:106)
	at hudson.maven.Maven2Builder.postModule(Maven2Builder.java:127)
	at hudson.maven.MavenBuilder$Adapter.fireLeaveModule(MavenBuilder.java:327)
	at hudson.maven.MavenBuilder$Adapter.postBuild(MavenBuilder.java:285)
	at org.apache.maven.lifecycle.LifecycleExecutorInterceptor.execute(LifecycleExecutorInterceptor.java:68)
	at org.apache.maven.DefaultMaven.doExecute(DefaultMaven.java:328)
	at org.apache.maven.DefaultMaven.execute(DefaultMaven.java:138)
	at org.apache.maven.cli.MavenCli.main(MavenCli.java:362)
	at sun.reflect.NativeMethodAccessorImpl.invoke0(Native Method)
	at sun.reflect.NativeMethodAccessorImpl.invoke(NativeMethodAccessorImpl.java:39)
	at sun.reflect.DelegatingMethodAccessorImpl.invoke(DelegatingMethodAccessorImpl.java:25)
	at java.lang.reflect.Method.invoke(Method.java:592)
	at org.codehaus.classworlds.Launcher.launchEnhanced(Launcher.java:315)
	at org.codehaus.classworlds.Launcher.launch(Launcher.java:255)
	at hudson.maven.agent.Main.launch(Main.java:185)
	at hudson.maven.MavenBuilder.call(MavenBuilder.java:151)
	at hudson.maven.Maven2Builder.call(Maven2Builder.java:77)
	at hudson.maven.Maven2Builder.call(Maven2Builder.java:53)
	at hudson.remoting.UserRequest.perform(UserRequest.java:118)
	at hudson.remoting.UserRequest.perform(UserRequest.java:48)
	at hudson.remoting.Request$2.run(Request.java:287)
	at hudson.remoting.InterceptingExecutorService$1.call(InterceptingExecutorService.java:72)
	at java.util.concurrent.FutureTask$Sync.innerRun(FutureTask.java:269)
	at java.util.concurrent.FutureTask.run(FutureTask.java:123)
	at java.util.concurrent.ThreadPoolExecutor$Worker.runTask(ThreadPoolExecutor.java:651)
	at java.util.concurrent.ThreadPoolExecutor$Worker.run(ThreadPoolExecutor.java:676)
	at java.lang.Thread.run(Thread.java:595)
Caused by: hudson.remoting.ChannelClosedException: channel is already closed
	at hudson.remoting.Channel.send(Channel.java:499)
	at hudson.remoting.Request.call(Request.java:110)
	at hudson.remoting.Channel.call(Channel.java:681)
	at hudson.remoting.RemoteInvocationHandler.invoke(RemoteInvocationHandler.java:158)
	... 30 more
Caused by: java.io.StreamCorruptedException
	at java.io.ObjectInputStream.readObject0(ObjectInputStream.java:1332)
	at java.io.ObjectInputStream.readObject(ObjectInputStream.java:348)
	at hudson.remoting.Channel$ReaderThread.run(Channel.java:1127)
[INFO] ------------------------------------------------------------------------
[INFO] Total time: 15 minutes 47 seconds
[INFO] Finished at: Sat Feb 25 18:04:15 UTC 2012
[locks-and-latches] Releasing all the locks
[locks-and-latches] All the locks released
ERROR: Maven JVM terminated unexpectedly with exit code 0



---------------------------------------------------------------------
To unsubscribe, e-mail: java-dev-unsubscribe@axis.apache.org
For additional commands, e-mail: java-dev-help@axis.apache.org


Mime
View raw message