axis-java-dev mailing list archives

Site index · List index
Message view « Date » · « Thread »
Top « Date » · « Thread »
From Apache Jenkins Server <jenk...@builds.apache.org>
Subject Build failed in Jenkins: Axis2 » Apache Axis2 - JSON #1266
Date Thu, 16 Feb 2012 17:21:33 GMT
See <https://builds.apache.org/job/Axis2/org.apache.axis2$axis2-json/1266/changes>

Changes:

[sagara] Applied the patch for AXIS2-5125.

------------------------------------------
[INFO] ------------------------------------------------------------------------
[INFO] Building Apache Axis2 - JSON
[INFO]    task-segment: [clean, deploy]
[INFO] ------------------------------------------------------------------------
[INFO] [clean:clean {execution: default-clean}]
[INFO] [remote-resources:process {execution: default}]
Downloading: http://repo1.maven.org/maven2/org/codehaus/jettison/jettison/1.3/jettison-1.3.pom

Downloading: http://repo1.maven.org/maven2/org/codehaus/codehaus-parent/3/codehaus-parent-3.pom

Downloading: http://repo1.maven.org/maven2/org/codehaus/jettison/jettison/1.3/jettison-1.3.jar

[INFO] [resources:resources {execution: default-resources}]
[INFO] Using 'UTF-8' encoding to copy filtered resources.
[INFO] skip non existing resourceDirectory <https://builds.apache.org/job/Axis2/org.apache.axis2$axis2-json/ws/src/main/resources>
[INFO] Copying 2 resources
[INFO] [compiler:compile {execution: default-compile}]
[INFO] Compiling 9 source files to <https://builds.apache.org/job/Axis2/org.apache.axis2$axis2-json/ws/target/classes>
[INFO] -------------------------------------------------------------
[ERROR] COMPILATION ERROR : 
[INFO] -------------------------------------------------------------
[ERROR] <https://builds.apache.org/job/Axis2/org.apache.axis2$axis2-json/ws/src/org/apache/axis2/json/AbstractJSONOMBuilder.java>:[159,43]
cannot find symbol
symbol  : method isEmpty()
location: class java.lang.String

[INFO] 1error
[INFO] -------------------------------------------------------------
[JENKINS] Archiving <https://builds.apache.org/job/Axis2/org.apache.axis2$axis2-json/ws/pom.xml>
to /home/hudson/hudson/jobs/Axis2/modules/org.apache.axis2$axis2-json/builds/2012-02-16_16-52-01/archive/org.apache.axis2/axis2-json/1.7.0-SNAPSHOT/axis2-json-1.7.0-SNAPSHOT.pom
[INFO] ------------------------------------------------------------------------
[ERROR] BUILD FAILURE
[INFO] ------------------------------------------------------------------------
[INFO] Compilation failure
<https://builds.apache.org/job/Axis2/org.apache.axis2$axis2-json/ws/src/org/apache/axis2/json/AbstractJSONOMBuilder.java>:[159,43]
cannot find symbol
symbol  : method isEmpty()
location: class java.lang.String


[INFO] ------------------------------------------------------------------------
[INFO] For more information, run Maven with the -e switch
[INFO] ------------------------------------------------------------------------
[INFO] Total time: 29 minutes 9 seconds
[INFO] Finished at: Thu Feb 16 17:21:32 UTC 2012
[INFO] Final Memory: 82M/248M
[INFO] ------------------------------------------------------------------------


---------------------------------------------------------------------
To unsubscribe, e-mail: java-dev-unsubscribe@axis.apache.org
For additional commands, e-mail: java-dev-help@axis.apache.org


Mime
View raw message