axis-java-dev mailing list archives

Site index · List index
Message view « Date » · « Thread »
Top « Date » · « Thread »
From Apache Jenkins Server <jenk...@builds.apache.org>
Subject Build failed in Jenkins: axis-trunk #76
Date Mon, 30 Jan 2012 15:09:04 GMT
See <https://builds.apache.org/job/axis-trunk/76/changes>

Changes:

[veithen] Mavenized TestAttachmentsSample.

------------------------------------------
[...truncated 2941 lines...]

[INFO] --- maven-install-plugin:2.3.1:install (default-install) @ attachments-sample ---
[INFO] Downloading: https://repository.apache.org/content/repositories/snapshots/org/apache/axis/attachments-sample/1.4.1-SNAPSHOT/maven-metadata.xml

[INFO] --- maven-deploy-plugin:2.5:deploy (default-deploy) @ attachments-sample ---
Uploading: https://repository.apache.org/content/repositories/snapshots/org/apache/axis/attachments-sample/1.4.1-SNAPSHOT/attachments-sample-1.4.1-20120130.150657-1.jar
Uploaded: https://repository.apache.org/content/repositories/snapshots/org/apache/axis/attachments-sample/1.4.1-SNAPSHOT/attachments-sample-1.4.1-20120130.150657-1.jar
(24 KB at 75.1 KB/sec)
Uploading: https://repository.apache.org/content/repositories/snapshots/org/apache/axis/attachments-sample/1.4.1-SNAPSHOT/attachments-sample-1.4.1-20120130.150657-1.pom
Uploaded: https://repository.apache.org/content/repositories/snapshots/org/apache/axis/attachments-sample/1.4.1-SNAPSHOT/attachments-sample-1.4.1-20120130.150657-1.pom
(4 KB at 21.2 KB/sec)
Downloading: https://repository.apache.org/content/repositories/snapshots/org/apache/axis/attachments-sample/maven-metadata.xml
Uploading: https://repository.apache.org/content/repositories/snapshots/org/apache/axis/attachments-sample/1.4.1-SNAPSHOT/maven-metadata.xml
Uploaded: https://repository.apache.org/content/repositories/snapshots/org/apache/axis/attachments-sample/1.4.1-SNAPSHOT/maven-metadata.xml
(783 B at 3.1 KB/sec)
Uploading: https://repository.apache.org/content/repositories/snapshots/org/apache/axis/attachments-sample/maven-metadata.xml
Uploaded: https://repository.apache.org/content/repositories/snapshots/org/apache/axis/attachments-sample/maven-metadata.xml
(293 B at 1.0 KB/sec)
[INFO] [INFO] configuring report plugin org.apache.maven.plugins:maven-project-info-reports-plugin:2.4
[INFO] Parent project loaded from repository: org.apache:apache:pom:9
[INFO] Relativizing decoration links with respect to project URL: http://axis.apache.org/axis/java/samples/attachments-sample/
[INFO] Rendering site with org.apache.maven.skins:maven-fluido-skin:jar:1.0 skin.
[INFO] Generating "About" report    --- maven-project-info-reports-plugin:2.4

[INFO] --- maven-site-plugin:3.0:site (default-site) @ attachments-sample ---
[INFO] Generating "Issue Tracking" report    --- maven-project-info-reports-plugin:2.4
[INFO] Generating "Mailing Lists" report    --- maven-project-info-reports-plugin:2.4
[INFO] Generating "Source Repository" report    --- maven-project-info-reports-plugin:2.4
[JENKINS] Archiving site from <https://builds.apache.org/job/axis-trunk/ws/axis/samples/attachments-sample/target/site>
to /home/hudson/hudson/jobs/axis-trunk/site/attachments-sample
[JENKINS] Archiving <https://builds.apache.org/job/axis-trunk/ws/axis/samples/attachments-sample/pom.xml>
to /home/hudson/hudson/jobs/axis-trunk/modules/org.apache.axis$attachments-sample/builds/2012-01-30_15-01-21/archive/org.apache.axis/attachments-sample/1.4.1-SNAPSHOT/attachments-sample-1.4.1-SNAPSHOT.pom
[JENKINS] Archiving <https://builds.apache.org/job/axis-trunk/ws/axis/samples/attachments-sample/target/attachments-sample-1.4.1-SNAPSHOT.jar>
to /home/hudson/hudson/jobs/axis-trunk/modules/org.apache.axis$attachments-sample/builds/2012-01-30_15-01-21/archive/org.apache.axis/attachments-sample/1.4.1-20120130.150657-1/attachments-sample-1.4.1-20120130.150657-1.jar
[INFO] Downloading: http://repo1.maven.org/maven2/org/apache/maven/plugins/maven-assembly-plugin/2.2.2/maven-assembly-plugin-2.2.2.pom
                                                                        
[INFO] ------------------------------------------------------------------------
[INFO] Building Distribution 1.4.1-SNAPSHOT
[INFO] ------------------------------------------------------------------------
Downloaded: http://repo1.maven.org/maven2/org/apache/maven/plugins/maven-assembly-plugin/2.2.2/maven-assembly-plugin-2.2.2.pom
(16 KB at 43.3 KB/sec)
Downloading: http://repo1.maven.org/maven2/org/apache/maven/plugins/maven-assembly-plugin/2.2.2/maven-assembly-plugin-2.2.2.jar
Downloaded: http://repo1.maven.org/maven2/org/apache/maven/plugins/maven-assembly-plugin/2.2.2/maven-assembly-plugin-2.2.2.jar
(216 KB at 293.7 KB/sec)
[INFO] 
[INFO] --- maven-clean-plugin:2.4.1:clean (default-clean) @ distribution ---
[INFO] 
[INFO] --- maven-remote-resources-plugin:1.1:process (default) @ distribution ---
[INFO] 
[INFO] --- maven-assembly-plugin:2.2.2:single (distribution-package) @ distribution ---
Downloading: http://repo1.maven.org/maven2/org/apache/maven/shared/maven-common-artifact-filters/1.4/maven-common-artifact-filters-1.4.pom
Downloaded: http://repo1.maven.org/maven2/org/apache/maven/shared/maven-common-artifact-filters/1.4/maven-common-artifact-filters-1.4.pom
(4 KB at 12.0 KB/sec)
Downloading: http://repo1.maven.org/maven2/org/apache/maven/shared/maven-shared-components/17/maven-shared-components-17.pom
Downloaded: http://repo1.maven.org/maven2/org/apache/maven/shared/maven-shared-components/17/maven-shared-components-17.pom
(9 KB at 16.9 KB/sec)
Downloading: http://repo1.maven.org/maven2/org/codehaus/plexus/plexus-container-default/1.5.5/plexus-container-default-1.5.5.pom
Downloaded: http://repo1.maven.org/maven2/org/codehaus/plexus/plexus-container-default/1.5.5/plexus-container-default-1.5.5.pom
(3 KB at 5.5 KB/sec)
Downloading: http://repo1.maven.org/maven2/org/codehaus/plexus/plexus-classworlds/2.2.2/plexus-classworlds-2.2.2.pom
Downloaded: http://repo1.maven.org/maven2/org/codehaus/plexus/plexus-classworlds/2.2.2/plexus-classworlds-2.2.2.pom
(4 KB at 8.0 KB/sec)
Downloading: http://repo1.maven.org/maven2/org/apache/xbean/xbean-reflect/3.4/xbean-reflect-3.4.pom
Downloaded: http://repo1.maven.org/maven2/org/apache/xbean/xbean-reflect/3.4/xbean-reflect-3.4.pom
(3 KB at 5.4 KB/sec)
Downloading: http://repo1.maven.org/maven2/org/apache/xbean/xbean/3.4/xbean-3.4.pom
Downloaded: http://repo1.maven.org/maven2/org/apache/xbean/xbean/3.4/xbean-3.4.pom (19 KB
at 34.7 KB/sec)
Downloading: http://repo1.maven.org/maven2/log4j/log4j/1.2.12/log4j-1.2.12.pom
Downloaded: http://repo1.maven.org/maven2/log4j/log4j/1.2.12/log4j-1.2.12.pom (145 B at 0.3
KB/sec)
Downloading: http://repo1.maven.org/maven2/commons-logging/commons-logging-api/1.1/commons-logging-api-1.1.pom
Downloaded: http://repo1.maven.org/maven2/commons-logging/commons-logging-api/1.1/commons-logging-api-1.1.pom
(6 KB at 10.5 KB/sec)
Downloading: http://repo1.maven.org/maven2/com/google/collections/google-collections/1.0/google-collections-1.0.pom
Downloaded: http://repo1.maven.org/maven2/com/google/collections/google-collections/1.0/google-collections-1.0.pom
(3 KB at 4.9 KB/sec)
Downloading: http://repo1.maven.org/maven2/com/google/google/1/google-1.pom
Downloaded: http://repo1.maven.org/maven2/com/google/google/1/google-1.pom (2 KB at 3.0 KB/sec)
Downloading: http://repo1.maven.org/maven2/org/apache/maven/shared/maven-filtering/1.0/maven-filtering-1.0.pom
Downloaded: http://repo1.maven.org/maven2/org/apache/maven/shared/maven-filtering/1.0/maven-filtering-1.0.pom
(6 KB at 12.2 KB/sec)
Downloading: http://repo1.maven.org/maven2/org/slf4j/slf4j-jdk14/1.5.6/slf4j-jdk14-1.5.6.jar
Downloading: http://repo1.maven.org/maven2/org/slf4j/slf4j-api/1.5.6/slf4j-api-1.5.6.jar
Downloading: http://repo1.maven.org/maven2/org/slf4j/jcl-over-slf4j/1.5.6/jcl-over-slf4j-1.5.6.jar
Downloading: http://repo1.maven.org/maven2/org/apache/maven/doxia/doxia-sink-api/1.1/doxia-sink-api-1.1.jar
Downloading: http://repo1.maven.org/maven2/org/apache/maven/reporting/maven-reporting-api/2.2.1/maven-reporting-api-2.2.1.jar
Downloaded: http://repo1.maven.org/maven2/org/slf4j/slf4j-jdk14/1.5.6/slf4j-jdk14-1.5.6.jar
(9 KB at 5.9 KB/sec)
Downloading: http://repo1.maven.org/maven2/org/apache/maven/doxia/doxia-logging-api/1.1/doxia-logging-api-1.1.jar
Downloaded: http://repo1.maven.org/maven2/org/slf4j/slf4j-api/1.5.6/slf4j-api-1.5.6.jar (22
KB at 12.9 KB/sec)
Downloading: http://repo1.maven.org/maven2/org/apache/maven/shared/maven-common-artifact-filters/1.4/maven-common-artifact-filters-1.4.jar
Downloaded: http://repo1.maven.org/maven2/org/apache/maven/doxia/doxia-sink-api/1.1/doxia-sink-api-1.1.jar
(13 KB at 6.3 KB/sec)
Downloading: http://repo1.maven.org/maven2/org/apache/maven/shared/maven-filtering/1.0/maven-filtering-1.0.jar
Downloaded: http://repo1.maven.org/maven2/org/apache/maven/reporting/maven-reporting-api/2.2.1/maven-reporting-api-2.2.1.jar
(10 KB at 4.4 KB/sec)
Downloaded: http://repo1.maven.org/maven2/org/slf4j/jcl-over-slf4j/1.5.6/jcl-over-slf4j-1.5.6.jar
(17 KB at 6.5 KB/sec)
Downloaded: http://repo1.maven.org/maven2/org/apache/maven/doxia/doxia-logging-api/1.1/doxia-logging-api-1.1.jar
(12 KB at 5.5 KB/sec)
Downloaded: http://repo1.maven.org/maven2/org/apache/maven/shared/maven-common-artifact-filters/1.4/maven-common-artifact-filters-1.4.jar
(31 KB at 15.4 KB/sec)
Downloaded: http://repo1.maven.org/maven2/org/apache/maven/shared/maven-filtering/1.0/maven-filtering-1.0.jar
(42 KB at 20.5 KB/sec)
[INFO] Reading assembly descriptor: src/main/assembly/bin.xml
[INFO] axis-1.4.1-SNAPSHOT/ already added, skipping
[INFO] axis-1.4.1-SNAPSHOT/samples already added, skipping
[INFO] axis-1.4.1-SNAPSHOT/samples/attachments already added, skipping
[INFO] Building zip: <https://builds.apache.org/job/axis-trunk/ws/axis/distribution/target/distribution-1.4.1-SNAPSHOT-bin.zip>
[INFO] axis-1.4.1-SNAPSHOT/ already added, skipping
[INFO] axis-1.4.1-SNAPSHOT/samples already added, skipping
[INFO] axis-1.4.1-SNAPSHOT/samples/attachments already added, skipping
[INFO] 
[INFO] --- maven-antrun-plugin:1.7:run (unpack-distribution) @ distribution ---
[INFO] Executing tasks

main:
    [unzip] Expanding: <https://builds.apache.org/job/axis-trunk/ws/axis/distribution/target/distribution-1.4.1-SNAPSHOT-bin.zip>
into <https://builds.apache.org/job/axis-trunk/ws/axis/distribution/target>
[INFO] Executed tasks
[INFO] [INFO] Copying junit-3.8.2.jar to <https://builds.apache.org/job/axis-trunk/ws/axis/distribution/target/axis-1.4.1-SNAPSHOT/lib/junit-3.8.2.jar>

[INFO] --- maven-dependency-plugin:2.4:copy-dependencies (copy-extra-libs) @ distribution
---
[INFO] [INFO] Executing tasks


[INFO] --- maven-antrun-plugin:1.7:run (test-samples) @ distribution ---
main:

axis-clover-setenv:

axis-clover-setup:

axis-xmlbeans-setenv:

axis-xmlbeans-setup:

setenv:
    [mkdir] Created dir: <https://builds.apache.org/job/axis-trunk/ws/axis/distribution/target/axis-1.4.1-SNAPSHOT/build>
    [mkdir] Created dir: <https://builds.apache.org/job/axis-trunk/ws/axis/distribution/target/axis-1.4.1-SNAPSHOT/build/classes>
    [mkdir] Created dir: <https://builds.apache.org/job/axis-trunk/ws/axis/distribution/target/axis-1.4.1-SNAPSHOT/build/lib>
    [mkdir] Created dir: <https://builds.apache.org/job/axis-trunk/ws/axis/distribution/target/axis-1.4.1-SNAPSHOT/build/work>

copy:

compile:
    [javac] <https://builds.apache.org/job/axis-trunk/ws/axis/distribution/target/axis-1.4.1-SNAPSHOT/samples/addr/build.xml>:51:
warning: 'includeantruntime' was not set, defaulting to build.sysclasspath=last; set to false
for repeatable builds
[JENKINS] Archiving <https://builds.apache.org/job/axis-trunk/ws/axis/distribution/pom.xml>
to /home/hudson/hudson/jobs/axis-trunk/modules/org.apache.axis$distribution/builds/2012-01-30_15-01-21/archive/org.apache.axis/distribution/1.4.1-SNAPSHOT/distribution-1.4.1-SNAPSHOT.pom
[JENKINS] Archiving <https://builds.apache.org/job/axis-trunk/ws/axis/distribution/target/distribution-1.4.1-SNAPSHOT-bin.zip>
to /home/hudson/hudson/jobs/axis-trunk/modules/org.apache.axis$distribution/builds/2012-01-30_15-01-21/archive/org.apache.axis/distribution/1.4.1-SNAPSHOT/distribution-1.4.1-SNAPSHOT-bin.zip
[INFO] ------------------------------------------------------------------------
[INFO] Reactor Summary:
[INFO] 
[INFO] Axis .............................................. SUCCESS [59.002s]
[INFO] Axis :: SAAJ ...................................... SUCCESS [7.835s]
[INFO] Axis :: JAX-RPC ................................... SUCCESS [7.480s]
[INFO] Axis :: Core ...................................... SUCCESS [1:07.450s]
[INFO] Ant tasks ......................................... SUCCESS [15.357s]
[INFO] Maven plugin ...................................... SUCCESS [16.297s]
[INFO] Axis :: Simple server ............................. SUCCESS [6.303s]
[INFO] Castor support .................................... SUCCESS [13.797s]
[INFO] JMS support ....................................... SUCCESS [14.633s]
[INFO] Axis :: Integration tests ......................... SUCCESS [43.628s]
[INFO] Axis :: WAR ....................................... SUCCESS [22.267s]
[INFO] Samples ........................................... SUCCESS [2.930s]
[INFO] Attachments Sample ................................ SUCCESS [9.066s]
[INFO] Distribution ...................................... FAILURE [15.105s]
[INFO] ------------------------------------------------------------------------
[INFO] BUILD FAILURE
[INFO] ------------------------------------------------------------------------
[INFO] Total time: 6:05.346s
[INFO] Finished at: Mon Jan 30 15:07:38 UTC 2012
[INFO] Final Memory: 45M/183M
[INFO] ------------------------------------------------------------------------
mavenExecutionResult exceptions not empty
message : Failed to execute goal org.apache.maven.plugins:maven-antrun-plugin:1.7:run (test-samples)
on project distribution: An Ant BuildException has occured: The following error occurred while
executing this line:
<https://builds.apache.org/job/axis-trunk/ws/axis/distribution/target/axis-1.4.1-SNAPSHOT/samples/addr/build.xml>:51:
Unable to find a javac compiler;
com.sun.tools.javac.Main is not on the classpath.
Perhaps JAVA_HOME does not point to the JDK.
It is currently set to "/home/jenkins/tools/java/jdk1.5.0_22-32/jre"
around Ant part ...<ant dir="<https://builds.apache.org/job/axis-trunk/ws/axis/distribution/target/axis-1.4.1-SNAPSHOT/samples/addr"/>...>
@ 4:122 in <https://builds.apache.org/job/axis-trunk/ws/axis/distribution/target/antrun/build-main.xml>
cause : An Ant BuildException has occured: The following error occurred while executing this
line:
<https://builds.apache.org/job/axis-trunk/ws/axis/distribution/target/axis-1.4.1-SNAPSHOT/samples/addr/build.xml>:51:
Unable to find a javac compiler;
com.sun.tools.javac.Main is not on the classpath.
Perhaps JAVA_HOME does not point to the JDK.
It is currently set to "/home/jenkins/tools/java/jdk1.5.0_22-32/jre"
around Ant part ...<ant dir="<https://builds.apache.org/job/axis-trunk/ws/axis/distribution/target/axis-1.4.1-SNAPSHOT/samples/addr"/>...>
@ 4:122 in <https://builds.apache.org/job/axis-trunk/ws/axis/distribution/target/antrun/build-main.xml>
Stack trace : 
org.apache.maven.lifecycle.LifecycleExecutionException: Failed to execute goal org.apache.maven.plugins:maven-antrun-plugin:1.7:run
(test-samples) on project distribution: An Ant BuildException has occured: The following error
occurred while executing this line:
<https://builds.apache.org/job/axis-trunk/ws/axis/distribution/target/axis-1.4.1-SNAPSHOT/samples/addr/build.xml>:51:
Unable to find a javac compiler;
com.sun.tools.javac.Main is not on the classpath.
Perhaps JAVA_HOME does not point to the JDK.
It is currently set to "/home/jenkins/tools/java/jdk1.5.0_22-32/jre"
around Ant part ...<ant dir="<https://builds.apache.org/job/axis-trunk/ws/axis/distribution/target/axis-1.4.1-SNAPSHOT/samples/addr"/>...>
@ 4:122 in <https://builds.apache.org/job/axis-trunk/ws/axis/distribution/target/antrun/build-main.xml>
	at org.apache.maven.lifecycle.internal.MojoExecutor.execute(MojoExecutor.java:217)
	at org.apache.maven.lifecycle.internal.MojoExecutor.execute(MojoExecutor.java:153)
	at org.apache.maven.lifecycle.internal.MojoExecutor.execute(MojoExecutor.java:145)
	at org.apache.maven.lifecycle.internal.LifecycleModuleBuilder.buildProject(LifecycleModuleBuilder.java:84)
	at org.apache.maven.lifecycle.internal.LifecycleModuleBuilder.buildProject(LifecycleModuleBuilder.java:59)
	at org.apache.maven.lifecycle.internal.LifecycleStarter.singleThreadedBuild(LifecycleStarter.java:183)
	at org.apache.maven.lifecycle.internal.LifecycleStarter.execute(LifecycleStarter.java:161)
	at org.apache.maven.DefaultMaven.doExecute(DefaultMaven.java:319)
	at org.apache.maven.DefaultMaven.execute(DefaultMaven.java:156)
	at org.jvnet.hudson.maven3.launcher.Maven3Launcher.main(Maven3Launcher.java:79)
	at sun.reflect.NativeMethodAccessorImpl.invoke0(Native Method)
	at sun.reflect.NativeMethodAccessorImpl.invoke(NativeMethodAccessorImpl.java:39)
	at sun.reflect.DelegatingMethodAccessorImpl.invoke(DelegatingMethodAccessorImpl.java:25)
	at java.lang.reflect.Method.invoke(Method.java:592)
	at org.codehaus.plexus.classworlds.launcher.Launcher.launchStandard(Launcher.java:329)
	at org.codehaus.plexus.classworlds.launcher.Launcher.launch(Launcher.java:239)
	at org.jvnet.hudson.maven3.agent.Maven3Main.launch(Maven3Main.java:158)
	at hudson.maven.Maven3Builder.call(Maven3Builder.java:104)
	at hudson.maven.Maven3Builder.call(Maven3Builder.java:70)
	at hudson.remoting.UserRequest.perform(UserRequest.java:118)
	at hudson.remoting.UserRequest.perform(UserRequest.java:48)
	at hudson.remoting.Request$2.run(Request.java:287)
	at java.util.concurrent.Executors$RunnableAdapter.call(Executors.java:417)
	at java.util.concurrent.FutureTask$Sync.innerRun(FutureTask.java:269)
	at java.util.concurrent.FutureTask.run(FutureTask.java:123)
	at java.util.concurrent.ThreadPoolExecutor$Worker.runTask(ThreadPoolExecutor.java:651)
	at java.util.concurrent.ThreadPoolExecutor$Worker.run(ThreadPoolExecutor.java:676)
	at java.lang.Thread.run(Thread.java:595)
Caused by: org.apache.maven.plugin.MojoExecutionException: An Ant BuildException has occured:
The following error occurred while executing this line:
<https://builds.apache.org/job/axis-trunk/ws/axis/distribution/target/axis-1.4.1-SNAPSHOT/samples/addr/build.xml>:51:
Unable to find a javac compiler;
com.sun.tools.javac.Main is not on the classpath.
Perhaps JAVA_HOME does not point to the JDK.
It is currently set to "/home/jenkins/tools/java/jdk1.5.0_22-32/jre"
around Ant part ...<ant dir="<https://builds.apache.org/job/axis-trunk/ws/axis/distribution/target/axis-1.4.1-SNAPSHOT/samples/addr"/>...>
@ 4:122 in <https://builds.apache.org/job/axis-trunk/ws/axis/distribution/target/antrun/build-main.xml>
	at org.apache.maven.plugin.antrun.AntRunMojo.execute(AntRunMojo.java:355)
	at org.apache.maven.plugin.DefaultBuildPluginManager.executeMojo(DefaultBuildPluginManager.java:101)
	at org.apache.maven.lifecycle.internal.MojoExecutor.execute(MojoExecutor.java:209)
	... 27 more
Caused by: <https://builds.apache.org/job/axis-trunk/ws/axis/distribution/target/antrun/build-main.xml>:4:
The following error occurred while executing this line:
<https://builds.apache.org/job/axis-trunk/ws/axis/distribution/target/axis-1.4.1-SNAPSHOT/samples/addr/build.xml>:51:
Unable to find a javac compiler;
com.sun.tools.javac.Main is not on the classpath.
Perhaps JAVA_HOME does not point to the JDK.
It is currently set to "/home/jenkins/tools/java/jdk1.5.0_22-32/jre"
	at org.apache.tools.ant.ProjectHelper.addLocationToBuildException(ProjectHelper.java:551)
	at org.apache.tools.ant.taskdefs.Ant.execute(Ant.java:444)
	at org.apache.tools.ant.UnknownElement.execute(UnknownElement.java:291)
	at sun.reflect.NativeMethodAccessorImpl.invoke0(Native Method)
	at sun.reflect.NativeMethodAccessorImpl.invoke(NativeMethodAccessorImpl.java:39)
	at sun.reflect.DelegatingMethodAccessorImpl.invoke(DelegatingMethodAccessorImpl.java:25)
	at java.lang.reflect.Method.invoke(Method.java:592)
	at org.apache.tools.ant.dispatch.DispatchUtils.execute(DispatchUtils.java:106)
	at org.apache.tools.ant.Task.perform(Task.java:348)
	at org.apache.tools.ant.Target.execute(Target.java:390)
	at org.apache.tools.ant.Target.performTasks(Target.java:411)
	at org.apache.tools.ant.Project.executeSortedTargets(Project.java:1399)
	at org.apache.tools.ant.Project.executeTarget(Project.java:1368)
	at org.apache.maven.plugin.antrun.AntRunMojo.execute(AntRunMojo.java:327)
	... 29 more
Caused by: <https://builds.apache.org/job/axis-trunk/ws/axis/distribution/target/axis-1.4.1-SNAPSHOT/samples/addr/build.xml>:51:
Unable to find a javac compiler;
com.sun.tools.javac.Main is not on the classpath.
Perhaps JAVA_HOME does not point to the JDK.
It is currently set to "/home/jenkins/tools/java/jdk1.5.0_22-32/jre"
	at org.apache.tools.ant.taskdefs.compilers.CompilerAdapterFactory.getCompiler(CompilerAdapterFactory.java:128)
	at org.apache.tools.ant.taskdefs.Javac.findSupportedFileExtensions(Javac.java:961)
	at org.apache.tools.ant.taskdefs.Javac.scanDir(Javac.java:938)
	at org.apache.tools.ant.taskdefs.Javac.execute(Javac.java:909)
	at org.apache.tools.ant.UnknownElement.execute(UnknownElement.java:291)
	at sun.reflect.GeneratedMethodAccessor123.invoke(Unknown Source)
	at sun.reflect.DelegatingMethodAccessorImpl.invoke(DelegatingMethodAccessorImpl.java:25)
	at java.lang.reflect.Method.invoke(Method.java:592)
	at org.apache.tools.ant.dispatch.DispatchUtils.execute(DispatchUtils.java:106)
	at org.apache.tools.ant.Task.perform(Task.java:348)
	at org.apache.tools.ant.Target.execute(Target.java:390)
	at org.apache.tools.ant.Target.performTasks(Target.java:411)
	at org.apache.tools.ant.Project.executeSortedTargets(Project.java:1399)
	at org.apache.tools.ant.helper.SingleCheckExecutor.executeTargets(SingleCheckExecutor.java:38)
	at org.apache.tools.ant.Project.executeTargets(Project.java:1251)
	at org.apache.tools.ant.taskdefs.Ant.execute(Ant.java:442)
	... 41 more
Sending e-mails to: java-dev@axis.apache.org andreas.veithen@gmail.com
Sending e-mails to: java-dev@axis.apache.org andreas.veithen@gmail.com
channel stopped


---------------------------------------------------------------------
To unsubscribe, e-mail: java-dev-unsubscribe@axis.apache.org
For additional commands, e-mail: java-dev-help@axis.apache.org


Mime
View raw message