axis-java-dev mailing list archives

Site index · List index
Message view « Date » · « Thread »
Top « Date » · « Thread »
From Apache Jenkins Server <jenk...@builds.apache.org>
Subject Build failed in Jenkins: axis-trunk #16
Date Sun, 01 Jan 2012 12:50:25 GMT
See <https://builds.apache.org/job/axis-trunk/16/changes>

Changes:

[veithen] Configuring the build as Maven 3 only. The Jetty plugins don't work properly with
Maven 2.2.1. Also update to the latest Jetty 7.5 version.

------------------------------------------
[...truncated 827 lines...]
Downloaded: https://repository.apache.org/content/repositories/snapshots/org/apache/axis/axis-maven-plugin/maven-metadata.xml
(402 B at 4.6 KB/sec)
Downloading: https://repository.apache.org/content/repositories/snapshots/org/apache/axis/maven-metadata.xml
Downloaded: https://repository.apache.org/content/repositories/snapshots/org/apache/axis/maven-metadata.xml
(231 B at 2.7 KB/sec)
Uploading: https://repository.apache.org/content/repositories/snapshots/org/apache/axis/axis-maven-plugin/1.4.1-SNAPSHOT/maven-metadata.xml
Uploaded: https://repository.apache.org/content/repositories/snapshots/org/apache/axis/axis-maven-plugin/1.4.1-SNAPSHOT/maven-metadata.xml
(782 B at 4.7 KB/sec)
Uploading: https://repository.apache.org/content/repositories/snapshots/org/apache/axis/axis-maven-plugin/maven-metadata.xml
Uploaded: https://repository.apache.org/content/repositories/snapshots/org/apache/axis/axis-maven-plugin/maven-metadata.xml
(366 B at 2.4 KB/sec)
Uploading: https://repository.apache.org/content/repositories/snapshots/org/apache/axis/maven-metadata.xml
Uploaded: https://repository.apache.org/content/repositories/snapshots/org/apache/axis/maven-metadata.xml
(231 B at 1.5 KB/sec)
[JENKINS] Archiving <https://builds.apache.org/job/axis-trunk/ws/axis/axis-maven-plugin/pom.xml>
to /home/hudson/hudson/jobs/axis-trunk/modules/org.apache.axis$axis-maven-plugin/builds/2012-01-01_12-46-54/archive/org.apache.axis/axis-maven-plugin/1.4.1-SNAPSHOT/axis-maven-plugin-1.4.1-SNAPSHOT.pom
[JENKINS] Archiving <https://builds.apache.org/job/axis-trunk/ws/axis/axis-maven-plugin/target/axis-maven-plugin-1.4.1-SNAPSHOT.jar>
to /home/hudson/hudson/jobs/axis-trunk/modules/org.apache.axis$axis-maven-plugin/builds/2012-01-01_12-46-54/archive/org.apache.axis/axis-maven-plugin/1.4.1-20120101.124910-8/axis-maven-plugin-1.4.1-20120101.124910-8.jar
[INFO] [INFO] Deleting <https://builds.apache.org/job/axis-trunk/ws/axis/integration/target>
                                                                        
[INFO] ------------------------------------------------------------------------
[INFO] Building Axis :: Integration tests 1.4.1-SNAPSHOT
[INFO] ------------------------------------------------------------------------
[INFO] 
[INFO] --- maven-clean-plugin:2.4.1:clean (default-clean) @ integration ---
[INFO] 
[INFO] --- axis-maven-plugin:1.4.1-SNAPSHOT:wsdl2java (echo) @ integration ---
[INFO] 
[INFO] --- axis-maven-plugin:1.4.1-SNAPSHOT:wsdl2java (addr) @ integration ---
[INFO] 
[INFO] --- maven-antrun-plugin:1.7:run (default) @ integration ---
[INFO] Executing tasks

main:
    [mkdir] Created dir: <https://builds.apache.org/job/axis-trunk/ws/axis/integration/target/work/samples/client>
     [copy] Copying 1 file to <https://builds.apache.org/job/axis-trunk/ws/axis/integration/target/work/samples/client>
[INFO] Executed tasks
[INFO] 
[INFO] --- maven-remote-resources-plugin:1.1:process (default) @ integration ---
[INFO] [INFO] Using 'UTF-8' encoding to copy filtered resources.
[INFO] skip non existing resourceDirectory <https://builds.apache.org/job/axis-trunk/ws/axis/integration/src/main/resources>
[INFO] Copying 3 resources

[INFO] --- maven-resources-plugin:2.4.3:resources (default-resources) @ integration ---
[INFO] [INFO] Compiling 15 source files to <https://builds.apache.org/job/axis-trunk/ws/axis/integration/target/classes>

[INFO] --- maven-compiler-plugin:2.3.2:compile (default-compile) @ integration ---
[INFO] [INFO] Using 'UTF-8' encoding to copy filtered resources.
[INFO] skip non existing resourceDirectory <https://builds.apache.org/job/axis-trunk/ws/axis/integration/src/test/resources>
[INFO] Copying 3 resources

[INFO] --- maven-resources-plugin:2.4.3:testResources (default-testResources) @ integration
---
[INFO] [INFO] Compiling 9 source files to <https://builds.apache.org/job/axis-trunk/ws/axis/integration/target/test-classes>

[INFO] --- maven-compiler-plugin:2.3.2:testCompile (default-testCompile) @ integration ---
[INFO] [INFO] Surefire report directory: <https://builds.apache.org/job/axis-trunk/ws/axis/integration/target/surefire-reports>

[INFO] --- maven-surefire-plugin:2.7.2:test (default-test) @ integration ---

-------------------------------------------------------
 T E S T S
-------------------------------------------------------
Running test.encoding.TestDeser2001
Tests run: 77, Failures: 0, Errors: 0, Skipped: 0, Time elapsed: 1.098 sec
Running test.encoding.TestDeser
Tests run: 39, Failures: 0, Errors: 0, Skipped: 0, Time elapsed: 0.219 sec
Running test.encoding.TestDeser1999
Tests run: 43, Failures: 0, Errors: 0, Skipped: 0, Time elapsed: 0.161 sec
Running test.encoding.TestDeser2000
Tests run: 43, Failures: 0, Errors: 0, Skipped: 0, Time elapsed: 0.165 sec
Running test.dynamic.ServiceGetPort
Tests run: 1, Failures: 0, Errors: 0, Skipped: 0, Time elapsed: 0.104 sec

Results :

Tests run: 203, Failures: 0, Errors: 0, Skipped: 0

[JENKINS] Recording test results
[INFO] 
[INFO] --- maven-jar-plugin:2.3.2:jar (default-jar) @ integration ---
[INFO] Building jar: <https://builds.apache.org/job/axis-trunk/ws/axis/integration/target/integration-1.4.1-SNAPSHOT.jar>
[INFO] [INFO] Installing <https://builds.apache.org/job/axis-trunk/ws/axis/integration/target/integration-1.4.1-SNAPSHOT.jar>
to <https://builds.apache.org/job/axis-trunk/ws/.repository/org/apache/axis/integration/1.4.1-SNAPSHOT/integration-1.4.1-SNAPSHOT.jar>
[INFO] Installing <https://builds.apache.org/job/axis-trunk/ws/axis/integration/pom.xml>
to <https://builds.apache.org/job/axis-trunk/ws/.repository/org/apache/axis/integration/1.4.1-SNAPSHOT/integration-1.4.1-SNAPSHOT.pom>

[INFO] --- maven-install-plugin:2.3.1:install (default-install) @ integration ---
[INFO] Downloading: https://repository.apache.org/content/repositories/snapshots/org/apache/axis/integration/1.4.1-SNAPSHOT/maven-metadata.xml

[INFO] --- maven-deploy-plugin:2.5:deploy (default-deploy) @ integration ---
Downloaded: https://repository.apache.org/content/repositories/snapshots/org/apache/axis/integration/1.4.1-SNAPSHOT/maven-metadata.xml
(362 B at 1.5 KB/sec)
Uploading: https://repository.apache.org/content/repositories/snapshots/org/apache/axis/integration/1.4.1-SNAPSHOT/integration-1.4.1-20120101.124918-8.jar
Uploaded: https://repository.apache.org/content/repositories/snapshots/org/apache/axis/integration/1.4.1-SNAPSHOT/integration-1.4.1-20120101.124918-8.jar
(49 KB at 205.4 KB/sec)
Uploading: https://repository.apache.org/content/repositories/snapshots/org/apache/axis/integration/1.4.1-SNAPSHOT/integration-1.4.1-20120101.124918-8.pom
Uploaded: https://repository.apache.org/content/repositories/snapshots/org/apache/axis/integration/1.4.1-SNAPSHOT/integration-1.4.1-20120101.124918-8.pom
(7 KB at 39.7 KB/sec)
Downloading: https://repository.apache.org/content/repositories/snapshots/org/apache/axis/integration/maven-metadata.xml
Downloaded: https://repository.apache.org/content/repositories/snapshots/org/apache/axis/integration/maven-metadata.xml
(360 B at 3.5 KB/sec)
Uploading: https://repository.apache.org/content/repositories/snapshots/org/apache/axis/integration/1.4.1-SNAPSHOT/maven-metadata.xml
Uploaded: https://repository.apache.org/content/repositories/snapshots/org/apache/axis/integration/1.4.1-SNAPSHOT/maven-metadata.xml
(776 B at 5.0 KB/sec)
Uploading: https://repository.apache.org/content/repositories/snapshots/org/apache/axis/integration/maven-metadata.xml
Uploaded: https://repository.apache.org/content/repositories/snapshots/org/apache/axis/integration/maven-metadata.xml
(324 B at 2.0 KB/sec)
[JENKINS] Archiving <https://builds.apache.org/job/axis-trunk/ws/axis/integration/pom.xml>
to /home/hudson/hudson/jobs/axis-trunk/modules/org.apache.axis$integration/builds/2012-01-01_12-46-54/archive/org.apache.axis/integration/1.4.1-SNAPSHOT/integration-1.4.1-SNAPSHOT.pom
[JENKINS] Archiving <https://builds.apache.org/job/axis-trunk/ws/axis/integration/target/integration-1.4.1-SNAPSHOT.jar>
to /home/hudson/hudson/jobs/axis-trunk/modules/org.apache.axis$integration/builds/2012-01-01_12-46-54/archive/org.apache.axis/integration/1.4.1-20120101.124918-8/integration-1.4.1-20120101.124918-8.jar
[INFO] Downloading: http://repo1.maven.org/maven2/org/apache/maven/plugins/maven-war-plugin/2.1.1/maven-war-plugin-2.1.1.pom
                                                                        
[INFO] ------------------------------------------------------------------------
[INFO] Building Axis :: WAR 1.4.1-SNAPSHOT
[INFO] ------------------------------------------------------------------------
Downloaded: http://repo1.maven.org/maven2/org/apache/maven/plugins/maven-war-plugin/2.1.1/maven-war-plugin-2.1.1.pom
(7 KB at 17.9 KB/sec)
Downloading: http://repo1.maven.org/maven2/org/apache/maven/plugins/maven-war-plugin/2.1.1/maven-war-plugin-2.1.1.jar
Downloaded: http://repo1.maven.org/maven2/org/apache/maven/plugins/maven-war-plugin/2.1.1/maven-war-plugin-2.1.1.jar
(76 KB at 143.5 KB/sec)
Downloading: http://repo1.maven.org/maven2/org/mortbay/jetty/jetty-maven-plugin/7.5.4.v20111024/jetty-maven-plugin-7.5.4.v20111024.pom
Downloaded: http://repo1.maven.org/maven2/org/mortbay/jetty/jetty-maven-plugin/7.5.4.v20111024/jetty-maven-plugin-7.5.4.v20111024.pom
(7 KB at 13.3 KB/sec)
Downloading: http://repo1.maven.org/maven2/org/mortbay/jetty/jetty-integration-project/7.5.4.v20111024/jetty-integration-project-7.5.4.v20111024.pom
Downloaded: http://repo1.maven.org/maven2/org/mortbay/jetty/jetty-integration-project/7.5.4.v20111024/jetty-integration-project-7.5.4.v20111024.pom
(8 KB at 15.3 KB/sec)
Downloading: http://repo1.maven.org/maven2/org/mortbay/jetty/jetty-maven-plugin/7.5.4.v20111024/jetty-maven-plugin-7.5.4.v20111024.jar
Downloaded: http://repo1.maven.org/maven2/org/mortbay/jetty/jetty-maven-plugin/7.5.4.v20111024/jetty-maven-plugin-7.5.4.v20111024.jar
(66 KB at 108.2 KB/sec)
[INFO] Deleting <https://builds.apache.org/job/axis-trunk/ws/axis/axis-war/target>
[INFO] 
[INFO] --- maven-clean-plugin:2.4.1:clean (default-clean) @ axis-war ---
[INFO] 
[INFO] --- maven-remote-resources-plugin:1.1:process (default) @ axis-war ---
[INFO] [INFO] Using 'UTF-8' encoding to copy filtered resources.
[INFO] skip non existing resourceDirectory <https://builds.apache.org/job/axis-trunk/ws/axis/axis-war/src/main/resources>
[INFO] Copying 3 resources

[INFO] --- maven-resources-plugin:2.4.3:resources (default-resources) @ axis-war ---
[INFO] [INFO] No sources to compile

[INFO] --- maven-compiler-plugin:2.3.2:compile (default-compile) @ axis-war ---
[INFO] [INFO] Using 'UTF-8' encoding to copy filtered resources.
[INFO] skip non existing resourceDirectory <https://builds.apache.org/job/axis-trunk/ws/axis/axis-war/src/test/resources>
[INFO] Copying 3 resources

[INFO] --- maven-resources-plugin:2.4.3:testResources (default-testResources) @ axis-war ---
[INFO] [INFO] Compiling 5 source files to <https://builds.apache.org/job/axis-trunk/ws/axis/axis-war/target/test-classes>

[INFO] --- maven-compiler-plugin:2.3.2:testCompile (default-testCompile) @ axis-war ---
[INFO] [INFO] Tests are skipped.

[INFO] --- maven-surefire-plugin:2.7.2:test (default-test) @ axis-war ---
[INFO] Downloading: http://repo1.maven.org/maven2/org/codehaus/plexus/plexus-archiver/1.2/plexus-archiver-1.2.pom

[INFO] --- maven-war-plugin:2.1.1:war (default-war) @ axis-war ---
Downloaded: http://repo1.maven.org/maven2/org/codehaus/plexus/plexus-archiver/1.2/plexus-archiver-1.2.pom
(2 KB at 6.5 KB/sec)
Downloading: http://repo1.maven.org/maven2/com/thoughtworks/xstream/xstream/1.3.1/xstream-1.3.1.pom
Downloaded: http://repo1.maven.org/maven2/com/thoughtworks/xstream/xstream/1.3.1/xstream-1.3.1.pom
(12 KB at 22.5 KB/sec)
Downloading: http://repo1.maven.org/maven2/com/thoughtworks/xstream/xstream-parent/1.3.1/xstream-parent-1.3.1.pom
Downloaded: http://repo1.maven.org/maven2/com/thoughtworks/xstream/xstream-parent/1.3.1/xstream-parent-1.3.1.pom
(14 KB at 26.7 KB/sec)
Downloading: http://repo1.maven.org/maven2/xpp3/xpp3_min/1.1.4c/xpp3_min-1.1.4c.pom
Downloaded: http://repo1.maven.org/maven2/xpp3/xpp3_min/1.1.4c/xpp3_min-1.1.4c.pom (2 KB at
3.3 KB/sec)
Downloading: http://repo1.maven.org/maven2/org/apache/maven/shared/maven-filtering/1.0-beta-2/maven-filtering-1.0-beta-2.pom
Downloaded: http://repo1.maven.org/maven2/org/apache/maven/shared/maven-filtering/1.0-beta-2/maven-filtering-1.0-beta-2.pom
(4 KB at 7.9 KB/sec)
Downloading: http://repo1.maven.org/maven2/org/codehaus/plexus/plexus-interpolation/1.6/plexus-interpolation-1.6.pom
Downloaded: http://repo1.maven.org/maven2/org/codehaus/plexus/plexus-interpolation/1.6/plexus-interpolation-1.6.pom
(3 KB at 5.5 KB/sec)
Downloading: http://repo1.maven.org/maven2/org/codehaus/plexus/plexus-archiver/1.2/plexus-archiver-1.2.jar
Downloading: http://repo1.maven.org/maven2/com/thoughtworks/xstream/xstream/1.3.1/xstream-1.3.1.jar
Downloading: http://repo1.maven.org/maven2/xpp3/xpp3_min/1.1.4c/xpp3_min-1.1.4c.jar
Downloading: http://repo1.maven.org/maven2/org/apache/maven/shared/maven-filtering/1.0-beta-2/maven-filtering-1.0-beta-2.jar
Downloaded: http://repo1.maven.org/maven2/xpp3/xpp3_min/1.1.4c/xpp3_min-1.1.4c.jar (25 KB
at 19.9 KB/sec)
Downloaded: http://repo1.maven.org/maven2/org/codehaus/plexus/plexus-archiver/1.2/plexus-archiver-1.2.jar
(178 KB at 120.5 KB/sec)
Downloaded: http://repo1.maven.org/maven2/org/apache/maven/shared/maven-filtering/1.0-beta-2/maven-filtering-1.0-beta-2.jar
(33 KB at 18.8 KB/sec)
Downloaded: http://repo1.maven.org/maven2/com/thoughtworks/xstream/xstream/1.3.1/xstream-1.3.1.jar
(422 KB at 213.4 KB/sec)
[INFO] Packaging webapp
[INFO] Assembling webapp [axis-war] in [<https://builds.apache.org/job/axis-trunk/ws/axis/axis-war/target/axis-war-1.4.1-SNAPSHOT]>
[INFO] Processing war project
[INFO] Copying webapp resources [<https://builds.apache.org/job/axis-trunk/ws/axis/axis-war/src/main/webapp]>
[INFO] Webapp assembled in [68 msecs]
[INFO] Building war: <https://builds.apache.org/job/axis-trunk/ws/axis/axis-war/target/axis-war-1.4.1-SNAPSHOT.war>
[INFO] WEB-INF/web.xml already added, skipping
[INFO] 
[INFO] --- maven-remote-resources-plugin:1.1:process (default) @ axis-war ---
[INFO] [INFO] Using 'UTF-8' encoding to copy filtered resources.
[INFO] skip non existing resourceDirectory <https://builds.apache.org/job/axis-trunk/ws/axis/axis-war/src/main/resources>
[INFO] Copying 3 resources
[INFO] Copying 3 resources

[INFO] --- maven-resources-plugin:2.4.3:resources (default-resources) @ axis-war ---
[INFO] [INFO] No sources to compile

[INFO] --- maven-compiler-plugin:2.3.2:compile (default-compile) @ axis-war ---
[INFO] [INFO] Using 'UTF-8' encoding to copy filtered resources.
[INFO] skip non existing resourceDirectory <https://builds.apache.org/job/axis-trunk/ws/axis/axis-war/src/test/resources>
[INFO] Copying 3 resources
[INFO] Copying 3 resources

[INFO] --- maven-resources-plugin:2.4.3:testResources (default-testResources) @ axis-war ---
[INFO] [INFO] Nothing to compile - all classes are up to date

[INFO] --- maven-compiler-plugin:2.3.2:testCompile (default-testCompile) @ axis-war ---
[JENKINS] Archiving <https://builds.apache.org/job/axis-trunk/ws/axis/axis-war/pom.xml>
to /home/hudson/hudson/jobs/axis-trunk/modules/org.apache.axis$axis-war/builds/2012-01-01_12-46-54/archive/org.apache.axis/axis-war/1.4.1-SNAPSHOT/axis-war-1.4.1-SNAPSHOT.pom
[JENKINS] Archiving <https://builds.apache.org/job/axis-trunk/ws/axis/axis-war/target/axis-war-1.4.1-SNAPSHOT.war>
to /home/hudson/hudson/jobs/axis-trunk/modules/org.apache.axis$axis-war/builds/2012-01-01_12-46-54/archive/org.apache.axis/axis-war/1.4.1-SNAPSHOT/axis-war-1.4.1-SNAPSHOT.war
[INFO] ------------------------------------------------------------------------
[INFO] Reactor Summary:
[INFO] 
[INFO] Axis .............................................. SUCCESS [39.660s]
[INFO] Axis :: SAAJ ...................................... SUCCESS [6.082s]
[INFO] Axis :: JAX-RPC ................................... SUCCESS [3.299s]
[INFO] Axis :: Core ...................................... SUCCESS [51.973s]
[INFO] Axis :: Ant tasks ................................. SUCCESS [3.768s]
[INFO] Axis :: Maven plugin .............................. SUCCESS [5.514s]
[INFO] Axis :: Integration tests ......................... SUCCESS [7.251s]
[INFO] Axis :: WAR ....................................... FAILURE [11.286s]
[INFO] ------------------------------------------------------------------------
[INFO] BUILD FAILURE
[INFO] ------------------------------------------------------------------------
[INFO] Total time: 2:43.393s
[INFO] Finished at: Sun Jan 01 12:49:49 UTC 2012
[INFO] Final Memory: 28M/134M
[INFO] ------------------------------------------------------------------------
Waiting for Jenkins to finish collecting data
mavenExecutionResult exceptions not empty
message : Internal error: java.lang.NullPointerException
cause : null
Stack trace : 
org.apache.maven.InternalErrorException: Internal error: java.lang.NullPointerException
	at org.apache.maven.lifecycle.internal.BuilderCommon.handleBuildError(BuilderCommon.java:128)
	at org.apache.maven.lifecycle.internal.LifecycleModuleBuilder.buildProject(LifecycleModuleBuilder.java:95)
	at org.apache.maven.lifecycle.internal.LifecycleModuleBuilder.buildProject(LifecycleModuleBuilder.java:59)
	at org.apache.maven.lifecycle.internal.LifecycleStarter.singleThreadedBuild(LifecycleStarter.java:183)
	at org.apache.maven.lifecycle.internal.LifecycleStarter.execute(LifecycleStarter.java:161)
	at org.apache.maven.DefaultMaven.doExecute(DefaultMaven.java:319)
	at org.apache.maven.DefaultMaven.execute(DefaultMaven.java:156)
	at org.jvnet.hudson.maven3.launcher.Maven3Launcher.main(Maven3Launcher.java:79)
	at sun.reflect.NativeMethodAccessorImpl.invoke0(Native Method)
	at sun.reflect.NativeMethodAccessorImpl.invoke(NativeMethodAccessorImpl.java:39)
	at sun.reflect.DelegatingMethodAccessorImpl.invoke(DelegatingMethodAccessorImpl.java:25)
	at java.lang.reflect.Method.invoke(Method.java:592)
	at org.codehaus.plexus.classworlds.launcher.Launcher.launchStandard(Launcher.java:329)
	at org.codehaus.plexus.classworlds.launcher.Launcher.launch(Launcher.java:239)
	at org.jvnet.hudson.maven3.agent.Maven3Main.launch(Maven3Main.java:158)
	at hudson.maven.Maven3Builder.call(Maven3Builder.java:112)
	at hudson.maven.Maven3Builder.call(Maven3Builder.java:70)
	at hudson.remoting.UserRequest.perform(UserRequest.java:118)
	at hudson.remoting.UserRequest.perform(UserRequest.java:48)
	at hudson.remoting.Request$2.run(Request.java:287)
	at java.util.concurrent.Executors$RunnableAdapter.call(Executors.java:417)
	at java.util.concurrent.FutureTask$Sync.innerRun(FutureTask.java:269)
	at java.util.concurrent.FutureTask.run(FutureTask.java:123)
	at java.util.concurrent.ThreadPoolExecutor$Worker.runTask(ThreadPoolExecutor.java:651)
	at java.util.concurrent.ThreadPoolExecutor$Worker.run(ThreadPoolExecutor.java:676)
	at java.lang.Thread.run(Thread.java:595)
Caused by: java.lang.NullPointerException
	at hudson.maven.ExecutedMojo.getMojoClass(ExecutedMojo.java:114)
	at hudson.maven.ExecutedMojo.<init>(ExecutedMojo.java:99)
	at hudson.maven.Maven3Builder$MavenExecutionListener.recordExecutionTime(Maven3Builder.java:524)
	at hudson.maven.Maven3Builder$MavenExecutionListener.recordMojoSucceeded(Maven3Builder.java:493)
	at hudson.maven.Maven3Builder$MavenExecutionListener.forkSucceeded(Maven3Builder.java:601)
	at org.apache.maven.lifecycle.internal.DefaultExecutionEventCatapult.fire(DefaultExecutionEventCatapult.java:97)
	at org.apache.maven.lifecycle.internal.DefaultExecutionEventCatapult.fire(DefaultExecutionEventCatapult.java:42)
	at org.apache.maven.lifecycle.internal.MojoExecutor.executeForkedExecutions(MojoExecutor.java:383)
	at org.apache.maven.lifecycle.internal.MojoExecutor.execute(MojoExecutor.java:199)
	at org.apache.maven.lifecycle.internal.MojoExecutor.execute(MojoExecutor.java:153)
	at org.apache.maven.lifecycle.internal.MojoExecutor.execute(MojoExecutor.java:145)
	at org.apache.maven.lifecycle.internal.LifecycleModuleBuilder.buildProject(LifecycleModuleBuilder.java:84)
	... 24 more
Sending e-mails to: java-dev@axis.apache.org andreas.veithen@gmail.com
channel stopped


---------------------------------------------------------------------
To unsubscribe, e-mail: java-dev-unsubscribe@axis.apache.org
For additional commands, e-mail: java-dev-help@axis.apache.org


Mime
View raw message