axis-java-dev mailing list archives

Site index · List index
Message view « Date » · « Thread »
Top « Date » · « Thread »
From Apache Jenkins Server <jenk...@builds.apache.org>
Subject Build failed in Jenkins: sandesha2-trunk #583
Date Thu, 29 Dec 2011 19:11:58 GMT
See <https://builds.apache.org/job/sandesha2-trunk/583/>

------------------------------------------
[...truncated 66 lines...]
Downloading: http://repository.apache.org/snapshots/org/apache/ws/commons/axiom/axiom-impl/1.2.13-SNAPSHOT/maven-metadata.xml
Downloaded: http://repository.apache.org/snapshots/org/apache/ws/commons/axiom/axiom-impl/1.2.13-SNAPSHOT/maven-metadata.xml
(376 B at 14.7 KB/sec)
Downloading: http://repository.apache.org/snapshots/org/apache/ws/commons/axiom/axiom-impl/1.2.13-SNAPSHOT/axiom-impl-1.2.13-20111229.141158-347.pom
Downloaded: http://repository.apache.org/snapshots/org/apache/ws/commons/axiom/axiom-impl/1.2.13-SNAPSHOT/axiom-impl-1.2.13-20111229.141158-347.pom
(8 KB at 207.7 KB/sec)
Downloading: http://repository.apache.org/snapshots/org/apache/ws/commons/schema/XmlSchema/1.4.8-SNAPSHOT/maven-metadata.xml
Downloaded: http://repository.apache.org/snapshots/org/apache/ws/commons/schema/XmlSchema/1.4.8-SNAPSHOT/maven-metadata.xml
(283 B at 8.6 KB/sec)
Downloading: http://repository.apache.org/snapshots/org/apache/ws/commons/schema/XmlSchema/1.4.8-SNAPSHOT/XmlSchema-1.4.8-SNAPSHOT.pom
Downloaded: http://repository.apache.org/snapshots/org/apache/ws/commons/schema/XmlSchema/1.4.8-SNAPSHOT/XmlSchema-1.4.8-SNAPSHOT.pom
(18 KB at 912.6 KB/sec)
Downloading: http://repository.apache.org/snapshots/org/apache/neethi/neethi/3.0.2-SNAPSHOT/maven-metadata.xml
Downloaded: http://repository.apache.org/snapshots/org/apache/neethi/neethi/3.0.2-SNAPSHOT/maven-metadata.xml
(2 KB at 73.1 KB/sec)
Downloading: http://repository.apache.org/snapshots/org/apache/neethi/neethi/3.0.2-SNAPSHOT/neethi-3.0.2-20111225.004323-149.pom
Downloaded: http://repository.apache.org/snapshots/org/apache/neethi/neethi/3.0.2-SNAPSHOT/neethi-3.0.2-20111225.004323-149.pom
(14 KB at 555.8 KB/sec)
Downloading: http://repository.apache.org/snapshots/org/apache/woden/woden-api/1.0-SNAPSHOT/maven-metadata.xml
Downloaded: http://repository.apache.org/snapshots/org/apache/woden/woden-api/1.0-SNAPSHOT/maven-metadata.xml
(775 B at 20.5 KB/sec)
Downloading: http://repository.apache.org/snapshots/org/apache/woden/woden-api/1.0-SNAPSHOT/woden-api-1.0-20111229.092015-324.pom
Downloaded: http://repository.apache.org/snapshots/org/apache/woden/woden-api/1.0-SNAPSHOT/woden-api-1.0-20111229.092015-324.pom
(3 KB at 106.2 KB/sec)
Downloading: http://repository.apache.org/snapshots/org/apache/woden/woden/1.0-SNAPSHOT/maven-metadata.xml
Downloaded: http://repository.apache.org/snapshots/org/apache/woden/woden/1.0-SNAPSHOT/maven-metadata.xml
(598 B at 22.5 KB/sec)
Downloading: http://repository.apache.org/snapshots/org/apache/woden/woden/1.0-SNAPSHOT/woden-1.0-20111229.092013-324.pom
Downloaded: http://repository.apache.org/snapshots/org/apache/woden/woden/1.0-SNAPSHOT/woden-1.0-20111229.092013-324.pom
(14 KB at 312.4 KB/sec)
Downloading: http://repository.apache.org/snapshots/org/apache/woden/woden-impl-dom/1.0-SNAPSHOT/maven-metadata.xml
Downloaded: http://repository.apache.org/snapshots/org/apache/woden/woden-impl-dom/1.0-SNAPSHOT/maven-metadata.xml
(780 B at 24.6 KB/sec)
Downloading: http://repository.apache.org/snapshots/org/apache/woden/woden-impl-dom/1.0-SNAPSHOT/woden-impl-dom-1.0-20111229.092022-324.pom
Downloaded: http://repository.apache.org/snapshots/org/apache/woden/woden-impl-dom/1.0-SNAPSHOT/woden-impl-dom-1.0-20111229.092022-324.pom
(5 KB at 117.1 KB/sec)
Downloading: http://repository.apache.org/snapshots/org/apache/woden/woden-impl-commons/1.0-SNAPSHOT/maven-metadata.xml
Downloaded: http://repository.apache.org/snapshots/org/apache/woden/woden-impl-commons/1.0-SNAPSHOT/maven-metadata.xml
(784 B at 19.6 KB/sec)
Downloading: http://repository.apache.org/snapshots/org/apache/woden/woden-impl-commons/1.0-SNAPSHOT/woden-impl-commons-1.0-20111229.092017-324.pom
Downloaded: http://repository.apache.org/snapshots/org/apache/woden/woden-impl-commons/1.0-SNAPSHOT/woden-impl-commons-1.0-20111229.092017-324.pom
(5 KB at 101.3 KB/sec)
Downloading: http://repository.apache.org/snapshots/org/apache/axis2/addressing/1.7.0-SNAPSHOT/maven-metadata.xml
Downloaded: http://repository.apache.org/snapshots/org/apache/axis2/addressing/1.7.0-SNAPSHOT/maven-metadata.xml
(2 KB at 28.1 KB/sec)
Downloading: http://repository.apache.org/snapshots/org/apache/axis2/addressing/1.7.0-SNAPSHOT/addressing-1.7.0-20111229.111201-494.pom
Downloaded: http://repository.apache.org/snapshots/org/apache/axis2/addressing/1.7.0-SNAPSHOT/addressing-1.7.0-20111229.111201-494.pom
(5 KB at 118.4 KB/sec)
Downloading: http://repository.apache.org/snapshots/org/apache/axis2/axis2-mtompolicy/1.7.0-SNAPSHOT/maven-metadata.xml
Downloaded: http://repository.apache.org/snapshots/org/apache/axis2/axis2-mtompolicy/1.7.0-SNAPSHOT/maven-metadata.xml
(2 KB at 24.3 KB/sec)
Downloading: http://repository.apache.org/snapshots/org/apache/axis2/axis2-mtompolicy/1.7.0-SNAPSHOT/axis2-mtompolicy-1.7.0-20111229.113145-469.pom
Downloaded: http://repository.apache.org/snapshots/org/apache/axis2/axis2-mtompolicy/1.7.0-SNAPSHOT/axis2-mtompolicy-1.7.0-20111229.113145-469.pom
(4 KB at 82.7 KB/sec)
Downloading: http://repository.apache.org/snapshots/org/apache/axis2/axis2-kernel/1.7.0-SNAPSHOT/axis2-kernel-1.7.0-20111229.110907-501.jar
Downloading: http://repository.apache.org/snapshots/org/apache/ws/commons/axiom/axiom-api/1.2.13-SNAPSHOT/axiom-api-1.2.13-20111229.141158-349.jar
Downloading: http://repository.apache.org/snapshots/org/apache/ws/commons/axiom/axiom-impl/1.2.13-SNAPSHOT/axiom-impl-1.2.13-20111229.141158-347.jar
Downloading: http://repository.apache.org/snapshots/org/apache/ws/commons/schema/XmlSchema/1.4.8-SNAPSHOT/XmlSchema-1.4.8-SNAPSHOT.jar
Downloading: http://repository.apache.org/snapshots/org/apache/neethi/neethi/3.0.2-SNAPSHOT/neethi-3.0.2-20111225.004323-149.jar
Downloaded: http://repository.apache.org/snapshots/org/apache/neethi/neethi/3.0.2-SNAPSHOT/neethi-3.0.2-20111225.004323-149.jar
(70 KB at 320.0 KB/sec)
Downloading: http://repository.apache.org/snapshots/org/apache/woden/woden-api/1.0-SNAPSHOT/woden-api-1.0-20111229.092015-324.jar
Downloaded: http://repository.apache.org/snapshots/org/apache/ws/commons/schema/XmlSchema/1.4.8-SNAPSHOT/XmlSchema-1.4.8-SNAPSHOT.jar
(146 KB at 640.8 KB/sec)
Downloading: http://repository.apache.org/snapshots/org/apache/woden/woden-impl-dom/1.0-SNAPSHOT/woden-impl-dom-1.0-20111229.092022-324.jar
Downloaded: http://repository.apache.org/snapshots/org/apache/axis2/axis2-kernel/1.7.0-SNAPSHOT/axis2-kernel-1.7.0-20111229.110907-501.jar
(1030 KB at 4200.1 KB/sec)
Downloading: http://repository.apache.org/snapshots/org/apache/woden/woden-impl-commons/1.0-SNAPSHOT/woden-impl-commons-1.0-20111229.092017-324.jar
Downloaded: http://repository.apache.org/snapshots/org/apache/ws/commons/axiom/axiom-impl/1.2.13-SNAPSHOT/axiom-impl-1.2.13-20111229.141158-347.jar
(153 KB at 604.5 KB/sec)
Downloading: http://repository.apache.org/snapshots/org/apache/axis2/addressing/1.7.0-SNAPSHOT/addressing-1.7.0-20111229.111201-494.mar
Downloaded: http://repository.apache.org/snapshots/org/apache/ws/commons/axiom/axiom-api/1.2.13-SNAPSHOT/axiom-api-1.2.13-20111229.141158-349.jar
(411 KB at 1524.8 KB/sec)
Downloading: http://repository.apache.org/snapshots/org/apache/axis2/axis2-mtompolicy/1.7.0-SNAPSHOT/axis2-mtompolicy-1.7.0-20111229.113145-469.jar
Downloaded: http://repository.apache.org/snapshots/org/apache/woden/woden-impl-dom/1.0-SNAPSHOT/woden-impl-dom-1.0-20111229.092022-324.jar
(48 KB at 606.8 KB/sec)
Downloaded: http://repository.apache.org/snapshots/org/apache/woden/woden-api/1.0-SNAPSHOT/woden-api-1.0-20111229.092015-324.jar
(147 KB at 1698.8 KB/sec)
Downloaded: http://repository.apache.org/snapshots/org/apache/woden/woden-impl-commons/1.0-SNAPSHOT/woden-impl-commons-1.0-20111229.092017-324.jar
(179 KB at 2883.0 KB/sec)
Downloaded: http://repository.apache.org/snapshots/org/apache/axis2/axis2-mtompolicy/1.7.0-SNAPSHOT/axis2-mtompolicy-1.7.0-20111229.113145-469.jar
(14 KB at 272.9 KB/sec)
Downloaded: http://repository.apache.org/snapshots/org/apache/axis2/addressing/1.7.0-SNAPSHOT/addressing-1.7.0-20111229.111201-494.mar
(30 KB at 418.4 KB/sec)
[INFO] 
[INFO] --- apache-rat-plugin:0.7:check (default) @ sandesha2-parent ---
[INFO] Exclude: dependency-reduced-pom.xml
[INFO] 
[INFO] --- maven-install-plugin:2.3:install (default-install) @ sandesha2-parent ---
[INFO] Installing <https://builds.apache.org/job/sandesha2-trunk/ws/sandesha2/pom.xml>
to <https://builds.apache.org/job/sandesha2-trunk/ws/.repository/org/apache/sandesha2/sandesha2-parent/1.7.0-SNAPSHOT/sandesha2-parent-1.7.0-SNAPSHOT.pom>
[JENKINS] Archiving <https://builds.apache.org/job/sandesha2-trunk/ws/sandesha2/pom.xml>
to /home/hudson/hudson/jobs/sandesha2-trunk/modules/org.apache.sandesha2$sandesha2-parent/builds/2011-12-29_19-11-35/archive/org.apache.sandesha2/sandesha2-parent/1.7.0-SNAPSHOT/sandesha2-parent-1.7.0-SNAPSHOT.pom
[INFO]                                                                         
[INFO] ------------------------------------------------------------------------
[INFO] Building Sandesha2 - Resource bundle 1.7.0-SNAPSHOT
[INFO] ------------------------------------------------------------------------
[INFO] Deleting <https://builds.apache.org/job/sandesha2-trunk/ws/sandesha2/modules/resource-bundle/target>
[INFO] 
[INFO] --- maven-clean-plugin:2.4.1:clean (default-clean) @ sandesha2-resource-bundle ---
[INFO] 
[INFO] --- maven-remote-resources-plugin:1.1:bundle (default) @ sandesha2-resource-bundle
---
[INFO] 
[INFO] --- maven-remote-resources-plugin:1.1:process (default) @ sandesha2-resource-bundle
---
[INFO] 
[INFO] --- maven-resources-plugin:2.4:resources (default-resources) @ sandesha2-resource-bundle
---
[INFO] Using 'UTF-8' encoding to copy filtered resources.
[INFO] Copying 2 resources
[INFO] Copying 3 resources
[INFO] 
[INFO] --- maven-compiler-plugin:2.0:compile (default-compile) @ sandesha2-resource-bundle
---
[INFO] No sources to compile
[INFO] [INFO] Using 'UTF-8' encoding to copy filtered resources.
[INFO] skip non existing resourceDirectory <https://builds.apache.org/job/sandesha2-trunk/ws/sandesha2/modules/resource-bundle/src/test/resources>
[INFO] Copying 3 resources

[INFO] --- maven-resources-plugin:2.4:testResources (default-testResources) @ sandesha2-resource-bundle
---
[INFO] [INFO] No sources to compile

[INFO] --- maven-compiler-plugin:2.0:testCompile (default-testCompile) @ sandesha2-resource-bundle
---
[INFO] 
[INFO] --- maven-surefire-plugin:2.11:test (default-test) @ sandesha2-resource-bundle ---
[INFO] Surefire report directory: <https://builds.apache.org/job/sandesha2-trunk/ws/sandesha2/modules/resource-bundle/target/surefire-reports>

-------------------------------------------------------
 T E S T S
-------------------------------------------------------

Results :

Tests run: 0, Failures: 0, Errors: 0, Skipped: 0

[JENKINS] Recording test results
[INFO] 
[INFO] --- maven-jar-plugin:2.3:jar (default-jar) @ sandesha2-resource-bundle ---
[INFO] Building jar: <https://builds.apache.org/job/sandesha2-trunk/ws/sandesha2/modules/resource-bundle/target/sandesha2-resource-bundle-1.7.0-SNAPSHOT.jar>
[INFO] 
[INFO] --- apache-rat-plugin:0.7:check (default) @ sandesha2-resource-bundle ---
[INFO] Exclude: src/main/resources/META-INF/*.vm
[INFO] 
[INFO] --- maven-install-plugin:2.3:install (default-install) @ sandesha2-resource-bundle
---
[INFO] Installing <https://builds.apache.org/job/sandesha2-trunk/ws/sandesha2/modules/resource-bundle/target/sandesha2-resource-bundle-1.7.0-SNAPSHOT.jar>
to <https://builds.apache.org/job/sandesha2-trunk/ws/.repository/org/apache/sandesha2/sandesha2-resource-bundle/1.7.0-SNAPSHOT/sandesha2-resource-bundle-1.7.0-SNAPSHOT.jar>
[INFO] Installing <https://builds.apache.org/job/sandesha2-trunk/ws/sandesha2/modules/resource-bundle/pom.xml>
to <https://builds.apache.org/job/sandesha2-trunk/ws/.repository/org/apache/sandesha2/sandesha2-resource-bundle/1.7.0-SNAPSHOT/sandesha2-resource-bundle-1.7.0-SNAPSHOT.pom>
[JENKINS] Archiving <https://builds.apache.org/job/sandesha2-trunk/ws/sandesha2/modules/resource-bundle/pom.xml>
to /home/hudson/hudson/jobs/sandesha2-trunk/modules/org.apache.sandesha2$sandesha2-resource-bundle/builds/2011-12-29_19-11-35/archive/org.apache.sandesha2/sandesha2-resource-bundle/1.7.0-SNAPSHOT/sandesha2-resource-bundle-1.7.0-SNAPSHOT.pom
[JENKINS] Archiving <https://builds.apache.org/job/sandesha2-trunk/ws/sandesha2/modules/resource-bundle/target/sandesha2-resource-bundle-1.7.0-SNAPSHOT.jar>
to /home/hudson/hudson/jobs/sandesha2-trunk/modules/org.apache.sandesha2$sandesha2-resource-bundle/builds/2011-12-29_19-11-35/archive/org.apache.sandesha2/sandesha2-resource-bundle/1.7.0-SNAPSHOT/sandesha2-resource-bundle-1.7.0-SNAPSHOT.jar
[INFO] Downloading: http://repository.apache.org/snapshots/org/apache/axis2/axis2-codegen/1.7.0-SNAPSHOT/maven-metadata.xml
                                                                        
[INFO] ------------------------------------------------------------------------
[INFO] Building Sandesha2 - Core 1.7.0-SNAPSHOT
[INFO] ------------------------------------------------------------------------
Downloaded: http://repository.apache.org/snapshots/org/apache/axis2/axis2-codegen/1.7.0-SNAPSHOT/maven-metadata.xml
(2 KB at 18.3 KB/sec)
Downloading: http://repository.apache.org/snapshots/org/apache/axis2/axis2-codegen/1.7.0-SNAPSHOT/axis2-codegen-1.7.0-20111229.111101-495.pom
Downloaded: http://repository.apache.org/snapshots/org/apache/axis2/axis2-codegen/1.7.0-SNAPSHOT/axis2-codegen-1.7.0-20111229.111101-495.pom
(11 KB at 216.8 KB/sec)
Downloading: http://repository.apache.org/snapshots/org/apache/axis2/axis2-adb/1.7.0-SNAPSHOT/maven-metadata.xml
Downloaded: http://repository.apache.org/snapshots/org/apache/axis2/axis2-adb/1.7.0-SNAPSHOT/maven-metadata.xml
(2 KB at 17.2 KB/sec)
Downloading: http://repository.apache.org/snapshots/org/apache/axis2/axis2-adb/1.7.0-SNAPSHOT/axis2-adb-1.7.0-20111229.110957-500.pom
Downloaded: http://repository.apache.org/snapshots/org/apache/axis2/axis2-adb/1.7.0-SNAPSHOT/axis2-adb-1.7.0-20111229.110957-500.pom
(5 KB at 131.7 KB/sec)
Downloading: http://repository.apache.org/snapshots/org/apache/ws/commons/axiom/axiom-dom/1.2.13-SNAPSHOT/maven-metadata.xml
Downloaded: http://repository.apache.org/snapshots/org/apache/ws/commons/axiom/axiom-dom/1.2.13-SNAPSHOT/maven-metadata.xml
(375 B at 10.5 KB/sec)
Downloading: http://repository.apache.org/snapshots/org/apache/ws/commons/axiom/axiom-dom/1.2.13-SNAPSHOT/axiom-dom-1.2.13-20111229.141158-347.pom
Downloaded: http://repository.apache.org/snapshots/org/apache/ws/commons/axiom/axiom-dom/1.2.13-SNAPSHOT/axiom-dom-1.2.13-20111229.141158-347.pom
(9 KB at 198.8 KB/sec)
Downloading: http://repository.apache.org/snapshots/org/apache/axis2/axis2-codegen/1.7.0-SNAPSHOT/axis2-codegen-1.7.0-20111229.111101-495.jar
Downloading: http://repository.apache.org/snapshots/org/apache/axis2/axis2-adb/1.7.0-SNAPSHOT/axis2-adb-1.7.0-20111229.110957-500.jar
Downloading: http://repository.apache.org/snapshots/org/apache/ws/commons/axiom/axiom-dom/1.2.13-SNAPSHOT/axiom-dom-1.2.13-20111229.141158-347.jar
Downloaded: http://repository.apache.org/snapshots/org/apache/ws/commons/axiom/axiom-dom/1.2.13-SNAPSHOT/axiom-dom-1.2.13-20111229.141158-347.jar
(193 KB at 4271.1 KB/sec)
Downloaded: http://repository.apache.org/snapshots/org/apache/axis2/axis2-adb/1.7.0-SNAPSHOT/axis2-adb-1.7.0-20111229.110957-500.jar
(683 KB at 2819.7 KB/sec)
Downloaded: http://repository.apache.org/snapshots/org/apache/axis2/axis2-codegen/1.7.0-SNAPSHOT/axis2-codegen-1.7.0-20111229.111101-495.jar
(252 KB at 548.4 KB/sec)
[INFO] [INFO] Deleting <https://builds.apache.org/job/sandesha2-trunk/ws/sandesha2/modules/core/target>

[INFO] --- maven-clean-plugin:2.4.1:clean (default-clean) @ sandesha2-core ---
[INFO] 
[INFO] --- maven-remote-resources-plugin:1.1:process (default) @ sandesha2-core ---
[INFO] [INFO] Using 'UTF-8' encoding to copy filtered resources.
[INFO] Copying 1 resource
[INFO] Copying 2 resources

[INFO] --- maven-resources-plugin:2.4:resources (default-resources) @ sandesha2-core ---
[INFO] 
[INFO] --- maven-compiler-plugin:2.0:compile (default-compile) @ sandesha2-core ---
Compiling 134 source files to <https://builds.apache.org/job/sandesha2-trunk/ws/sandesha2/modules/core/target/classes>
[INFO] [INFO] Using 'UTF-8' encoding to copy filtered resources.
[INFO] skip non existing resourceDirectory <https://builds.apache.org/job/sandesha2-trunk/ws/sandesha2/modules/core/src/test/resources>
[INFO] Copying 2 resources

[INFO] --- maven-resources-plugin:2.4:testResources (default-testResources) @ sandesha2-core
---
[INFO] [INFO] No sources to compile

[INFO] --- maven-compiler-plugin:2.0:testCompile (default-testCompile) @ sandesha2-core ---
[INFO] [INFO] Surefire report directory: <https://builds.apache.org/job/sandesha2-trunk/ws/sandesha2/modules/core/target/surefire-reports>

[INFO] --- maven-surefire-plugin:2.11:test (default-test) @ sandesha2-core ---

-------------------------------------------------------
 T E S T S
-------------------------------------------------------

Results :

Tests run: 0, Failures: 0, Errors: 0, Skipped: 0

[JENKINS] Recording test results
[INFO] 
[INFO] --- maven-jar-plugin:2.3:jar (default-jar) @ sandesha2-core ---
[INFO] Building jar: <https://builds.apache.org/job/sandesha2-trunk/ws/sandesha2/modules/core/target/sandesha2-core-1.7.0-SNAPSHOT.jar>
[INFO] [INFO] Exclude: dependency-reduced-pom.xml

[INFO] --- apache-rat-plugin:0.7:check (default) @ sandesha2-core ---
[JENKINS] Archiving <https://builds.apache.org/job/sandesha2-trunk/ws/sandesha2/modules/core/pom.xml>
to /home/hudson/hudson/jobs/sandesha2-trunk/modules/org.apache.sandesha2$sandesha2-core/builds/2011-12-29_19-11-35/archive/org.apache.sandesha2/sandesha2-core/1.7.0-SNAPSHOT/sandesha2-core-1.7.0-SNAPSHOT.pom
[JENKINS] Archiving <https://builds.apache.org/job/sandesha2-trunk/ws/sandesha2/modules/core/target/sandesha2-core-1.7.0-SNAPSHOT.jar>
to /home/hudson/hudson/jobs/sandesha2-trunk/modules/org.apache.sandesha2$sandesha2-core/builds/2011-12-29_19-11-35/archive/org.apache.sandesha2/sandesha2-core/1.7.0-SNAPSHOT/sandesha2-core-1.7.0-SNAPSHOT.jar
[INFO] ------------------------------------------------------------------------
[INFO] Reactor Summary:
[INFO] 
[INFO] Apache Sandesha ................................... SUCCESS [9.326s]
[INFO] Sandesha2 - Resource bundle ....................... SUCCESS [1.902s]
[INFO] Sandesha2 - Core .................................. FAILURE [3.744s]
[INFO] Sandesha2 - Mar ................................... SKIPPED
[INFO] Sandesha2 - Client ................................ SKIPPED
[INFO] Sandesha2 - Policy ................................ SKIPPED
[INFO] Sandesha2 - Rampart Integration ................... SKIPPED
[INFO] Sandesha2 - Samples ............................... SKIPPED
[INFO] Sandesha2 - Test Suite ............................ SKIPPED
[INFO] Sandesha2 - Interop ............................... SKIPPED
[INFO] Sandesha2 - Persistent Storage .................... SKIPPED
[INFO] Sandesha2 - Distribution .......................... SKIPPED
[INFO] ------------------------------------------------------------------------
[INFO] BUILD FAILURE
[INFO] ------------------------------------------------------------------------
[INFO] Total time: 18.123s
[INFO] Finished at: Thu Dec 29 19:11:57 GMT 2011
[INFO] Final Memory: 19M/421M
[INFO] ------------------------------------------------------------------------
Waiting for Jenkins to finish collecting data
mavenExecutionResult exceptions not empty
message : Internal error: java.lang.NullPointerException
cause : null
Stack trace : 
org.apache.maven.InternalErrorException: Internal error: java.lang.NullPointerException
	at org.apache.maven.lifecycle.internal.BuilderCommon.handleBuildError(BuilderCommon.java:128)
	at org.apache.maven.lifecycle.internal.LifecycleModuleBuilder.buildProject(LifecycleModuleBuilder.java:95)
	at org.apache.maven.lifecycle.internal.LifecycleModuleBuilder.buildProject(LifecycleModuleBuilder.java:59)
	at org.apache.maven.lifecycle.internal.LifecycleStarter.singleThreadedBuild(LifecycleStarter.java:183)
	at org.apache.maven.lifecycle.internal.LifecycleStarter.execute(LifecycleStarter.java:161)
	at org.apache.maven.DefaultMaven.doExecute(DefaultMaven.java:319)
	at org.apache.maven.DefaultMaven.execute(DefaultMaven.java:156)
	at org.jvnet.hudson.maven3.launcher.Maven3Launcher.main(Maven3Launcher.java:79)
	at sun.reflect.NativeMethodAccessorImpl.invoke0(Native Method)
	at sun.reflect.NativeMethodAccessorImpl.invoke(NativeMethodAccessorImpl.java:39)
	at sun.reflect.DelegatingMethodAccessorImpl.invoke(DelegatingMethodAccessorImpl.java:25)
	at java.lang.reflect.Method.invoke(Method.java:592)
	at org.codehaus.plexus.classworlds.launcher.Launcher.launchStandard(Launcher.java:329)
	at org.codehaus.plexus.classworlds.launcher.Launcher.launch(Launcher.java:239)
	at org.jvnet.hudson.maven3.agent.Maven3Main.launch(Maven3Main.java:158)
	at hudson.maven.Maven3Builder.call(Maven3Builder.java:112)
	at hudson.maven.Maven3Builder.call(Maven3Builder.java:70)
	at hudson.remoting.UserRequest.perform(UserRequest.java:118)
	at hudson.remoting.UserRequest.perform(UserRequest.java:48)
	at hudson.remoting.Request$2.run(Request.java:287)
	at java.util.concurrent.Executors$RunnableAdapter.call(Executors.java:417)
	at java.util.concurrent.FutureTask$Sync.innerRun(FutureTask.java:269)
	at java.util.concurrent.FutureTask.run(FutureTask.java:123)
	at java.util.concurrent.ThreadPoolExecutor$Worker.runTask(ThreadPoolExecutor.java:651)
	at java.util.concurrent.ThreadPoolExecutor$Worker.run(ThreadPoolExecutor.java:676)
	at java.lang.Thread.run(Thread.java:595)
Caused by: java.lang.NullPointerException
	at hudson.maven.ExecutedMojo.getMojoClass(ExecutedMojo.java:114)
	at hudson.maven.ExecutedMojo.<init>(ExecutedMojo.java:99)
	at hudson.maven.Maven3Builder$MavenExecutionListener.recordExecutionTime(Maven3Builder.java:524)
	at hudson.maven.Maven3Builder$MavenExecutionListener.recordMojoSucceeded(Maven3Builder.java:493)
	at hudson.maven.Maven3Builder$MavenExecutionListener.forkSucceeded(Maven3Builder.java:601)
	at org.apache.maven.lifecycle.internal.DefaultExecutionEventCatapult.fire(DefaultExecutionEventCatapult.java:97)
	at org.apache.maven.lifecycle.internal.DefaultExecutionEventCatapult.fire(DefaultExecutionEventCatapult.java:42)
	at org.apache.maven.lifecycle.internal.MojoExecutor.executeForkedExecutions(MojoExecutor.java:383)
	at org.apache.maven.lifecycle.internal.MojoExecutor.execute(MojoExecutor.java:199)
	at org.apache.maven.lifecycle.internal.MojoExecutor.execute(MojoExecutor.java:153)
	at org.apache.maven.lifecycle.internal.MojoExecutor.execute(MojoExecutor.java:145)
	at org.apache.maven.lifecycle.internal.LifecycleModuleBuilder.buildProject(LifecycleModuleBuilder.java:84)
	... 24 more
Sending e-mails to: java-dev@axis.apache.org
channel stopped


---------------------------------------------------------------------
To unsubscribe, e-mail: java-dev-unsubscribe@axis.apache.org
For additional commands, e-mail: java-dev-help@axis.apache.org


Mime
View raw message