axis-java-dev mailing list archives

Site index · List index
Message view « Date » · « Thread »
Top « Date » · « Thread »
From Apache Jenkins Server <jenk...@builds.apache.org>
Subject Build failed in Jenkins: axis2-transports-trunk #661
Date Thu, 29 Dec 2011 13:31:33 GMT
See <https://builds.apache.org/job/axis2-transports-trunk/661/>

------------------------------------------
Started by upstream project "Axis2" build number 1208
Building remotely on ubuntu2
Updating http://svn.apache.org/repos/asf/axis/axis2/java/transports/trunk
At revision 1225523
no change for http://svn.apache.org/repos/asf/axis/axis2/java/transports/trunk since the previous
build
[axis2-transports-trunk] $ /bin/bash -xe /tmp/hudson7733812979989327661.sh
+ '[' -d <https://builds.apache.org/job/axis2-transports-trunk/ws/.repository> ']'
++ find <https://builds.apache.org/job/axis2-transports-trunk/ws/.repository> -type
d -and -name '*-SNAPSHOT'
+ rm -rf <https://builds.apache.org/job/axis2-transports-trunk/ws/.repository/org/apache/ws/commons/schema/XmlSchema/1.4.8-SNAPSHOT>
<https://builds.apache.org/job/axis2-transports-trunk/ws/.repository/org/apache/ws/commons/axiom/axiom-impl/1.2.13-SNAPSHOT>
<https://builds.apache.org/job/axis2-transports-trunk/ws/.repository/org/apache/ws/commons/axiom/axiom-parent/1.2.13-SNAPSHOT>
<https://builds.apache.org/job/axis2-transports-trunk/ws/.repository/org/apache/ws/commons/axiom/axiom-api/1.2.13-SNAPSHOT>
<https://builds.apache.org/job/axis2-transports-trunk/ws/.repository/org/apache/axis2/axis2-transport-all/1.7.0-SNAPSHOT>
<https://builds.apache.org/job/axis2-transports-trunk/ws/.repository/org/apache/axis2/axis2-transport-http/1.7.0-SNAPSHOT>
<https://builds.apache.org/job/axis2-transports-trunk/ws/.repository/org/apache/axis2/addressing/1.7.0-SNAPSHOT>
<https://builds.apache.org/job/axis2-transports-trunk/ws/.repository/org/apache/axis2/axis2-transport-jms/1.7.0-SNAPSHOT>
<https://builds.apache.org/job/axis2-transports-trunk/ws/.repository/org/apache/axis2/axis2-transport-testkit/1.7.0-SNAPSHOT>
<https://builds.apache.org/job/axis2-transports-trunk/ws/.repository/org/apache/axis2/axis2-transport-udp/1.7.0-SNAPSHOT>
<https://builds.apache.org/job/axis2-transports-trunk/ws/.repository/org/apache/axis2/axis2-transport-base/1.7.0-SNAPSHOT>
<https://builds.apache.org/job/axis2-transports-trunk/ws/.repository/org/apache/axis2/axis2-transport-tcp/1.7.0-SNAPSHOT>
<https://builds.apache.org/job/axis2-transports-trunk/ws/.repository/org/apache/axis2/axis2-transports/1.7.0-SNAPSHOT>
<https://builds.apache.org/job/axis2-transports-trunk/ws/.repository/org/apache/axis2/axis2-transport-http-tests/1.7.0-SNAPSHOT>
<https://builds.apache.org/job/axis2-transports-trunk/ws/.repository/org/apache/axis2/axis2-kernel/1.7.0-SNAPSHOT>
<https://builds.apache.org/job/axis2-transports-trunk/ws/.repository/org/apache/axis2/axis2-transport-xmpp/1.7.0-SNAPSHOT>
<https://builds.apache.org/job/axis2-transports-trunk/ws/.repository/org/apache/axis2/axis2-parent/1.7.0-SNAPSHOT>
<https://builds.apache.org/job/axis2-transports-trunk/ws/.repository/org/apache/axis2/axis2-transport-mail/1.7.0-SNAPSHOT>
<https://builds.apache.org/job/axis2-transports-trunk/ws/.repository/org/apache/axis2/axis2-transport-sms/1.7.0-SNAPSHOT>
<https://builds.apache.org/job/axis2-transports-trunk/ws/.repository/org/apache/woden/woden-impl-dom/1.0-SNAPSHOT>
<https://builds.apache.org/job/axis2-transports-trunk/ws/.repository/org/apache/woden/woden-api/1.0-SNAPSHOT>
<https://builds.apache.org/job/axis2-transports-trunk/ws/.repository/org/apache/woden/woden-impl-commons/1.0-SNAPSHOT>
<https://builds.apache.org/job/axis2-transports-trunk/ws/.repository/org/apache/woden/woden/1.0-SNAPSHOT>
<https://builds.apache.org/job/axis2-transports-trunk/ws/.repository/org/apache/neethi/neethi/3.0.2-SNAPSHOT>
[locks-and-latches] Checking to see if we really have the locks
[locks-and-latches] Have all the locks, build can start
Parsing POMs
Modules changed, recalculating dependency graph
[transports] $ /home/hudson/tools/java/latest1.5/bin/java -cp /home/hudson/hudson-slave/maven3-agent.jar:/home/hudson/tools/maven/latest/boot/plexus-classworlds-2.4.jar
org.jvnet.hudson.maven3.agent.Maven3Main /home/hudson/tools/maven/latest /home/hudson/hudson-slave/slave.jar
/home/hudson/hudson-slave/maven3-interceptor.jar 54307
<===[JENKINS REMOTING CAPACITY]===>channel started
   Executing Maven:  -B -f <https://builds.apache.org/job/axis2-transports-trunk/ws/transports/pom.xml>
-Dmaven.repo.local=<https://builds.apache.org/job/axis2-transports-trunk/ws/.repository>
clean deploy
[INFO] Scanning for projects...
[WARNING] 
[WARNING] Some problems were encountered while building the effective model for org.apache.axis2:axis2-transport-base:bundle:1.7.0-SNAPSHOT
[WARNING] The expression ${pom.description} is deprecated. Please use ${project.description}
instead.
[WARNING] 
[WARNING] Some problems were encountered while building the effective model for org.apache.axis2:axis2-transport-tcp:bundle:1.7.0-SNAPSHOT
[WARNING] The expression ${version} is deprecated. Please use ${project.version} instead.
[WARNING] The expression ${pom.description} is deprecated. Please use ${project.description}
instead.
[WARNING] 
[WARNING] Some problems were encountered while building the effective model for org.apache.axis2:axis2-transport-udp:bundle:1.7.0-SNAPSHOT
[WARNING] The expression ${version} is deprecated. Please use ${project.version} instead.
[WARNING] The expression ${pom.description} is deprecated. Please use ${project.description}
instead.
[WARNING] 
[WARNING] Some problems were encountered while building the effective model for org.apache.axis2:axis2-transport-xmpp:bundle:1.7.0-SNAPSHOT
[WARNING] The expression ${pom.description} is deprecated. Please use ${project.description}
instead.
[WARNING] 
[WARNING] Some problems were encountered while building the effective model for org.apache.axis2:axis2-transport-mail:bundle:1.7.0-SNAPSHOT
[WARNING] The expression ${version} is deprecated. Please use ${project.version} instead.
[WARNING] The expression ${pom.description} is deprecated. Please use ${project.description}
instead.
[WARNING] 
[WARNING] Some problems were encountered while building the effective model for org.apache.axis2:axis2-transport-jms:bundle:1.7.0-SNAPSHOT
[WARNING] 'dependencies.dependency.(groupId:artifactId:type:classifier)' must be unique: org.mockejb:mockejb:jar
-> duplicate declaration of version 0.6-beta2 @ line 170, column 21
[WARNING] The expression ${version} is deprecated. Please use ${project.version} instead.
[WARNING] The expression ${pom.description} is deprecated. Please use ${project.description}
instead.
[WARNING] 
[WARNING] Some problems were encountered while building the effective model for org.apache.axis2:axis2-transport-sms:bundle:1.7.0-SNAPSHOT
[WARNING] The expression ${version} is deprecated. Please use ${project.version} instead.
[WARNING] The expression ${pom.description} is deprecated. Please use ${project.description}
instead.
[WARNING] 
[WARNING] Some problems were encountered while building the effective model for org.apache.axis2:axis2-transport-all:bundle:1.7.0-SNAPSHOT
[WARNING] The expression ${pom.description} is deprecated. Please use ${project.description}
instead.
[WARNING] 
[INFO] [WARNING] It is highly recommended to fix these problems because they threaten the
stability of your build.
[WARNING] 
[WARNING] For this reason, future Maven versions might no longer support building such malformed
projects.
[WARNING] 
------------------------------------------------------------------------
[INFO] Reactor Build Order:
[INFO] 
[INFO] Apache Axis2 - Transport - Root
[INFO] Apache Axis2 - Transport - Base
[INFO] Apache Axis2 - Transport - testkit
[INFO] Apache Axis2 - Transport - HTTP Tests
[INFO] Apache Axis2 - Transport - TCP
[INFO] Apache Axis2 - Transport - UDP
[INFO] Apache Axis2 - Transport - XMPP
[INFO] Apache Axis2 - Transport - Mail
[INFO] Apache Axis2 - Transport - JMS
[INFO] Apache Axis2 - Transport - Sms
[INFO] Apache Axis2 - Transport - All
[INFO]                                                                         
[INFO] ------------------------------------------------------------------------
[INFO] Building Apache Axis2 - Transport - Root 1.7.0-SNAPSHOT
[INFO] ------------------------------------------------------------------------
[INFO] 
[INFO] --- maven-clean-plugin:2.4.1:clean (default-clean) @ axis2-transports ---
[INFO] Deleting <https://builds.apache.org/job/axis2-transports-trunk/ws/transports/target>
log4j:WARN No appenders could be found for logger (org.apache.commons.beanutils.converters.BooleanConverter).
log4j:WARN Please initialize the log4j system properly.
[INFO] 
[INFO] --- maven-remote-resources-plugin:1.1:process (default) @ axis2-transports ---
[INFO] Setting property: classpath.resource.loader.class => 'org.codehaus.plexus.velocity.ContextClassLoaderResourceLoader'.
[INFO] Setting property: velocimacro.messages.on => 'false'.
[INFO] Setting property: resource.loader => 'classpath'.
[INFO] Setting property: resource.manager.logwhenfound => 'false'.
Downloading: http://repository.apache.org/snapshots/org/apache/axis2/axis2-kernel/1.7.0-SNAPSHOT/maven-metadata.xml
Downloaded: http://repository.apache.org/snapshots/org/apache/axis2/axis2-kernel/1.7.0-SNAPSHOT/maven-metadata.xml
(2 KB at 8.8 KB/sec)
Downloading: http://repository.apache.org/snapshots/org/apache/axis2/axis2-kernel/1.7.0-SNAPSHOT/axis2-kernel-1.7.0-20111229.110907-501.pom
Downloaded: http://repository.apache.org/snapshots/org/apache/axis2/axis2-kernel/1.7.0-SNAPSHOT/axis2-kernel-1.7.0-20111229.110907-501.pom
(11 KB at 75.4 KB/sec)
Downloading: http://repository.apache.org/snapshots/org/apache/axis2/axis2-parent/1.7.0-SNAPSHOT/maven-metadata.xml
Downloaded: http://repository.apache.org/snapshots/org/apache/axis2/axis2-parent/1.7.0-SNAPSHOT/maven-metadata.xml
(609 B at 2.9 KB/sec)
Downloading: http://repository.apache.org/snapshots/org/apache/axis2/axis2-parent/1.7.0-SNAPSHOT/axis2-parent-1.7.0-20111229.110750-508.pom
Downloaded: http://repository.apache.org/snapshots/org/apache/axis2/axis2-parent/1.7.0-SNAPSHOT/axis2-parent-1.7.0-20111229.110750-508.pom
(48 KB at 240.8 KB/sec)
Downloading: http://repository.apache.org/snapshots/org/apache/ws/commons/axiom/axiom-api/1.2.13-SNAPSHOT/maven-metadata.xml
Downloaded: http://repository.apache.org/snapshots/org/apache/ws/commons/axiom/axiom-api/1.2.13-SNAPSHOT/maven-metadata.xml
(2 KB at 11.7 KB/sec)
Downloading: http://repository.apache.org/snapshots/org/apache/ws/commons/axiom/axiom-api/1.2.13-SNAPSHOT/axiom-api-1.2.13-20111225.002331-348.pom
Downloaded: http://repository.apache.org/snapshots/org/apache/ws/commons/axiom/axiom-api/1.2.13-SNAPSHOT/axiom-api-1.2.13-20111225.002331-348.pom
(16 KB at 158.1 KB/sec)
Downloading: http://repository.apache.org/snapshots/org/apache/ws/commons/axiom/axiom-parent/1.2.13-SNAPSHOT/maven-metadata.xml
Downloaded: http://repository.apache.org/snapshots/org/apache/ws/commons/axiom/axiom-parent/1.2.13-SNAPSHOT/maven-metadata.xml
(622 B at 5.6 KB/sec)
Downloading: http://repository.apache.org/snapshots/org/apache/ws/commons/axiom/axiom-parent/1.2.13-SNAPSHOT/axiom-parent-1.2.13-20111225.002331-352.pom
Downloaded: http://repository.apache.org/snapshots/org/apache/ws/commons/axiom/axiom-parent/1.2.13-SNAPSHOT/axiom-parent-1.2.13-20111225.002331-352.pom
(20 KB at 174.7 KB/sec)
Downloading: http://repository.apache.org/snapshots/org/apache/ws/commons/axiom/axiom-impl/1.2.13-SNAPSHOT/maven-metadata.xml
Downloaded: http://repository.apache.org/snapshots/org/apache/ws/commons/axiom/axiom-impl/1.2.13-SNAPSHOT/maven-metadata.xml
(2 KB at 10.8 KB/sec)
Downloading: http://repository.apache.org/snapshots/org/apache/ws/commons/axiom/axiom-impl/1.2.13-SNAPSHOT/axiom-impl-1.2.13-20111225.002331-346.pom
Downloaded: http://repository.apache.org/snapshots/org/apache/ws/commons/axiom/axiom-impl/1.2.13-SNAPSHOT/axiom-impl-1.2.13-20111225.002331-346.pom
(8 KB at 74.2 KB/sec)
Downloading: http://repository.apache.org/snapshots/org/apache/ws/commons/schema/XmlSchema/1.4.8-SNAPSHOT/maven-metadata.xml
Downloaded: http://repository.apache.org/snapshots/org/apache/ws/commons/schema/XmlSchema/1.4.8-SNAPSHOT/maven-metadata.xml
(283 B at 1.2 KB/sec)
Downloading: http://repository.apache.org/snapshots/org/apache/ws/commons/schema/XmlSchema/1.4.8-SNAPSHOT/XmlSchema-1.4.8-SNAPSHOT.pom
Downloaded: http://repository.apache.org/snapshots/org/apache/ws/commons/schema/XmlSchema/1.4.8-SNAPSHOT/XmlSchema-1.4.8-SNAPSHOT.pom
(18 KB at 142.1 KB/sec)
Downloading: http://repository.apache.org/snapshots/org/apache/neethi/neethi/3.0.2-SNAPSHOT/maven-metadata.xml
Downloaded: http://repository.apache.org/snapshots/org/apache/neethi/neethi/3.0.2-SNAPSHOT/maven-metadata.xml
(2 KB at 13.2 KB/sec)
Downloading: http://repository.apache.org/snapshots/org/apache/neethi/neethi/3.0.2-SNAPSHOT/neethi-3.0.2-20111225.004323-149.pom
Downloaded: http://repository.apache.org/snapshots/org/apache/neethi/neethi/3.0.2-SNAPSHOT/neethi-3.0.2-20111225.004323-149.pom
(14 KB at 133.4 KB/sec)
Downloading: http://repository.apache.org/snapshots/org/apache/woden/woden-api/1.0-SNAPSHOT/maven-metadata.xml
Downloaded: http://repository.apache.org/snapshots/org/apache/woden/woden-api/1.0-SNAPSHOT/maven-metadata.xml
(775 B at 7.2 KB/sec)
Downloading: http://repository.apache.org/snapshots/org/apache/woden/woden-api/1.0-SNAPSHOT/woden-api-1.0-20111229.092015-324.pom
Downloaded: http://repository.apache.org/snapshots/org/apache/woden/woden-api/1.0-SNAPSHOT/woden-api-1.0-20111229.092015-324.pom
(3 KB at 26.0 KB/sec)
Downloading: http://repository.apache.org/snapshots/org/apache/woden/woden/1.0-SNAPSHOT/maven-metadata.xml
Downloaded: http://repository.apache.org/snapshots/org/apache/woden/woden/1.0-SNAPSHOT/maven-metadata.xml
(598 B at 5.1 KB/sec)
Downloading: http://repository.apache.org/snapshots/org/apache/woden/woden/1.0-SNAPSHOT/woden-1.0-20111229.092013-324.pom
Downloaded: http://repository.apache.org/snapshots/org/apache/woden/woden/1.0-SNAPSHOT/woden-1.0-20111229.092013-324.pom
(14 KB at 123.2 KB/sec)
Downloading: http://repository.apache.org/snapshots/org/apache/woden/woden-impl-dom/1.0-SNAPSHOT/maven-metadata.xml
Downloaded: http://repository.apache.org/snapshots/org/apache/woden/woden-impl-dom/1.0-SNAPSHOT/maven-metadata.xml
(780 B at 7.0 KB/sec)
Downloading: http://repository.apache.org/snapshots/org/apache/woden/woden-impl-dom/1.0-SNAPSHOT/woden-impl-dom-1.0-20111229.092022-324.pom
Downloaded: http://repository.apache.org/snapshots/org/apache/woden/woden-impl-dom/1.0-SNAPSHOT/woden-impl-dom-1.0-20111229.092022-324.pom
(5 KB at 38.7 KB/sec)
Downloading: http://repository.apache.org/snapshots/org/apache/woden/woden-impl-commons/1.0-SNAPSHOT/maven-metadata.xml
Downloaded: http://repository.apache.org/snapshots/org/apache/woden/woden-impl-commons/1.0-SNAPSHOT/maven-metadata.xml
(784 B at 6.5 KB/sec)
Downloading: http://repository.apache.org/snapshots/org/apache/woden/woden-impl-commons/1.0-SNAPSHOT/woden-impl-commons-1.0-20111229.092017-324.pom
Downloaded: http://repository.apache.org/snapshots/org/apache/woden/woden-impl-commons/1.0-SNAPSHOT/woden-impl-commons-1.0-20111229.092017-324.pom
(5 KB at 37.4 KB/sec)
Downloading: http://repository.apache.org/snapshots/org/apache/axis2/axis2-kernel/1.7.0-SNAPSHOT/axis2-kernel-1.7.0-20111229.110907-501.jar
Downloading: http://repository.apache.org/snapshots/org/apache/ws/commons/axiom/axiom-api/1.2.13-SNAPSHOT/axiom-api-1.2.13-20111225.002331-348.jar
Downloading: http://repository.apache.org/snapshots/org/apache/ws/commons/axiom/axiom-impl/1.2.13-SNAPSHOT/axiom-impl-1.2.13-20111225.002331-346.jar
Downloading: http://repository.apache.org/snapshots/org/apache/ws/commons/schema/XmlSchema/1.4.8-SNAPSHOT/XmlSchema-1.4.8-SNAPSHOT.jar
Downloading: http://repository.apache.org/snapshots/org/apache/neethi/neethi/3.0.2-SNAPSHOT/neethi-3.0.2-20111225.004323-149.jar
Downloaded: http://repository.apache.org/snapshots/org/apache/ws/commons/schema/XmlSchema/1.4.8-SNAPSHOT/XmlSchema-1.4.8-SNAPSHOT.jar
(146 KB at 94.3 KB/sec)
Downloading: http://repository.apache.org/snapshots/org/apache/woden/woden-api/1.0-SNAPSHOT/woden-api-1.0-20111229.092015-324.jar
Downloaded: http://repository.apache.org/snapshots/org/apache/ws/commons/axiom/axiom-impl/1.2.13-SNAPSHOT/axiom-impl-1.2.13-20111225.002331-346.jar
(153 KB at 96.6 KB/sec)
Downloading: http://repository.apache.org/snapshots/org/apache/woden/woden-impl-dom/1.0-SNAPSHOT/woden-impl-dom-1.0-20111229.092022-324.jar
Downloaded: http://repository.apache.org/snapshots/org/apache/neethi/neethi/3.0.2-SNAPSHOT/neethi-3.0.2-20111225.004323-149.jar
(70 KB at 41.2 KB/sec)
Downloading: http://repository.apache.org/snapshots/org/apache/woden/woden-impl-commons/1.0-SNAPSHOT/woden-impl-commons-1.0-20111229.092017-324.jar
Downloaded: http://repository.apache.org/snapshots/org/apache/ws/commons/axiom/axiom-api/1.2.13-SNAPSHOT/axiom-api-1.2.13-20111225.002331-348.jar
(411 KB at 241.8 KB/sec)
Downloaded: http://repository.apache.org/snapshots/org/apache/axis2/axis2-kernel/1.7.0-SNAPSHOT/axis2-kernel-1.7.0-20111229.110907-501.jar
(1030 KB at 591.1 KB/sec)
Downloaded: http://repository.apache.org/snapshots/org/apache/woden/woden-impl-dom/1.0-SNAPSHOT/woden-impl-dom-1.0-20111229.092022-324.jar
(48 KB at 224.3 KB/sec)
Downloaded: http://repository.apache.org/snapshots/org/apache/woden/woden-impl-commons/1.0-SNAPSHOT/woden-impl-commons-1.0-20111229.092017-324.jar
(179 KB at 855.2 KB/sec)
Downloaded: http://repository.apache.org/snapshots/org/apache/woden/woden-api/1.0-SNAPSHOT/woden-api-1.0-20111229.092015-324.jar
(147 KB at 437.4 KB/sec)
[JENKINS] Archiving <https://builds.apache.org/job/axis2-transports-trunk/ws/transports/pom.xml>
to /home/hudson/hudson/jobs/axis2-transports-trunk/modules/org.apache.axis2$axis2-transports/builds/2011-12-29_13-30-40/archive/org.apache.axis2/axis2-transports/1.7.0-SNAPSHOT/axis2-transports-1.7.0-SNAPSHOT.pom
[INFO] ------------------------------------------------------------------------
[INFO] Reactor Summary:
[INFO] 
[INFO] Apache Axis2 - Transport - Root ................... FAILURE [34.443s]
[INFO] Apache Axis2 - Transport - Base ................... SKIPPED
[INFO] Apache Axis2 - Transport - testkit ................ SKIPPED
[INFO] Apache Axis2 - Transport - HTTP Tests ............. SKIPPED
[INFO] Apache Axis2 - Transport - TCP .................... SKIPPED
[INFO] Apache Axis2 - Transport - UDP .................... SKIPPED
[INFO] Apache Axis2 - Transport - XMPP ................... SKIPPED
[INFO] Apache Axis2 - Transport - Mail ................... SKIPPED
[INFO] Apache Axis2 - Transport - JMS .................... SKIPPED
[INFO] Apache Axis2 - Transport - Sms .................... SKIPPED
[INFO] Apache Axis2 - Transport - All .................... SKIPPED
[INFO] ------------------------------------------------------------------------
[INFO] BUILD FAILURE
[INFO] ------------------------------------------------------------------------
[INFO] Total time: 40.213s
[INFO] Finished at: Thu Dec 29 13:31:31 UTC 2011
[INFO] Final Memory: 10M/155M
[INFO] ------------------------------------------------------------------------
mavenExecutionResult exceptions not empty
message : Internal error: java.lang.NullPointerException
cause : null
Stack trace : 
org.apache.maven.InternalErrorException: Internal error: java.lang.NullPointerException
	at org.apache.maven.lifecycle.internal.BuilderCommon.handleBuildError(BuilderCommon.java:128)
	at org.apache.maven.lifecycle.internal.LifecycleModuleBuilder.buildProject(LifecycleModuleBuilder.java:95)
	at org.apache.maven.lifecycle.internal.LifecycleModuleBuilder.buildProject(LifecycleModuleBuilder.java:59)
	at org.apache.maven.lifecycle.internal.LifecycleStarter.singleThreadedBuild(LifecycleStarter.java:183)
	at org.apache.maven.lifecycle.internal.LifecycleStarter.execute(LifecycleStarter.java:161)
	at org.apache.maven.DefaultMaven.doExecute(DefaultMaven.java:319)
	at org.apache.maven.DefaultMaven.execute(DefaultMaven.java:156)
	at org.jvnet.hudson.maven3.launcher.Maven3Launcher.main(Maven3Launcher.java:79)
	at sun.reflect.NativeMethodAccessorImpl.invoke0(Native Method)
	at sun.reflect.NativeMethodAccessorImpl.invoke(NativeMethodAccessorImpl.java:39)
	at sun.reflect.DelegatingMethodAccessorImpl.invoke(DelegatingMethodAccessorImpl.java:25)
	at java.lang.reflect.Method.invoke(Method.java:592)
	at org.codehaus.plexus.classworlds.launcher.Launcher.launchStandard(Launcher.java:329)
	at org.codehaus.plexus.classworlds.launcher.Launcher.launch(Launcher.java:239)
	at org.jvnet.hudson.maven3.agent.Maven3Main.launch(Maven3Main.java:158)
	at hudson.maven.Maven3Builder.call(Maven3Builder.java:112)
	at hudson.maven.Maven3Builder.call(Maven3Builder.java:70)
	at hudson.remoting.UserRequest.perform(UserRequest.java:118)
	at hudson.remoting.UserRequest.perform(UserRequest.java:48)
	at hudson.remoting.Request$2.run(Request.java:287)
	at java.util.concurrent.Executors$RunnableAdapter.call(Executors.java:417)
	at java.util.concurrent.FutureTask$Sync.innerRun(FutureTask.java:269)
	at java.util.concurrent.FutureTask.run(FutureTask.java:123)
	at java.util.concurrent.ThreadPoolExecutor$Worker.runTask(ThreadPoolExecutor.java:651)
	at java.util.concurrent.ThreadPoolExecutor$Worker.run(ThreadPoolExecutor.java:676)
	at java.lang.Thread.run(Thread.java:595)
Caused by: java.lang.NullPointerException
	at hudson.maven.ExecutedMojo.getMojoClass(ExecutedMojo.java:114)
	at hudson.maven.ExecutedMojo.<init>(ExecutedMojo.java:99)
	at hudson.maven.Maven3Builder$MavenExecutionListener.recordExecutionTime(Maven3Builder.java:524)
	at hudson.maven.Maven3Builder$MavenExecutionListener.recordMojoSucceeded(Maven3Builder.java:493)
	at hudson.maven.Maven3Builder$MavenExecutionListener.forkSucceeded(Maven3Builder.java:601)
	at org.apache.maven.lifecycle.internal.DefaultExecutionEventCatapult.fire(DefaultExecutionEventCatapult.java:97)
	at org.apache.maven.lifecycle.internal.DefaultExecutionEventCatapult.fire(DefaultExecutionEventCatapult.java:42)
	at org.apache.maven.lifecycle.internal.MojoExecutor.executeForkedExecutions(MojoExecutor.java:383)
	at org.apache.maven.lifecycle.internal.MojoExecutor.execute(MojoExecutor.java:199)
	at org.apache.maven.lifecycle.internal.MojoExecutor.execute(MojoExecutor.java:153)
	at org.apache.maven.lifecycle.internal.MojoExecutor.execute(MojoExecutor.java:145)
	at org.apache.maven.lifecycle.internal.LifecycleModuleBuilder.buildProject(LifecycleModuleBuilder.java:84)
	... 24 more
Sending e-mails to: java-dev@axis.apache.org
channel stopped
[locks-and-latches] Releasing all the locks
[locks-and-latches] All the locks released


---------------------------------------------------------------------
To unsubscribe, e-mail: java-dev-unsubscribe@axis.apache.org
For additional commands, e-mail: java-dev-help@axis.apache.org


Mime
View raw message