axis-java-dev mailing list archives

Site index · List index
Message view « Date » · « Thread »
Top « Date » · « Thread »
From Sagara Gunathunga <sagara.gunathu...@gmail.com>
Subject Re: [AXIS2] Build failed in jaxws-integration module
Date Wed, 31 Aug 2011 07:47:59 GMT
Just build successfully on my local machine. surefire reports for
failed tests ?

Thanks !

On Wed, Aug 31, 2011 at 1:10 PM, Ping Liu <pingpinganan@gmail.com> wrote:
> My local build failed on jaxws-integration module.  Not sure if this happens
> to anybody else.
>
> =========================================================================
>
> Results :
>
> Failed tests:
>
> Tests run: 398, Failures: 2, Errors: 0, Skipped: 0
>
> [INFO]
> ------------------------------------------------------------------------
> [INFO] BUILD FAILURE
> [INFO]
> ------------------------------------------------------------------------
> [INFO] Total time: 17:31.201s
> [INFO] Finished at: Wed Aug 31 00:32:15 PDT 2011
> [INFO] Final Memory: 18M/76M
> [INFO]
> ------------------------------------------------------------------------
> [ERROR] Failed to execute goal
> org.apache.maven.plugins:maven-surefire-plugin:2.
> 4.3:test (default-test) on project axis2-jaxws-integration: There are test
> failu
> res.
> [ERROR]



-- 
Sagara Gunathunga

Blog      - http://ssagara.blogspot.com
Web      - http://people.apache.org/~sagara/
LinkedIn - http://www.linkedin.com/in/ssagara

---------------------------------------------------------------------
To unsubscribe, e-mail: java-dev-unsubscribe@axis.apache.org
For additional commands, e-mail: java-dev-help@axis.apache.org


Mime
View raw message