axis-java-dev mailing list archives

Site index · List index
Message view « Date » · « Thread »
Top « Date » · « Thread »
From Andreas Veithen <andreas.veit...@gmail.com>
Subject Re: Build failed in Jenkins: Axis2 #955
Date Tue, 30 Aug 2011 17:38:33 GMT
This is fixed now. The SAAJ implementation in Axis2 is tightly coupled
to the DOOM implementation of the Axiom API and there was a change in
DOOM that temporarily broke the SAAJ module.

Andreas

On Tue, Aug 30, 2011 at 18:41, Ping Liu <pingpinganan@gmail.com> wrote:
> Thanks Sagara to bring this up.  I couldn't do my local build as well due to
> SAAJ module failure.
>
> Thanks!
>
> Ping
>
>
> On Tue, Aug 30, 2011 at 2:39 AM, Sagara Gunathunga
> <sagara.gunathunga@gmail.com> wrote:
>>
>> Any clue on SAAJ module failures ?
>>
>> Thanks !
>>
>> On Tue, Aug 30, 2011 at 2:38 PM, Apache Jenkins Server
>> <jenkins@builds.apache.org> wrote:
>> > See <https://builds.apache.org/job/Axis2/955/changes>
>> >
>> > Changes:
>> >
>> > [sagara] Modified Map schema generation so that null values can be
>> > passed.
>> >
>> > ------------------------------------------
>> > [...truncated 4814 lines...]
>> >
>> > [INFO] --- maven-assembly-plugin:2.2-beta-5:single
>> > (source-release-assembly) @ axis2-jaxbri ---
>> > mojo forkStarted
>> > org.apache.maven.plugins:maven-source-plugin:2.0.4(attach-sources)
>> > mojo forkSucceeded
>> > org.apache.maven.plugins:maven-source-plugin:2.0.4(attach-sources)
>> > ignoring exception during new ExecutedMojo null
>> > [INFO]
>> > [INFO] --- maven-source-plugin:2.0.4:jar (attach-sources) @ axis2-jaxbri
>> > ---
>> > [INFO] Building jar:
>> > <https://builds.apache.org/job/Axis2/ws/axis2/modules/jaxbri/target/axis2-jaxbri-1.7.0-SNAPSHOT-sources.jar>
>> > [INFO]
>> > [INFO] --- maven-javadoc-plugin:2.5:jar (attach-javadocs) @ axis2-jaxbri
>> > ---
>> > Loading source files for package org.apache.axis2.jaxbri...
>> > Constructing Javadoc information...
>> > Standard Doclet version 1.5.0_22
>> > Building tree for all the packages and classes...
>> > Generating
>> > <https://builds.apache.org/job/Axis2/ws/axis2/modules/jaxbri/target/apidocs/org/apache/axis2/jaxbri//CodeGenerationUtility.html...>
>> > Generating
>> > <https://builds.apache.org/job/Axis2/ws/axis2/modules/jaxbri/target/apidocs/org/apache/axis2/jaxbri//DocLitBareJaxbSchemaGenerator.html...>
>> > Generating
>> > <https://builds.apache.org/job/Axis2/ws/axis2/modules/jaxbri/target/apidocs/org/apache/axis2/jaxbri//JaxbSchemaGenerator.html...>
>> > Generating
>> > <https://builds.apache.org/job/Axis2/ws/axis2/modules/jaxbri/target/apidocs/org/apache/axis2/jaxbri//package-frame.html...>
>> > Generating
>> > <https://builds.apache.org/job/Axis2/ws/axis2/modules/jaxbri/target/apidocs/org/apache/axis2/jaxbri//package-summary.html...>
>> > Generating
>> > <https://builds.apache.org/job/Axis2/ws/axis2/modules/jaxbri/target/apidocs/org/apache/axis2/jaxbri//package-tree.html...>
>> > Generating
>> > <https://builds.apache.org/job/Axis2/ws/axis2/modules/jaxbri/target/apidocs/constant-values.html...>
>> > Generating
>> > <https://builds.apache.org/job/Axis2/ws/axis2/modules/jaxbri/target/apidocs/org/apache/axis2/jaxbri/class-use//DocLitBareJaxbSchemaGenerator.html...>
>> > Generating
>> > <https://builds.apache.org/job/Axis2/ws/axis2/modules/jaxbri/target/apidocs/org/apache/axis2/jaxbri/class-use//JaxbSchemaGenerator.html...>
>> > Generating
>> > <https://builds.apache.org/job/Axis2/ws/axis2/modules/jaxbri/target/apidocs/org/apache/axis2/jaxbri/class-use//CodeGenerationUtility.html...>
>> > Generating
>> > <https://builds.apache.org/job/Axis2/ws/axis2/modules/jaxbri/target/apidocs/org/apache/axis2/jaxbri//package-use.html...>
>> > Building index for all the packages and classes...
>> > Generating
>> > <https://builds.apache.org/job/Axis2/ws/axis2/modules/jaxbri/target/apidocs/overview-tree.html...>
>> > Generating
>> > <https://builds.apache.org/job/Axis2/ws/axis2/modules/jaxbri/target/apidocs/index-all.html...>
>> > Generating
>> > <https://builds.apache.org/job/Axis2/ws/axis2/modules/jaxbri/target/apidocs/deprecated-list.html...>
>> > Building index for all classes...
>> > Generating
>> > <https://builds.apache.org/job/Axis2/ws/axis2/modules/jaxbri/target/apidocs/allclasses-frame.html...>
>> > Generating
>> > <https://builds.apache.org/job/Axis2/ws/axis2/modules/jaxbri/target/apidocs/allclasses-noframe.html...>
>> > Generating
>> > <https://builds.apache.org/job/Axis2/ws/axis2/modules/jaxbri/target/apidocs/index.html...>
>> > Generating
>> > <https://builds.apache.org/job/Axis2/ws/axis2/modules/jaxbri/target/apidocs/help-doc.html...>
>> > Generating
>> > <https://builds.apache.org/job/Axis2/ws/axis2/modules/jaxbri/target/apidocs/stylesheet.css...>
>> > [INFO] Building jar:
>> > <https://builds.apache.org/job/Axis2/ws/axis2/modules/jaxbri/target/axis2-jaxbri-1.7.0-SNAPSHOT-javadoc.jar>
>> > [INFO]
>> > [INFO] --- maven-gpg-plugin:1.1:sign (default) @ axis2-jaxbri ---
>> > [INFO] [INFO] Installing
>> > <https://builds.apache.org/job/Axis2/ws/axis2/modules/jaxbri/target/axis2-jaxbri-1.7.0-SNAPSHOT.jar>
>> > to
>> > <https://builds.apache.org/job/Axis2/ws/.repository/org/apache/axis2/axis2-jaxbri/1.7.0-SNAPSHOT/axis2-jaxbri-1.7.0-SNAPSHOT.jar>
>> > [INFO] Installing
>> > <https://builds.apache.org/job/Axis2/ws/axis2/modules/jaxbri/pom.xml>
to
>> > <https://builds.apache.org/job/Axis2/ws/.repository/org/apache/axis2/axis2-jaxbri/1.7.0-SNAPSHOT/axis2-jaxbri-1.7.0-SNAPSHOT.pom>
>> >
>> > [INFO] --- maven-install-plugin:2.2:install (default-install) @
>> > axis2-jaxbri ---
>> > [INFO] Installing
>> > <https://builds.apache.org/job/Axis2/ws/axis2/modules/jaxbri/target/axis2-jaxbri-1.7.0-SNAPSHOT-sources.jar>
>> > to
>> > <https://builds.apache.org/job/Axis2/ws/.repository/org/apache/axis2/axis2-jaxbri/1.7.0-SNAPSHOT/axis2-jaxbri-1.7.0-SNAPSHOT-sources.jar>
>> > [INFO] Installing
>> > <https://builds.apache.org/job/Axis2/ws/axis2/modules/jaxbri/target/axis2-jaxbri-1.7.0-SNAPSHOT-javadoc.jar>
>> > to
>> > <https://builds.apache.org/job/Axis2/ws/.repository/org/apache/axis2/axis2-jaxbri/1.7.0-SNAPSHOT/axis2-jaxbri-1.7.0-SNAPSHOT-javadoc.jar>
>> > [INFO] Downloading:
>> > https://repository.apache.org/content/repositories/snapshots/org/apache/axis2/axis2-jaxbri/1.7.0-SNAPSHOT/maven-metadata.xml
>> >
>> > [INFO] --- maven-deploy-plugin:2.5:deploy (default-deploy) @
>> > axis2-jaxbri ---
>> > Downloaded:
>> > https://repository.apache.org/content/repositories/snapshots/org/apache/axis2/axis2-jaxbri/1.7.0-SNAPSHOT/maven-metadata.xml
>> > (2 KB at 12.6 KB/sec)
>> > Uploading:
>> > https://repository.apache.org/content/repositories/snapshots/org/apache/axis2/axis2-jaxbri/1.7.0-SNAPSHOT/axis2-jaxbri-1.7.0-20110830.090800-253.jar
>> > Uploaded:
>> > https://repository.apache.org/content/repositories/snapshots/org/apache/axis2/axis2-jaxbri/1.7.0-SNAPSHOT/axis2-jaxbri-1.7.0-20110830.090800-253.jar
>> > (29 KB at 305.0 KB/sec)
>> > Uploading:
>> > https://repository.apache.org/content/repositories/snapshots/org/apache/axis2/axis2-jaxbri/1.7.0-SNAPSHOT/axis2-jaxbri-1.7.0-20110830.090800-253.pom
>> > Uploaded:
>> > https://repository.apache.org/content/repositories/snapshots/org/apache/axis2/axis2-jaxbri/1.7.0-SNAPSHOT/axis2-jaxbri-1.7.0-20110830.090800-253.pom
>> > (9 KB at 212.1 KB/sec)
>> > Downloading:
>> > https://repository.apache.org/content/repositories/snapshots/org/apache/axis2/axis2-jaxbri/maven-metadata.xml
>> > Downloaded:
>> > https://repository.apache.org/content/repositories/snapshots/org/apache/axis2/axis2-jaxbri/maven-metadata.xml
>> > (640 B at 4.4 KB/sec)
>> > Uploading:
>> > https://repository.apache.org/content/repositories/snapshots/org/apache/axis2/axis2-jaxbri/1.7.0-SNAPSHOT/maven-metadata.xml
>> > Uploaded:
>> > https://repository.apache.org/content/repositories/snapshots/org/apache/axis2/axis2-jaxbri/1.7.0-SNAPSHOT/maven-metadata.xml
>> > (2 KB at 24.2 KB/sec)
>> > Uploading:
>> > https://repository.apache.org/content/repositories/snapshots/org/apache/axis2/axis2-jaxbri/maven-metadata.xml
>> > Uploaded:
>> > https://repository.apache.org/content/repositories/snapshots/org/apache/axis2/axis2-jaxbri/maven-metadata.xml
>> > (640 B at 8.7 KB/sec)
>> > Uploading:
>> > https://repository.apache.org/content/repositories/snapshots/org/apache/axis2/axis2-jaxbri/1.7.0-SNAPSHOT/axis2-jaxbri-1.7.0-20110830.090800-253-sources.jar
>> > Uploaded:
>> > https://repository.apache.org/content/repositories/snapshots/org/apache/axis2/axis2-jaxbri/1.7.0-SNAPSHOT/axis2-jaxbri-1.7.0-20110830.090800-253-sources.jar
>> > (18 KB at 331.0 KB/sec)
>> > Uploading:
>> > https://repository.apache.org/content/repositories/snapshots/org/apache/axis2/axis2-jaxbri/1.7.0-SNAPSHOT/maven-metadata.xml
>> > Uploaded:
>> > https://repository.apache.org/content/repositories/snapshots/org/apache/axis2/axis2-jaxbri/1.7.0-SNAPSHOT/maven-metadata.xml
>> > (2 KB at 24.7 KB/sec)
>> > Uploading:
>> > https://repository.apache.org/content/repositories/snapshots/org/apache/axis2/axis2-jaxbri/1.7.0-SNAPSHOT/axis2-jaxbri-1.7.0-20110830.090800-253-javadoc.jar
>> > Uploaded:
>> > https://repository.apache.org/content/repositories/snapshots/org/apache/axis2/axis2-jaxbri/1.7.0-SNAPSHOT/axis2-jaxbri-1.7.0-20110830.090800-253-javadoc.jar
>> > (43 KB at 449.7 KB/sec)
>> > Uploading:
>> > https://repository.apache.org/content/repositories/snapshots/org/apache/axis2/axis2-jaxbri/1.7.0-SNAPSHOT/maven-metadata.xml
>> > Uploaded:
>> > https://repository.apache.org/content/repositories/snapshots/org/apache/axis2/axis2-jaxbri/1.7.0-SNAPSHOT/maven-metadata.xml
>> > (2 KB at 25.3 KB/sec)
>> > projectSucceeded org.apache.axis2:axis2-jaxbri:1.7.0-SNAPSHOT
>> > [JENKINS] Archiving
>> > <https://builds.apache.org/job/Axis2/ws/axis2/modules/jaxbri/pom.xml>
to
>> > /home/hudson/hudson/jobs/Axis2/modules/org.apache.axis2$axis2-jaxbri/builds/2011-08-30_09-02-39/archive/org.apache.axis2/axis2-jaxbri/1.7.0-SNAPSHOT/axis2-jaxbri-1.7.0-SNAPSHOT.pom
>> > [JENKINS] Archiving
>> > <https://builds.apache.org/job/Axis2/ws/axis2/modules/jaxbri/target/axis2-jaxbri-1.7.0-SNAPSHOT.jar>
>> > to
>> > /home/hudson/hudson/jobs/Axis2/modules/org.apache.axis2$axis2-jaxbri/builds/2011-08-30_09-02-39/archive/org.apache.axis2/axis2-jaxbri/1.7.0-20110830.090800-253/axis2-jaxbri-1.7.0-20110830.090800-253.jar
>> > [JENKINS] Archiving
>> > <https://builds.apache.org/job/Axis2/ws/axis2/modules/jaxbri/target/axis2-jaxbri-1.7.0-SNAPSHOT-sources.jar>
>> > to
>> > /home/hudson/hudson/jobs/Axis2/modules/org.apache.axis2$axis2-jaxbri/builds/2011-08-30_09-02-39/archive/org.apache.axis2/axis2-jaxbri/1.7.0-20110830.090800-253/axis2-jaxbri-1.7.0-20110830.090800-253-sources.jar
>> > [JENKINS] Archiving
>> > <https://builds.apache.org/job/Axis2/ws/axis2/modules/jaxbri/target/axis2-jaxbri-1.7.0-SNAPSHOT-javadoc.jar>
>> > to
>> > /home/hudson/hudson/jobs/Axis2/modules/org.apache.axis2$axis2-jaxbri/builds/2011-08-30_09-02-39/archive/org.apache.axis2/axis2-jaxbri/1.7.0-20110830.090800-253/axis2-jaxbri-1.7.0-20110830.090800-253-javadoc.jar
>> > [INFO]
>> > [INFO]
>> > ------------------------------------------------------------------------
>> > [INFO] Building Apache Axis2 - SAAJ 1.7.0-SNAPSHOT
>> > [INFO]
>> > ------------------------------------------------------------------------
>> > [INFO] [INFO] Deleting directory
>> > <https://builds.apache.org/job/Axis2/ws/axis2/modules/saaj/target>
>> >
>> > [INFO] --- maven-clean-plugin:2.2:clean (default-clean) @ axis2-saaj ---
>> > [INFO]
>> > [INFO] --- maven-remote-resources-plugin:1.1:process (default) @
>> > axis2-saaj ---
>> > [INFO] [INFO] Using 'UTF-8' encoding to copy filtered resources.
>> > [INFO] Copying 4 resources
>> >
>> > [INFO] --- maven-resources-plugin:2.4.2:resources (default-resources) @
>> > axis2-saaj ---
>> > [INFO] Copying 2 resources
>> > [INFO]
>> > [INFO] --- maven-compiler-plugin:2.3.1:compile (default-compile) @
>> > axis2-saaj ---
>> > [INFO] Compiling 27 source files to
>> > <https://builds.apache.org/job/Axis2/ws/axis2/modules/saaj/target/classes>
>> > [INFO] -------------------------------------------------------------
>> > [ERROR] COMPILATION ERROR :
>> > [INFO] -------------------------------------------------------------
>> > [ERROR]
>> > <https://builds.apache.org/job/Axis2/ws/axis2/modules/saaj/src/org/apache/axis2/saaj/SOAPHeaderImpl.java>:[25,36]
>> > cannot find symbol
>> > symbol  : class NamespaceImpl
>> > location: package org.apache.axiom.om.impl.dom
>> >
>> > [ERROR]
>> > <https://builds.apache.org/job/Axis2/ws/axis2/modules/saaj/src/org/apache/axis2/saaj/SOAPBodyImpl.java>:[26,36]
>> > cannot find symbol
>> > symbol  : class NamespaceImpl
>> > location: package org.apache.axiom.om.impl.dom
>> >
>> > [ERROR]
>> > <https://builds.apache.org/job/Axis2/ws/axis2/modules/saaj/src/org/apache/axis2/saaj/SOAPHeaderImpl.java>:[85,29]
>> > cannot find symbol
>> > symbol  : class NamespaceImpl
>> > location: class org.apache.axis2.saaj.SOAPHeaderImpl
>> >
>> > [ERROR]
>> > <https://builds.apache.org/job/Axis2/ws/axis2/modules/saaj/src/org/apache/axis2/saaj/SOAPHeaderImpl.java>:[112,29]
>> > cannot find symbol
>> > symbol  : class NamespaceImpl
>> > location: class org.apache.axis2.saaj.SOAPHeaderImpl
>> >
>> > [ERROR]
>> > <https://builds.apache.org/job/Axis2/ws/axis2/modules/saaj/src/org/apache/axis2/saaj/SOAPHeaderImpl.java>:[134,29]
>> > cannot find symbol
>> > symbol  : class NamespaceImpl
>> > location: class org.apache.axis2.saaj.SOAPHeaderImpl
>> >
>> > [ERROR]
>> > <https://builds.apache.org/job/Axis2/ws/axis2/modules/saaj/src/org/apache/axis2/saaj/SOAPHeaderImpl.java>:[175,29]
>> > cannot find symbol
>> > symbol  : class NamespaceImpl
>> > location: class org.apache.axis2.saaj.SOAPHeaderImpl
>> >
>> > [ERROR]
>> > <https://builds.apache.org/job/Axis2/ws/axis2/modules/saaj/src/org/apache/axis2/saaj/SOAPHeaderImpl.java>:[302,29]
>> > cannot find symbol
>> > symbol  : class NamespaceImpl
>> > location: class org.apache.axis2.saaj.SOAPHeaderImpl
>> > mojoFailed
>> > org.apache.maven.plugins:maven-compiler-plugin:2.3.1(default-compile)
>> > [ERROR]
>> > <https://builds.apache.org/job/Axis2/ws/axis2/modules/saaj/src/org/apache/axis2/saaj/SOAPHeaderImpl.java>:[333,40]
>> > cannot find symbol
>> > symbol  : class NamespaceImpl
>> > location: class org.apache.axis2.saaj.SOAPHeaderImpl
>> >
>> > [ERROR]
>> > <https://builds.apache.org/job/Axis2/ws/axis2/modules/saaj/src/org/apache/axis2/saaj/SOAPBodyImpl.java>:[442,8]
>> > cannot find symbol
>> > symbol  : class NamespaceImpl
>> > location: class org.apache.axis2.saaj.SOAPBodyImpl
>> >
>> > [ERROR]
>> > <https://builds.apache.org/job/Axis2/ws/axis2/modules/saaj/src/org/apache/axis2/saaj/SOAPBodyImpl.java>:[446,21]
>> > cannot find symbol
>> > symbol  : class NamespaceImpl
>> > location: class org.apache.axis2.saaj.SOAPBodyImpl
>> >
>> > [ERROR]
>> > <https://builds.apache.org/job/Axis2/ws/axis2/modules/saaj/src/org/apache/axis2/saaj/SOAPBodyImpl.java>:[459,25]
>> > cannot find symbol
>> > symbol  : class NamespaceImpl
>> > location: class org.apache.axis2.saaj.SOAPBodyImpl
>> >
>> > [ERROR]
>> > <https://builds.apache.org/job/Axis2/ws/axis2/modules/saaj/src/org/apache/axis2/saaj/SOAPBodyImpl.java>:[462,29]
>> > cannot find symbol
>> > symbol  : class NamespaceImpl
>> > location: class org.apache.axis2.saaj.SOAPBodyImpl
>> >
>> >
>> > [ERROR]
>> > <https://builds.apache.org/job/Axis2/ws/axis2/modules/saaj/src/org/apache/axis2/saaj/SOAPBodyImpl.java>:[464,29]
>> > cannot find symbol
>> > symbol  : class NamespaceImpl
>> > location: class org.apache.axis2.saaj.SOAPBodyImpl
>> >
>> > [INFO] 13 errors
>> > [INFO] -------------------------------------------------------------
>> > projectFailed org.apache.axis2:axis2-saaj:1.7.0-SNAPSHOT
>> > [JENKINS] Archiving
>> > <https://builds.apache.org/job/Axis2/ws/axis2/modules/saaj/pom.xml> to
>> > /home/hudson/hudson/jobs/Axis2/modules/org.apache.axis2$axis2-saaj/builds/2011-08-30_09-02-39/archive/org.apache.axis2/axis2-saaj/1.7.0-SNAPSHOT/axis2-saaj-1.7.0-SNAPSHOT.pom
>> > sessionEnded
>> > [INFO]
>> > ------------------------------------------------------------------------
>> > [INFO] Reactor Summary:
>> > [INFO]
>> > [INFO] Apache Axis2 - Parent ............................. SUCCESS
>> > [7.971s]
>> > [INFO] Apache Axis2 - Resource bundle .................... SUCCESS
>> > [8.996s]
>> > [INFO] Apache Axis2 - Kernel ............................. SUCCESS
>> > [31.758s]
>> > [INFO] Apache Axis2 - Data Binding ....................... SUCCESS
>> > [13.620s]
>> > [INFO] Apache Axis2 - Transport - Local .................. SUCCESS
>> > [6.362s]
>> > [INFO] Apache Axis2 - Transport - HTTP ................... SUCCESS
>> > [7.717s]
>> > [INFO] Apache Axis2 - Code Generation .................... SUCCESS
>> > [40.276s]
>> > [INFO] Apache Axis2 - ADB Codegen ........................ SUCCESS
>> > [24.387s]
>> > [INFO] Apache Axis2 - Addressing ......................... SUCCESS
>> > [6.762s]
>> > [INFO] Apache Axis2 - Java2WSDL .......................... SUCCESS
>> > [9.893s]
>> > [INFO] Apache Axis2 - tool - Repository Maven Plugin ..... SUCCESS
>> > [7.059s]
>> > [INFO] Apache Axis2 - Fast Infoset ....................... SUCCESS
>> > [13.993s]
>> > [INFO] Apache Axis2 - Clustering ......................... SUCCESS
>> > [1:31.265s]
>> > [INFO] Apache Axis2 - Scripting .......................... SUCCESS
>> > [5.695s]
>> > [INFO] Apache Axis2 - JAXB-RI Data Binding ............... SUCCESS
>> > [9.305s]
>> > [INFO] Apache Axis2 - SAAJ ............................... FAILURE
>> > [1.669s]
>> > [INFO] Apache Axis2 - Metadata ........................... SKIPPED
>> > [INFO] Apache Axis2 - JAXWS .............................. SKIPPED
>> > [INFO] Apache Axis2 - Test Utilities ..................... SKIPPED
>> > [INFO] Apache Axis2 - XMLBeans Data Binding .............. SKIPPED
>> > [INFO] Apache Axis2 - tool - WSDL2Code Maven Plugin ...... SKIPPED
>> > [INFO] Apache Axis2 - JAXWS Integration Tests ............ SKIPPED
>> > [INFO] Apache Axis2 - JiBX Data Binding .................. SKIPPED
>> > [INFO] Apache Axis2 - JSON ............................... SKIPPED
>> > [INFO] Apache Axis2 - MTOM Policy ........................ SKIPPED
>> > [INFO] Apache Axis2 - spring ............................. SKIPPED
>> > [INFO] Apache Axis2 - OSGi Integration ................... SKIPPED
>> > [INFO] Apache Axis2 - Integration ........................ SKIPPED
>> > [INFO] Apache Axis2 - MEX ................................ SKIPPED
>> > [INFO] Apache Axis2 - MTOM Policy module ................. SKIPPED
>> > [INFO] Apache Axis2 - Ping ............................... SKIPPED
>> > [INFO] Apache Axis2 - Version Service .................... SKIPPED
>> > [INFO] Apache Axis2 - SOAP Monitor Servlet ............... SKIPPED
>> > [INFO] Apache Axis2 - SOAP Monitor Module ................ SKIPPED
>> > [INFO] Apache Axis2 - tool - AAR Maven Plugin ............ SKIPPED
>> > [INFO] Apache Axis2 - tool - Ant Plugin .................. SKIPPED
>> > [INFO] Apache Axis2 - tool - Eclipse Codegen Plugin ...... SKIPPED
>> > [INFO] Apache Axis2 - tool - Eclipse service Plugin ...... SKIPPED
>> > [INFO] Apache Axis2 - tool - Intellij IDEA Plugin ........ SKIPPED
>> > [INFO] Apache Axis2 - tool - Java2WSDL Maven Plugin ...... SKIPPED
>> > [INFO] Apache Axis2 - tool - MAR Maven Plugin ............ SKIPPED
>> > [INFO] Apache Axis2 - CORBA .............................. SKIPPED
>> > [INFO] Apache Axis2 - JAXWS (mar) ........................ SKIPPED
>> > [INFO] Apache Axis2 - Web Application module ............. SKIPPED
>> > [INFO] Apache Axis2 - Distribution ....................... SKIPPED
>> > [INFO] Apache Axis2 - Root ............................... SKIPPED
>> > [INFO]
>> > ------------------------------------------------------------------------
>> > [INFO] BUILD FAILURE
>> > [INFO]
>> > ------------------------------------------------------------------------
>> > [INFO] Total time: 5:24.609s
>> > [INFO] Finished at: Tue Aug 30 09:08:07 GMT 2011
>> > [INFO] Final Memory: 58M/200M
>> > [INFO]
>> > ------------------------------------------------------------------------
>> > Waiting for Jenkins to finish collecting data
>> > mavenExecutionResult exceptions not empty
>> > message : Failed to execute goal
>> > org.apache.maven.plugins:maven-compiler-plugin:2.3.1:compile
>> > (default-compile) on project axis2-saaj: Compilation failure
>> > cause : Compilation failure
>> > Stack trace :
>> > org.apache.maven.lifecycle.LifecycleExecutionException: Failed to
>> > execute goal org.apache.maven.plugins:maven-compiler-plugin:2.3.1:compile
>> > (default-compile) on project axis2-saaj: Compilation failure
>> >        at
>> > org.apache.maven.lifecycle.internal.MojoExecutor.execute(MojoExecutor.java:213)
>> >        at
>> > org.apache.maven.lifecycle.internal.MojoExecutor.execute(MojoExecutor.java:153)
>> >        at
>> > org.apache.maven.lifecycle.internal.MojoExecutor.execute(MojoExecutor.java:145)
>> >        at
>> > org.apache.maven.lifecycle.internal.LifecycleModuleBuilder.buildProject(LifecycleModuleBuilder.java:84)
>> >        at
>> > org.apache.maven.lifecycle.internal.LifecycleModuleBuilder.buildProject(LifecycleModuleBuilder.java:59)
>> >        at
>> > org.apache.maven.lifecycle.internal.LifecycleStarter.singleThreadedBuild(LifecycleStarter.java:183)
>> >        at
>> > org.apache.maven.lifecycle.internal.LifecycleStarter.execute(LifecycleStarter.java:161)
>> >        at org.apache.maven.DefaultMaven.doExecute(DefaultMaven.java:319)
>> >        at org.apache.maven.DefaultMaven.execute(DefaultMaven.java:156)
>> >        at
>> > org.jvnet.hudson.maven3.launcher.Maven3Launcher.main(Maven3Launcher.java:79)
>> >        at sun.reflect.NativeMethodAccessorImpl.invoke0(Native Method)
>> >        at
>> > sun.reflect.NativeMethodAccessorImpl.invoke(NativeMethodAccessorImpl.java:39)
>> >        at
>> > sun.reflect.DelegatingMethodAccessorImpl.invoke(DelegatingMethodAccessorImpl.java:25)
>> >        at java.lang.reflect.Method.invoke(Method.java:592)
>> >        at
>> > org.codehaus.plexus.classworlds.launcher.Launcher.launchStandard(Launcher.java:329)
>> >        at
>> > org.codehaus.plexus.classworlds.launcher.Launcher.launch(Launcher.java:239)
>> >        at
>> > org.jvnet.hudson.maven3.agent.Maven3Main.launch(Maven3Main.java:158)
>> >        at hudson.maven.Maven3Builder.call(Maven3Builder.java:121)
>> >        at hudson.maven.Maven3Builder.call(Maven3Builder.java:73)
>> >        at hudson.remoting.UserRequest.perform(UserRequest.java:118)
>> >        at hudson.remoting.UserRequest.perform(UserRequest.java:48)
>> >        at hudson.remoting.Request$2.run(Request.java:287)
>> >        at
>> > java.util.concurrent.Executors$RunnableAdapter.call(Executors.java:417)
>> >        at
>> > java.util.concurrent.FutureTask$Sync.innerRun(FutureTask.java:269)
>> >        at java.util.concurrent.FutureTask.run(FutureTask.java:123)
>> >        at
>> > java.util.concurrent.ThreadPoolExecutor$Worker.runTask(ThreadPoolExecutor.java:651)
>> >        at
>> > java.util.concurrent.ThreadPoolExecutor$Worker.run(ThreadPoolExecutor.java:676)
>> >        at java.lang.Thread.run(Thread.java:595)
>> > Caused by: org.apache.maven.plugin.CompilationFailureException:
>> > Compilation failure
>> >        at
>> > org.apache.maven.plugin.AbstractCompilerMojo.execute(AbstractCompilerMojo.java:656)
>> >        at
>> > org.apache.maven.plugin.CompilerMojo.execute(CompilerMojo.java:128)
>> >        at
>> > org.apache.maven.plugin.DefaultBuildPluginManager.executeMojo(DefaultBuildPluginManager.java:101)
>> >        at
>> > org.apache.maven.lifecycle.internal.MojoExecutor.execute(MojoExecutor.java:209)
>> >        ... 27 more
>> > Sending e-mails to: java-dev@axis.apache.org
>> > channel stopped
>> > [locks-and-latches] Releasing all the locks
>> > [locks-and-latches] All the locks released
>> >
>> >
>>
>>
>>
>> --
>> Sagara Gunathunga
>>
>> Blog      - http://ssagara.blogspot.com
>> Web      - http://people.apache.org/~sagara/
>> LinkedIn - http://www.linkedin.com/in/ssagara
>>
>> ---------------------------------------------------------------------
>> To unsubscribe, e-mail: java-dev-unsubscribe@axis.apache.org
>> For additional commands, e-mail: java-dev-help@axis.apache.org
>>
>
>

---------------------------------------------------------------------
To unsubscribe, e-mail: java-dev-unsubscribe@axis.apache.org
For additional commands, e-mail: java-dev-help@axis.apache.org


Mime
View raw message