axis-java-dev mailing list archives

Site index · List index
Message view « Date » · « Thread »
Top « Date » · « Thread »
From Apache Hudson Server <hud...@hudson.apache.org>
Subject Build failed in Jenkins: Axis2 #726
Date Sun, 03 Apr 2011 12:01:40 GMT
See <https://hudson.apache.org/hudson/job/Axis2/726/changes>

Changes:

[veithen] jaxws-samples is meant to build a WAR, so changed the packaging type to war (otherwise
it will build a JAR that is not deployable). Also changed the POM to use maven-dependency-plugin
to copy the modules.

[veithen] Fixed another version number in the JAX-WS samples.

[veithen] Set up an endorsed directory so that the distribution works properly on Java 1.6.
Note that the Unix/Windows scripts already add that directory to the java command line. Therefore
we only need to add the right JARs to that directory.

[veithen] Fixed a couple of samples.

------------------------------------------
[...truncated 12528 lines...]
Uploading: https://repository.apache.org/content/repositories/snapshots/org/apache/axis2/axis2-webapp/1.7.0-SNAPSHOT/maven-metadata.xml
Uploaded: https://repository.apache.org/content/repositories/snapshots/org/apache/axis2/axis2-webapp/1.7.0-SNAPSHOT/maven-metadata.xml
(2 KB at 7.7 KB/sec)
Uploading: https://repository.apache.org/content/repositories/snapshots/org/apache/axis2/axis2-webapp/maven-metadata.xml
Uploaded: https://repository.apache.org/content/repositories/snapshots/org/apache/axis2/axis2-webapp/maven-metadata.xml
(600 B at 3.0 KB/sec)
Uploading: https://repository.apache.org/content/repositories/snapshots/org/apache/axis2/axis2-webapp/1.7.0-SNAPSHOT/axis2-webapp-1.7.0-20110403.115335-40-sources.jar
Uploaded: https://repository.apache.org/content/repositories/snapshots/org/apache/axis2/axis2-webapp/1.7.0-SNAPSHOT/axis2-webapp-1.7.0-20110403.115335-40-sources.jar
(14 KB at 91.7 KB/sec)
Uploading: https://repository.apache.org/content/repositories/snapshots/org/apache/axis2/axis2-webapp/1.7.0-SNAPSHOT/maven-metadata.xml
Uploaded: https://repository.apache.org/content/repositories/snapshots/org/apache/axis2/axis2-webapp/1.7.0-SNAPSHOT/maven-metadata.xml
(2 KB at 7.5 KB/sec)
Uploading: https://repository.apache.org/content/repositories/snapshots/org/apache/axis2/axis2-webapp/1.7.0-SNAPSHOT/axis2-webapp-1.7.0-20110403.115335-40-javadoc.jar
Uploaded: https://repository.apache.org/content/repositories/snapshots/org/apache/axis2/axis2-webapp/1.7.0-SNAPSHOT/axis2-webapp-1.7.0-20110403.115335-40-javadoc.jar
(50 KB at 269.7 KB/sec)
Uploading: https://repository.apache.org/content/repositories/snapshots/org/apache/axis2/axis2-webapp/1.7.0-SNAPSHOT/maven-metadata.xml
Uploaded: https://repository.apache.org/content/repositories/snapshots/org/apache/axis2/axis2-webapp/1.7.0-SNAPSHOT/maven-metadata.xml
(2 KB at 7.6 KB/sec)
projectSucceeded org.apache.axis2:axis2-webapp:1.7.0-SNAPSHOT
[JENKINS] Archiving <https://hudson.apache.org/hudson/job/Axis2/ws/axis2/modules/webapp/pom.xml>
to /home/hudson/hudson/jobs/Axis2/modules/org.apache.axis2$axis2-webapp/builds/2011-04-03_11-02-36/archive/org.apache.axis2/axis2-webapp/1.7.0-SNAPSHOT/pom.xml
[JENKINS] Archiving <https://hudson.apache.org/hudson/job/Axis2/ws/axis2/modules/webapp/target/axis2.war>
to /home/hudson/hudson/jobs/Axis2/modules/org.apache.axis2$axis2-webapp/builds/2011-04-03_11-02-36/archive/org.apache.axis2/axis2-webapp/1.7.0-20110403.115335-40/axis2.war
[JENKINS] Archiving <https://hudson.apache.org/hudson/job/Axis2/ws/axis2/modules/webapp/target/axis2-1.7.0-SNAPSHOT-sources.jar>
to /home/hudson/hudson/jobs/Axis2/modules/org.apache.axis2$axis2-webapp/builds/2011-04-03_11-02-36/archive/org.apache.axis2/axis2-webapp/1.7.0-20110403.115335-40/axis2-1.7.0-SNAPSHOT-sources.jar
[JENKINS] Archiving <https://hudson.apache.org/hudson/job/Axis2/ws/axis2/modules/webapp/target/axis2-1.7.0-SNAPSHOT-javadoc.jar>
to /home/hudson/hudson/jobs/Axis2/modules/org.apache.axis2$axis2-webapp/builds/2011-04-03_11-02-36/archive/org.apache.axis2/axis2-webapp/1.7.0-20110403.115335-40/axis2-1.7.0-SNAPSHOT-javadoc.jar
[INFO]                                                                         
[INFO] ------------------------------------------------------------------------
[INFO] Building Apache Axis2 - Distribution 1.7.0-SNAPSHOT
[INFO] ------------------------------------------------------------------------
[INFO] Deleting directory <https://hudson.apache.org/hudson/job/Axis2/ws/axis2/modules/distribution/target>
[INFO] 
[INFO] --- maven-clean-plugin:2.2:clean (default-clean) @ distribution ---
[INFO] 
[INFO] --- maven-remote-resources-plugin:1.1:process (default) @ distribution ---
[INFO] 
[INFO] --- gmaven-plugin:1.2:execute (generate-timestamp) @ distribution ---
[INFO] [INFO] Adding soapmonitor-1.7.0-SNAPSHOT.mar
[INFO] Adding ping-1.7.0-SNAPSHOT.mar
[INFO] Adding scripting-1.7.0-SNAPSHOT.mar
[INFO] Adding addressing-1.7.0-SNAPSHOT.mar
[INFO] Adding mtompolicy-1.7.0-SNAPSHOT.mar
[INFO] Adding version.aar
[INFO] Adding mex-1.7.0-SNAPSHOT.mar
[INFO] Writing services.list
[INFO] Writing modules.list

[INFO] --- axis2-repo-maven-plugin:1.7.0-SNAPSHOT:create-repository (default) @ distribution
---
[INFO] Skipping the assembly in this project because it's not the Execution Root
[INFO] 
[INFO] --- maven-assembly-plugin:2.2-beta-5:single (source-release-assembly) @ distribution
---
[INFO] [INFO] Reading assembly descriptor: src/main/assembly/war-assembly.xml
[INFO] Reading assembly descriptor: src/main/assembly/src-assembly.xml
[INFO] Reading assembly descriptor: src/main/assembly/bin-assembly.xml

[INFO] --- maven-assembly-plugin:2.2-beta-5:single (distribution-package) @ distribution ---
[INFO] Building zip: <https://hudson.apache.org/hudson/job/Axis2/ws/axis2/modules/distribution/target/axis2-1.7.0-SNAPSHOT-war.zip>
[INFO] Building zip: <https://hudson.apache.org/hudson/job/Axis2/ws/axis2/modules/distribution/target/axis2-1.7.0-SNAPSHOT-src.zip>
[INFO] Building zip: <https://hudson.apache.org/hudson/job/Axis2/ws/axis2/modules/distribution/target/axis2-1.7.0-SNAPSHOT-bin.zip>
mojo forkStarted org.apache.maven.plugins:maven-source-plugin:2.0.4(attach-sources)
mojo forkSucceeded org.apache.maven.plugins:maven-source-plugin:2.0.4(attach-sources)
ignoring exception during new ExecutedMojo null
[INFO] 
[INFO] --- maven-source-plugin:2.0.4:jar (attach-sources) @ distribution ---
[INFO] [INFO] Not executing Javadoc as the project is not a Java classpath-capable package

[INFO] --- maven-javadoc-plugin:2.5:jar (attach-javadocs) @ distribution ---
[INFO] [INFO] Configured Artifact: org.codehaus.castor:castor:1.0.4:jar
[INFO] Configured Artifact: net.java.dev.stax-utils:stax-utils:20060502:jar
[INFO] Configured Artifact: xerces:xercesImpl:2.9.1:jar
[INFO] Copying castor-1.0.4.jar to <https://hudson.apache.org/hudson/job/Axis2/ws/axis2/modules/distribution/target/axis2-1.7.0-SNAPSHOT/samples/databinding/lib/castor-1.0.4.jar>

[INFO] --- maven-dependency-plugin:2.0:copy (test-dependencies) @ distribution ---
[INFO] Copying stax-utils-20060502.jar to <https://hudson.apache.org/hudson/job/Axis2/ws/axis2/modules/distribution/target/axis2-1.7.0-SNAPSHOT/samples/databinding/lib/stax-utils-20060502.jar>
[INFO] Copying xercesImpl-2.9.1.jar to <https://hudson.apache.org/hudson/job/Axis2/ws/axis2/modules/distribution/target/axis2-1.7.0-SNAPSHOT/samples/databinding/lib/xercesImpl-2.9.1.jar>
[INFO] [INFO] Executing tasks
    [unzip] Expanding: <https://hudson.apache.org/hudson/job/Axis2/ws/axis2/modules/distribution/target/axis2-1.7.0-SNAPSHOT-bin.zip>
into <https://hudson.apache.org/hudson/job/Axis2/ws/axis2/modules/distribution/target>

[INFO] --- maven-antrun-plugin:1.2:run (test-samples) @ distribution ---

generate.service:
    [mkdir] Created dir: <https://hudson.apache.org/hudson/job/Axis2/ws/axis2/modules/distribution/target/axis2-1.7.0-SNAPSHOT/samples/databinding/build/service>
    [mkdir] Created dir: <https://hudson.apache.org/hudson/job/Axis2/ws/axis2/modules/distribution/target/axis2-1.7.0-SNAPSHOT/samples/databinding/build/service/classes>

     [java] Retrieving document at 'StockQuoteService.wsdl'.
     [java] Retrieving schema wsdl:imported from 'StockQuote.xsd', relative to '<https://hudson.apache.org/hudson/job/Axis2/ws/axis2/modules/distribution/target/axis2-1.7.0-SNAPSHOT/samples/databinding/StockQuoteService.wsdl'.>
     [java] Retrieving document at 'StockQuoteService.wsdl'.
     [java] Retrieving schema wsdl:imported from 'StockQuote.xsd', relative to '<https://hudson.apache.org/hudson/job/Axis2/ws/axis2/modules/distribution/target/axis2-1.7.0-SNAPSHOT/samples/databinding/StockQuoteService.wsdl'.>
     [java] log4j:WARN No appenders could be found for logger (org.apache.axis2.description.WSDL11ToAllAxisServicesBuilder).
     [java] log4j:WARN Please initialize the log4j system properly.
     [copy] Copying 1 file to <https://hudson.apache.org/hudson/job/Axis2/ws/axis2/modules/distribution/target/axis2-1.7.0-SNAPSHOT/samples/databinding/build/service/src>
    [javac] Compiling 16 source files to <https://hudson.apache.org/hudson/job/Axis2/ws/axis2/modules/distribution/target/axis2-1.7.0-SNAPSHOT/samples/databinding/build/service/classes>
    [javac] Note: <https://hudson.apache.org/hudson/job/Axis2/ws/axis2/modules/distribution/target/axis2-1.7.0-SNAPSHOT/samples/databinding/build/service/src/samples/databinding/StockQuoteServiceMessageReceiverInOut.java>
uses unchecked or unsafe operations.
    [javac] Note: Recompile with -Xlint:unchecked for details.
     [copy] Copying 3 files to <https://hudson.apache.org/hudson/job/Axis2/ws/axis2/modules/distribution/target/axis2-1.7.0-SNAPSHOT/samples/databinding/build/service/classes/META-INF>
      [jar] Building jar: <https://hudson.apache.org/hudson/job/Axis2/ws/axis2/modules/distribution/target/axis2-1.7.0-SNAPSHOT/samples/databinding/build/service/StockService.aar>
     [copy] Copying 1 file to <https://hudson.apache.org/hudson/job/Axis2/ws/axis2/modules/distribution/target/axis2-1.7.0-SNAPSHOT/repository/services>

generate.service:
     [java] Retrieving document at '<https://hudson.apache.org/hudson/job/Axis2/ws/axis2/modules/distribution/target/axis2-1.7.0-SNAPSHOT/samples/mtom/resources/MTOMSample.wsdl'.>
     [java] Retrieving schema at 'xmime.xsd', relative to '<https://hudson.apache.org/hudson/job/Axis2/ws/axis2/modules/distribution/target/axis2-1.7.0-SNAPSHOT/samples/mtom/resources/MTOMSample.wsdl'.>
     [java] log4j:WARN No appenders could be found for logger (org.apache.axis2.description.WSDL11ToAllAxisServicesBuilder).
     [java] log4j:WARN Please initialize the log4j system properly.
     [copy] Copying 1 file to <https://hudson.apache.org/hudson/job/Axis2/ws/axis2/modules/distribution/target/axis2-1.7.0-SNAPSHOT/samples/mtom/build/service/src/sample/mtom/service>

jar.server:
    [mkdir] Created dir: <https://hudson.apache.org/hudson/job/Axis2/ws/axis2/modules/distribution/target/axis2-1.7.0-SNAPSHOT/samples/mtom/build/service/classes>
    [javac] Compiling 8 source files to <https://hudson.apache.org/hudson/job/Axis2/ws/axis2/modules/distribution/target/axis2-1.7.0-SNAPSHOT/samples/mtom/build/service/classes>
    [javac] Note: <https://hudson.apache.org/hudson/job/Axis2/ws/axis2/modules/distribution/target/axis2-1.7.0-SNAPSHOT/samples/mtom/build/service/src/sample/mtom/service/MTOMSampleMessageReceiverInOut.java>
uses unchecked or unsafe operations.
    [javac] Note: Recompile with -Xlint:unchecked for details.
     [copy] Copying 3 files to <https://hudson.apache.org/hudson/job/Axis2/ws/axis2/modules/distribution/target/axis2-1.7.0-SNAPSHOT/samples/mtom/build/service/classes/META-INF>
      [jar] Building jar: <https://hudson.apache.org/hudson/job/Axis2/ws/axis2/modules/distribution/target/axis2-1.7.0-SNAPSHOT/samples/mtom/build/service/sample-mtom.aar>
     [copy] Copying 1 file to <https://hudson.apache.org/hudson/job/Axis2/ws/axis2/modules/distribution/target/axis2-1.7.0-SNAPSHOT/repository/services>

generate.client:
     [java] Retrieving document at 'resources/MTOMSample.wsdl'.
     [java] Retrieving schema at 'xmime.xsd', relative to '<https://hudson.apache.org/hudson/job/Axis2/ws/axis2/modules/distribution/target/axis2-1.7.0-SNAPSHOT/samples/mtom/resources/MTOMSample.wsdl'.>
     [java] log4j:WARN No appenders could be found for logger (org.apache.axis2.description.WSDL11ToAllAxisServicesBuilder).
     [java] log4j:WARN Please initialize the log4j system properly.
     [copy] Copying 1 file to <https://hudson.apache.org/hudson/job/Axis2/ws/axis2/modules/distribution/target/axis2-1.7.0-SNAPSHOT/samples/mtom/build/client/src/sample/mtom/client>
    [mkdir] Created dir: <https://hudson.apache.org/hudson/job/Axis2/ws/axis2/modules/distribution/target/axis2-1.7.0-SNAPSHOT/samples/mtom/build/client/classes>
    [javac] Compiling 5 source files to <https://hudson.apache.org/hudson/job/Axis2/ws/axis2/modules/distribution/target/axis2-1.7.0-SNAPSHOT/samples/mtom/build/client/classes>
mojoFailed org.apache.maven.plugins:maven-antrun-plugin:1.2(test-samples)
projectFailed org.apache.axis2:distribution:1.7.0-SNAPSHOT
[JENKINS] Archiving <https://hudson.apache.org/hudson/job/Axis2/ws/axis2/modules/distribution/pom.xml>
to /home/hudson/hudson/jobs/Axis2/modules/org.apache.axis2$distribution/builds/2011-04-03_11-02-36/archive/org.apache.axis2/distribution/1.7.0-SNAPSHOT/pom.xml
[JENKINS] Archiving <https://hudson.apache.org/hudson/job/Axis2/ws/axis2/modules/distribution/target/axis2-1.7.0-SNAPSHOT-war.zip>
to /home/hudson/hudson/jobs/Axis2/modules/org.apache.axis2$distribution/builds/2011-04-03_11-02-36/archive/org.apache.axis2/distribution/1.7.0-SNAPSHOT/axis2-1.7.0-SNAPSHOT-war.zip
[JENKINS] Archiving <https://hudson.apache.org/hudson/job/Axis2/ws/axis2/modules/distribution/target/axis2-1.7.0-SNAPSHOT-src.zip>
to /home/hudson/hudson/jobs/Axis2/modules/org.apache.axis2$distribution/builds/2011-04-03_11-02-36/archive/org.apache.axis2/distribution/1.7.0-SNAPSHOT/axis2-1.7.0-SNAPSHOT-src.zip
[JENKINS] Archiving <https://hudson.apache.org/hudson/job/Axis2/ws/axis2/modules/distribution/target/axis2-1.7.0-SNAPSHOT-bin.zip>
to /home/hudson/hudson/jobs/Axis2/modules/org.apache.axis2$distribution/builds/2011-04-03_11-02-36/archive/org.apache.axis2/distribution/1.7.0-SNAPSHOT/axis2-1.7.0-SNAPSHOT-bin.zip
sessionEnded
[INFO] ------------------------------------------------------------------------
[INFO] Reactor Summary:
[INFO] 
[INFO] Apache Axis2 - Parent ............................. SUCCESS [11.373s]
[INFO] Apache Axis2 - Resource bundle .................... SUCCESS [5.824s]
[INFO] Apache Axis2 - Kernel ............................. SUCCESS [43.992s]
[INFO] Apache Axis2 - Data Binding ....................... SUCCESS [19.297s]
[INFO] Apache Axis2 - Transport - Local .................. SUCCESS [9.657s]
[INFO] Apache Axis2 - Transport - HTTP ................... SUCCESS [10.174s]
[INFO] Apache Axis2 - Code Generation .................... SUCCESS [18.709s]
[INFO] Apache Axis2 - ADB Codegen ........................ SUCCESS [30.709s]
[INFO] Apache Axis2 - Addressing ......................... SUCCESS [10.749s]
[INFO] Apache Axis2 - Java2WSDL .......................... SUCCESS [13.586s]
[INFO] Apache Axis2 - tool - Repository Maven Plugin ..... SUCCESS [8.375s]
[INFO] Apache Axis2 - Fast Infoset ....................... SUCCESS [17.284s]
[INFO] Apache Axis2 - Clustering ......................... SUCCESS [1:25.365s]
[INFO] Apache Axis2 - Scripting .......................... SUCCESS [9.485s]
[INFO] Apache Axis2 - JAXB-RI Data Binding ............... SUCCESS [14.569s]
[INFO] Apache Axis2 - SAAJ ............................... SUCCESS [24.009s]
[INFO] Apache Axis2 - Metadata ........................... SUCCESS [25.225s]
[INFO] Apache Axis2 - JAXWS .............................. SUCCESS [9:25.658s]
[INFO] Apache Axis2 - Test Utilities ..................... SUCCESS [9.566s]
[INFO] Apache Axis2 - XMLBeans Data Binding .............. SUCCESS [56.179s]
[INFO] Apache Axis2 - tool - WSDL2Code Maven Plugin ...... SUCCESS [13.295s]
[INFO] Apache Axis2 - JAXWS Integration Tests ............ SUCCESS [11:20.769s]
[INFO] Apache Axis2 - JiBX Data Binding .................. SUCCESS [21.831s]
[INFO] Apache Axis2 - JSON ............................... SUCCESS [13.568s]
[INFO] Apache Axis2 - MTOM Policy ........................ SUCCESS [9.593s]
[INFO] Apache Axis2 - spring ............................. SUCCESS [8.920s]
[INFO] Apache Axis2 - OSGi Integration ................... SUCCESS [13.310s]
[INFO] Apache Axis2 - Integration ........................ SUCCESS [10:30.460s]
[INFO] Apache Axis2 - MEX ................................ SUCCESS [10.555s]
[INFO] Apache Axis2 - MTOM Policy module ................. SUCCESS [9.039s]
[INFO] Apache Axis2 - Ping ............................... SUCCESS [8.716s]
[INFO] Apache Axis2 - Version Service .................... SUCCESS [9.061s]
[INFO] Apache Axis2 - SOAP Monitor Servlet ............... SUCCESS [9.124s]
[INFO] Apache Axis2 - SOAP Monitor Module ................ SUCCESS [8.873s]
[INFO] Apache Axis2 - tool - AAR Maven Plugin ............ SUCCESS [9.331s]
[INFO] Apache Axis2 - tool - Ant Plugin .................. SUCCESS [10.389s]
[INFO] Apache Axis2 - tool - Eclipse Codegen Plugin ...... SUCCESS [18.632s]
[INFO] Apache Axis2 - tool - Eclipse service Plugin ...... SUCCESS [15.612s]
[INFO] Apache Axis2 - tool - Intellij IDEA Plugin ........ SUCCESS [23.925s]
[INFO] Apache Axis2 - tool - Java2WSDL Maven Plugin ...... SUCCESS [11.842s]
[INFO] Apache Axis2 - tool - MAR Maven Plugin ............ SUCCESS [10.647s]
[INFO] Apache Axis2 - CORBA .............................. SUCCESS [14.580s]
[INFO] Apache Axis2 - JAXWS (mar) ........................ SUCCESS [9.141s]
[INFO] Apache Axis2 - Web Application module ............. SUCCESS [32.387s]
[INFO] Apache Axis2 - Distribution ....................... FAILURE [1:30.691s]
[INFO] Apache Axis2 - Root ............................... SKIPPED
[INFO] ------------------------------------------------------------------------
[INFO] BUILD FAILURE
[INFO] ------------------------------------------------------------------------
[INFO] Total time: 58:45.110s
[INFO] Finished at: Sun Apr 03 12:01:32 UTC 2011
[INFO] Final Memory: 97M/253M
[INFO] ------------------------------------------------------------------------
maven builder waiting
mavenExecutionResult exceptions not empty
org.apache.maven.lifecycle.LifecycleExecutionException: Failed to execute goal org.apache.maven.plugins:maven-antrun-plugin:1.2:run
(test-samples) on project distribution: An Ant BuildException has occured: The following error
occurred while executing this line:
<https://hudson.apache.org/hudson/job/Axis2/ws/axis2/modules/distribution/target/axis2-1.7.0-SNAPSHOT/samples/mtom/build.xml>:89:
Unable to find a javac compiler;
com.sun.tools.javac.Main is not on the classpath.
Perhaps JAVA_HOME does not point to the JDK
	at org.apache.maven.lifecycle.internal.MojoExecutor.execute(MojoExecutor.java:217)
	at org.apache.maven.lifecycle.internal.MojoExecutor.execute(MojoExecutor.java:153)
	at org.apache.maven.lifecycle.internal.MojoExecutor.execute(MojoExecutor.java:145)
	at org.apache.maven.lifecycle.internal.LifecycleModuleBuilder.buildProject(LifecycleModuleBuilder.java:84)
	at org.apache.maven.lifecycle.internal.LifecycleModuleBuilder.buildProject(LifecycleModuleBuilder.java:59)
	at org.apache.maven.lifecycle.internal.LifecycleStarter.singleThreadedBuild(LifecycleStarter.java:183)
	at org.apache.maven.lifecycle.internal.LifecycleStarter.execute(LifecycleStarter.java:161)
	at org.apache.maven.DefaultMaven.doExecute(DefaultMaven.java:319)
	at org.apache.maven.DefaultMaven.execute(DefaultMaven.java:156)
	at org.jvnet.hudson.maven3.launcher.Maven3Launcher.main(Maven3Launcher.java:79)
	at sun.reflect.NativeMethodAccessorImpl.invoke0(Native Method)
	at sun.reflect.NativeMethodAccessorImpl.invoke(NativeMethodAccessorImpl.java:39)
	at sun.reflect.DelegatingMethodAccessorImpl.invoke(DelegatingMethodAccessorImpl.java:25)
	at java.lang.reflect.Method.invoke(Method.java:592)
	at org.codehaus.plexus.classworlds.launcher.Launcher.launchStandard(Launcher.java:329)
	at org.codehaus.plexus.classworlds.launcher.Launcher.launch(Launcher.java:239)
	at org.jvnet.hudson.maven3.agent.Maven3Main.launch(Maven3Main.java:146)
	at hudson.maven.Maven3Builder.call(Maven3Builder.java:124)
	at hudson.maven.Maven3Builder.call(Maven3Builder.java:71)
	at hudson.remoting.UserRequest.perform(UserRequest.java:114)
	at hudson.remoting.UserRequest.perform(UserRequest.java:48)
	at hudson.remoting.Request$2.run(Request.java:270)
	at java.util.concurrent.Executors$RunnableAdapter.call(Executors.java:417)
	at java.util.concurrent.FutureTask$Sync.innerRun(FutureTask.java:269)
	at java.util.concurrent.FutureTask.run(FutureTask.java:123)
	at java.util.concurrent.ThreadPoolExecutor$Worker.runTask(ThreadPoolExecutor.java:651)
	at java.util.concurrent.ThreadPoolExecutor$Worker.run(ThreadPoolExecutor.java:676)
	at java.lang.Thread.run(Thread.java:595)
Caused by: org.apache.maven.plugin.MojoExecutionException: An Ant BuildException has occured:
The following error occurred while executing this line:
<https://hudson.apache.org/hudson/job/Axis2/ws/axis2/modules/distribution/target/axis2-1.7.0-SNAPSHOT/samples/mtom/build.xml>:89:
Unable to find a javac compiler;
com.sun.tools.javac.Main is not on the classpath.
Perhaps JAVA_HOME does not point to the JDK
	at org.apache.maven.plugin.antrun.AbstractAntMojo.executeTasks(AbstractAntMojo.java:131)
	at org.apache.maven.plugin.antrun.AntRunMojo.execute(AntRunMojo.java:98)
	at org.apache.maven.plugin.DefaultBuildPluginManager.executeMojo(DefaultBuildPluginManager.java:101)
	at org.apache.maven.lifecycle.internal.MojoExecutor.execute(MojoExecutor.java:209)
	... 27 more
Caused by: The following error occurred while executing this line:
<https://hudson.apache.org/hudson/job/Axis2/ws/axis2/modules/distribution/target/axis2-1.7.0-SNAPSHOT/samples/mtom/build.xml>:89:
Unable to find a javac compiler;
com.sun.tools.javac.Main is not on the classpath.
Perhaps JAVA_HOME does not point to the JDK
	at org.apache.tools.ant.ProjectHelper.addLocationToBuildException(ProjectHelper.java:539)
	at org.apache.tools.ant.taskdefs.Ant.execute(Ant.java:384)
	at org.apache.tools.ant.UnknownElement.execute(UnknownElement.java:275)
	at org.apache.tools.ant.Task.perform(Task.java:364)
	at org.apache.tools.ant.Target.execute(Target.java:341)
	at org.apache.maven.plugin.antrun.AbstractAntMojo.executeTasks(AbstractAntMojo.java:118)
	... 30 more
Caused by: <https://hudson.apache.org/hudson/job/Axis2/ws/axis2/modules/distribution/target/axis2-1.7.0-SNAPSHOT/samples/mtom/build.xml>:89:
Unable to find a javac compiler;
com.sun.tools.javac.Main is not on the classpath.
Perhaps JAVA_HOME does not point to the JDK
	at org.apache.tools.ant.taskdefs.compilers.CompilerAdapterFactory.getCompiler(CompilerAdapterFactory.java:105)
	at org.apache.tools.ant.taskdefs.Javac.compile(Javac.java:924)
	at org.apache.tools.ant.taskdefs.Javac.execute(Javac.java:757)
	at org.apache.tools.ant.UnknownElement.execute(UnknownElement.java:275)
	at org.apache.tools.ant.Task.perform(Task.java:364)
	at org.apache.tools.ant.Target.execute(Target.java:341)
	at org.apache.tools.ant.Target.performTasks(Target.java:369)
	at org.apache.tools.ant.Project.executeSortedTargets(Project.java:1216)
	at org.apache.tools.ant.helper.SingleCheckExecutor.executeTargets(SingleCheckExecutor.java:37)
	at org.apache.tools.ant.Project.executeTargets(Project.java:1068)
	at org.apache.tools.ant.taskdefs.Ant.execute(Ant.java:382)
	... 34 more
Sending e-mails to: java-dev@axis.apache.org andreas.veithen@gmail.com
channel stopped
[locks-and-latches] Releasing all the locks
[locks-and-latches] All the locks released


---------------------------------------------------------------------
To unsubscribe, e-mail: java-dev-unsubscribe@axis.apache.org
For additional commands, e-mail: java-dev-help@axis.apache.org


Mime
View raw message