axis-java-dev mailing list archives

Site index · List index
Message view « Date » · « Thread »
Top « Date » · « Thread »
From Apache Hudson Server <hud...@hudson.apache.org>
Subject Build failed in Jenkins: sandesha2-1.4 » Apache Sandesha #58
Date Tue, 15 Mar 2011 02:55:37 GMT
See <https://hudson.apache.org/hudson/job/sandesha2-1.4/org.apache.sandesha2$sandesha2-parent/58/>

------------------------------------------
[...truncated 386 lines...]
[INFO] snapshot org.apache.ws.commons.axiom:axiom-api:1.2.11-SNAPSHOT: checking for updates
from apache.snapshots
Downloading: http://repository.apache.org/snapshots/org/apache/ws/commons/axiom/axiom-api/1.2.11-SNAPSHOT/axiom-api-1.2.11-SNAPSHOT.pom
[INFO] Unable to find resource 'org.apache.ws.commons.axiom:axiom-api:pom:1.2.11-SNAPSHOT'
in repository apache.snapshots (http://repository.apache.org/snapshots)
[INFO] snapshot org.apache.ws.commons.axiom:axiom-impl:1.2.11-SNAPSHOT: checking for updates
from apache.snapshots
Downloading: http://repository.apache.org/snapshots/org/apache/ws/commons/axiom/axiom-impl/1.2.11-SNAPSHOT/axiom-impl-1.2.11-SNAPSHOT.pom
[INFO] Unable to find resource 'org.apache.ws.commons.axiom:axiom-impl:pom:1.2.11-SNAPSHOT'
in repository apache.snapshots (http://repository.apache.org/snapshots)
[INFO] snapshot org.apache.ws.commons.axiom:axiom-dom:1.2.11-SNAPSHOT: checking for updates
from apache.snapshots
Downloading: http://repository.apache.org/snapshots/org/apache/ws/commons/axiom/axiom-dom/1.2.11-SNAPSHOT/axiom-dom-1.2.11-SNAPSHOT.pom
[INFO] Unable to find resource 'org.apache.ws.commons.axiom:axiom-dom:pom:1.2.11-SNAPSHOT'
in repository apache.snapshots (http://repository.apache.org/snapshots)
Downloading: http://repo1.maven.org/maven2/org/apache/neethi/neethi/2.0.4/neethi-2.0.4.pom

Downloading: http://repo1.maven.org/maven//wsdl4j/poms/wsdl4j-1.6.2.pom
[WARNING] Unable to get resource 'wsdl4j:wsdl4j:pom:1.6.2' from repository maven-central (http://repo1.maven.org/maven/):
Error transferring file: Server returned HTTP response code: 502 for URL: http://repo1.maven.org/maven/wsdl4j/poms/wsdl4j-1.6.2.pom
Downloading: http://ws.zones.apache.org/repository2/wsdl4j/wsdl4j/1.6.2/wsdl4j-1.6.2.pom
147b downloaded  (wsdl4j-1.6.2.pom)
[WARNING] *** CHECKSUM FAILED - Error retrieving checksum file for wsdl4j/wsdl4j/1.6.2/wsdl4j-1.6.2.pom
- IGNORING
Downloading: http://repo1.maven.org/maven//org.codehaus.woodstox/poms/wstx-asl-3.2.4.pom
[WARNING] Unable to get resource 'org.codehaus.woodstox:wstx-asl:pom:3.2.4' from repository
maven-central (http://repo1.maven.org/maven/): Error transferring file: Server returned HTTP
response code: 502 for URL: http://repo1.maven.org/maven/org.codehaus.woodstox/poms/wstx-asl-3.2.4.pom
Downloading: http://ws.zones.apache.org/repository2/org/codehaus/woodstox/wstx-asl/3.2.4/wstx-asl-3.2.4.pom
[INFO] Unable to find resource 'org.codehaus.woodstox:wstx-asl:pom:3.2.4' in repository apache-ws-snapshots2
(http://ws.zones.apache.org/repository2)
Downloading: http://repo1.maven.org/maven2/org/codehaus/woodstox/wstx-asl/3.2.4/wstx-asl-3.2.4.pom

Downloading: http://repo1.maven.org/maven//stax/poms/stax-api-1.0.1.pom
[WARNING] Unable to get resource 'stax:stax-api:pom:1.0.1' from repository maven-central (http://repo1.maven.org/maven/):
Error transferring file: Server returned HTTP response code: 502 for URL: http://repo1.maven.org/maven/stax/poms/stax-api-1.0.1.pom
Downloading: http://ws.zones.apache.org/repository2/stax/stax-api/1.0.1/stax-api-1.0.1.pom
[INFO] Unable to find resource 'stax:stax-api:pom:1.0.1' in repository apache-ws-snapshots2
(http://ws.zones.apache.org/repository2)
Downloading: http://repo1.maven.org/maven2/stax/stax-api/1.0.1/stax-api-1.0.1.pom

Downloading: http://repo1.maven.org/maven//commons-logging/poms/commons-logging-1.1.1.pom
[WARNING] Unable to get resource 'commons-logging:commons-logging:pom:1.1.1' from repository
maven-central (http://repo1.maven.org/maven/): Error transferring file: Server returned HTTP
response code: 502 for URL: http://repo1.maven.org/maven/commons-logging/poms/commons-logging-1.1.1.pom
Downloading: http://ws.zones.apache.org/repository2/commons-logging/commons-logging/1.1.1/commons-logging-1.1.1.pom
[INFO] Unable to find resource 'commons-logging:commons-logging:pom:1.1.1' in repository apache-ws-snapshots2
(http://ws.zones.apache.org/repository2)
Downloading: http://repo1.maven.org/maven2/commons-logging/commons-logging/1.1.1/commons-logging-1.1.1.pom

Downloading: http://repo1.maven.org/maven//org.apache.commons/poms/commons-parent-5.pom
[WARNING] Unable to get resource 'org.apache.commons:commons-parent:pom:5' from repository
maven-central (http://repo1.maven.org/maven/): Error transferring file: Server returned HTTP
response code: 502 for URL: http://repo1.maven.org/maven/org.apache.commons/poms/commons-parent-5.pom
Downloading: http://ws.zones.apache.org/repository2/org/apache/commons/commons-parent/5/commons-parent-5.pom
[INFO] Unable to find resource 'org.apache.commons:commons-parent:pom:5' in repository apache-ws-snapshots2
(http://ws.zones.apache.org/repository2)
Downloading: http://repo1.maven.org/maven2/org/apache/commons/commons-parent/5/commons-parent-5.pom

Downloading: http://repo1.maven.org/maven2/junit/junit/3.8.2/junit-3.8.2.pom

Downloading: http://repo1.maven.org/maven2/org/apache/httpcomponents/httpcore/4.0-beta1/httpcore-4.0-beta1.pom

Downloading: http://repo1.maven.org/maven2/org/apache/httpcomponents/httpcomponents-core/4.0-beta1/httpcomponents-core-4.0-beta1.pom

Downloading: http://repo1.maven.org/maven2/org/apache/httpcomponents/project/4.0/project-4.0.pom

[INFO] snapshot org.apache.axis2:axis2-kernel:1.5.5-SNAPSHOT: checking for updates from apache.snapshots
Downloading: http://repository.apache.org/snapshots/org/apache/axis2/axis2-kernel/1.5.5-SNAPSHOT/axis2-kernel-1.5.5-SNAPSHOT.pom
9K downloaded  (axis2-kernel-1.5.5-SNAPSHOT.pom)
Downloading: http://repo1.maven.org/maven2/org/apache/geronimo/specs/geronimo-ws-metadata_2.0_spec/1.1.2/geronimo-ws-metadata_2.0_spec-1.1.2.pom

Downloading: http://repo1.maven.org/maven2/org/apache/geronimo/specs/specs/1.4/specs-1.4.pom

Downloading: http://repo1.maven.org/maven2/org/apache/geronimo/genesis/config/project-config/1.2/project-config-1.2.pom

Downloading: http://people.apache.org/repo/m2-incubating-repository//org/apache/geronimo/genesis/config/config/1.2/config-1.2.pom
[INFO] Unable to find resource 'org.apache.geronimo.genesis.config:config:pom:1.2' in repository
apache-incubator (http://people.apache.org/repo/m2-incubating-repository/)
Downloading: http://repo1.maven.org/maven2/org/apache/geronimo/genesis/config/config/1.2/config-1.2.pom

Downloading: http://people.apache.org/repo/m2-incubating-repository//org/apache/geronimo/genesis/genesis/1.2/genesis-1.2.pom
[INFO] Unable to find resource 'org.apache.geronimo.genesis:genesis:pom:1.2' in repository
apache-incubator (http://people.apache.org/repo/m2-incubating-repository/)
Downloading: http://repo1.maven.org/maven2/org/apache/geronimo/genesis/genesis/1.2/genesis-1.2.pom

Downloading: http://repo1.maven.org/maven2/org/apache/geronimo/specs/geronimo-jta_1.1_spec/1.1/geronimo-jta_1.1_spec-1.1.pom

Downloading: http://repo1.maven.org/maven2/org/apache/geronimo/specs/specs/1.2/specs-1.2.pom

Downloading: http://repo1.maven.org/maven2/org/apache/geronimo/genesis/config/project-config/1.1/project-config-1.1.pom

Downloading: http://people.apache.org/repo/m2-incubating-repository//org/apache/geronimo/genesis/config/config/1.1/config-1.1.pom
[INFO] Unable to find resource 'org.apache.geronimo.genesis.config:config:pom:1.1' in repository
apache-incubator (http://people.apache.org/repo/m2-incubating-repository/)
Downloading: http://repository.codehaus.org/org/apache/geronimo/genesis/config/config/1.1/config-1.1.pom
[INFO] Unable to find resource 'org.apache.geronimo.genesis.config:config:pom:1.1' in repository
codehaus (http://repository.codehaus.org)
Downloading: http://repo1.maven.org/maven2/org/apache/geronimo/genesis/config/config/1.1/config-1.1.pom

Downloading: http://people.apache.org/repo/m2-incubating-repository//org/apache/geronimo/genesis/genesis/1.1/genesis-1.1.pom
[INFO] Unable to find resource 'org.apache.geronimo.genesis:genesis:pom:1.1' in repository
apache-incubator (http://people.apache.org/repo/m2-incubating-repository/)
Downloading: http://repository.codehaus.org/org/apache/geronimo/genesis/genesis/1.1/genesis-1.1.pom
[INFO] Unable to find resource 'org.apache.geronimo.genesis:genesis:pom:1.1' in repository
codehaus (http://repository.codehaus.org)
Downloading: http://repo1.maven.org/maven2/org/apache/geronimo/genesis/genesis/1.1/genesis-1.1.pom

Downloading: http://repo1.maven.org/maven2/javax/servlet/servlet-api/2.3/servlet-api-2.3.pom

Downloading: http://repo1.maven.org/maven2/commons-httpclient/commons-httpclient/3.1/commons-httpclient-3.1.pom

Downloading: http://repo1.maven.org/maven2/commons-logging/commons-logging/1.0.4/commons-logging-1.0.4.pom

Downloading: http://repo1.maven.org/maven2/commons-codec/commons-codec/1.2/commons-codec-1.2.pom

Downloading: http://repo1.maven.org/maven2/commons-fileupload/commons-fileupload/1.2/commons-fileupload-1.2.pom

Downloading: http://repo1.maven.org/maven2/org/apache/commons/commons-parent/1/commons-parent-1.pom

Downloading: http://repo1.maven.org/maven2/org/apache/ws/commons/schema/XmlSchema/1.4.3/XmlSchema-1.4.3.pom

Downloading: http://repo1.maven.org/maven2/org/apache/woden/woden-api/1.0M8/woden-api-1.0M8.pom

Downloading: http://repo1.maven.org/maven2/org/apache/woden/woden/1.0M8/woden-1.0M8.pom

Downloading: http://repo1.maven.org/maven2/org/apache/ws/commons/schema/XmlSchema/1.4.2/XmlSchema-1.4.2.pom

Downloading: http://repo1.maven.org/maven2/org/apache/ant/ant/1.7.0/ant-1.7.0.pom

Downloading: http://repo1.maven.org/maven2/org/apache/ant/ant-parent/1.7.0/ant-parent-1.7.0.pom

Downloading: http://repo1.maven.org/maven2/org/apache/ant/ant-launcher/1.7.0/ant-launcher-1.7.0.pom

Downloading: http://repo1.maven.org/maven2/org/apache/woden/woden-impl-dom/1.0M8/woden-impl-dom-1.0M8.pom

Downloading: http://repo1.maven.org/maven2/xerces/xercesImpl/2.8.1/xercesImpl-2.8.1.pom

[INFO] snapshot org.apache.axis2:addressing:1.5.5-SNAPSHOT: checking for updates from apache.snapshots
Downloading: http://repository.apache.org/snapshots/org/apache/axis2/addressing/1.5.5-SNAPSHOT/addressing-1.5.5-SNAPSHOT.pom
4K downloaded  (addressing-1.5.5-SNAPSHOT.pom)
[INFO] snapshot org.apache.axis2:axis2-mtompolicy:1.5.5-SNAPSHOT: checking for updates from
apache.snapshots
Downloading: http://repository.apache.org/snapshots/org/apache/axis2/axis2-mtompolicy/1.5.5-SNAPSHOT/axis2-mtompolicy-1.5.5-SNAPSHOT.pom
3K downloaded  (axis2-mtompolicy-1.5.5-SNAPSHOT.pom)
Downloading: http://repo1.maven.org/maven2/org/apache/woden/woden-api/1.0M8/woden-api-1.0M8.jar
Downloading: http://repo1.maven.org/maven2/commons-codec/commons-codec/1.2/commons-codec-1.2.jar
Downloading: http://repo1.maven.org/maven2/commons-logging/commons-logging/1.1.1/commons-logging-1.1.1.jar
Downloading: http://repo1.maven.org/maven2/org/apache/ws/commons/schema/XmlSchema/1.4.3/XmlSchema-1.4.3.jar
Downloading: http://repo1.maven.org/maven2/org/apache/httpcomponents/httpcore/4.0-beta1/httpcore-4.0-beta1.jar



Downloading: http://repo1.maven.org/maven2/commons-fileupload/commons-fileupload/1.2/commons-fileupload-1.2.jar
Downloading: http://repository.apache.org/snapshots/org/apache/axis2/axis2-kernel/1.5.5-SNAPSHOT/axis2-kernel-1.5.5-SNAPSHOT.jar

Downloading: http://repo1.maven.org/maven2/xerces/xercesImpl/2.8.1/xercesImpl-2.8.1.jar

980K downloaded  (axis2-kernel-1.5.5-SNAPSHOT.jar)
Downloading: http://repo1.maven.org/maven//wsdl4j/jars/wsdl4j-1.6.2.jar
[WARNING] Unable to get resource 'wsdl4j:wsdl4j:jar:1.6.2' from repository maven-central (http://repo1.maven.org/maven/):
Error transferring file: Server returned HTTP response code: 502 for URL: http://repo1.maven.org/maven/wsdl4j/jars/wsdl4j-1.6.2.jar
Downloading: http://ws.zones.apache.org/repository2/wsdl4j/wsdl4j/1.6.2/wsdl4j-1.6.2.jar
144K downloaded  (wsdl4j-1.6.2.jar)
Downloading: http://repo1.maven.org/maven//stax/jars/stax-api-1.0.1.jar
[WARNING] *** CHECKSUM FAILED - Error retrieving checksum file for wsdl4j/wsdl4j/1.6.2/wsdl4j-1.6.2.jar
- IGNORING
Downloading: http://repository.apache.org/snapshots/org/apache/ws/commons/axiom/axiom-api/1.2.11-SNAPSHOT/axiom-api-1.2.11-SNAPSHOT.jar
[WARNING] Unable to get resource 'stax:stax-api:jar:1.0.1' from repository maven-central (http://repo1.maven.org/maven/):
Error transferring file: Server returned HTTP response code: 502 for URL: http://repo1.maven.org/maven/stax/jars/stax-api-1.0.1.jar
Downloading: http://ws.zones.apache.org/repository2/stax/stax-api/1.0.1/stax-api-1.0.1.jar

[INFO] Unable to find resource 'org.apache.ws.commons.axiom:axiom-api:jar:1.2.11-SNAPSHOT'
in repository apache.snapshots (http://repository.apache.org/snapshots)
Downloading: http://repo1.maven.org/maven2/org/apache/neethi/neethi/2.0.4/neethi-2.0.4.jar
[INFO] Unable to find resource 'stax:stax-api:jar:1.0.1' in repository apache-ws-snapshots2
(http://ws.zones.apache.org/repository2)
Downloading: http://repo1.maven.org/maven2/stax/stax-api/1.0.1/stax-api-1.0.1.jar
Downloading: http://repo1.maven.org/maven2/org/apache/ant/ant/1.7.0/ant-1.7.0.jar

Downloading: http://repo1.maven.org/maven2/javax/servlet/servlet-api/2.3/servlet-api-2.3.jar

Downloading: http://repo1.maven.org/maven//org.codehaus.woodstox/jars/wstx-asl-3.2.4.jar
[WARNING] Unable to get resource 'org.codehaus.woodstox:wstx-asl:jar:3.2.4' from repository
maven-central (http://repo1.maven.org/maven/): Error transferring file: Server returned HTTP
response code: 502 for URL: http://repo1.maven.org/maven/org.codehaus.woodstox/jars/wstx-asl-3.2.4.jar
Downloading: http://ws.zones.apache.org/repository2/org/codehaus/woodstox/wstx-asl/3.2.4/wstx-asl-3.2.4.jar
[INFO] Unable to find resource 'org.codehaus.woodstox:wstx-asl:jar:3.2.4' in repository apache-ws-snapshots2
(http://ws.zones.apache.org/repository2)
Downloading: http://repo1.maven.org/maven2/org/codehaus/woodstox/wstx-asl/3.2.4/wstx-asl-3.2.4.jar


Downloading: http://repo1.maven.org/maven2/junit/junit/3.8.2/junit-3.8.2.jar

Downloading: http://repo1.maven.org/maven2/org/apache/geronimo/specs/geronimo-ws-metadata_2.0_spec/1.1.2/geronimo-ws-metadata_2.0_spec-1.1.2.jar

Downloading: http://repo1.maven.org/maven2/commons-httpclient/commons-httpclient/3.1/commons-httpclient-3.1.jar
Downloading: http://repository.apache.org/snapshots/org/apache/axis2/addressing/1.5.5-SNAPSHOT/addressing-1.5.5-SNAPSHOT.mar

Downloading: http://repo1.maven.org/maven2/org/apache/woden/woden-impl-dom/1.0M8/woden-impl-dom-1.0M8.jar



Downloading: http://repository.apache.org/snapshots/org/apache/ws/commons/axiom/axiom-impl/1.2.11-SNAPSHOT/axiom-impl-1.2.11-SNAPSHOT.jar
[INFO] Unable to find resource 'org.apache.ws.commons.axiom:axiom-impl:jar:1.2.11-SNAPSHOT'
in repository apache.snapshots (http://repository.apache.org/snapshots)
Downloading: http://repo1.maven.org/maven2/org/apache/ant/ant-launcher/1.7.0/ant-launcher-1.7.0.jar
Downloading: http://repository.apache.org/snapshots/org/apache/axis2/axis2-mtompolicy/1.5.5-SNAPSHOT/axis2-mtompolicy-1.5.5-SNAPSHOT.jar
18K downloaded  (axis2-mtompolicy-1.5.5-SNAPSHOT.jar)
Downloading: http://repo1.maven.org/maven2/org/apache/geronimo/specs/geronimo-jta_1.1_spec/1.1/geronimo-jta_1.1_spec-1.1.jar
Downloading: http://repository.apache.org/snapshots/org/apache/ws/commons/axiom/axiom-dom/1.2.11-SNAPSHOT/axiom-dom-1.2.11-SNAPSHOT.jar
[INFO] Unable to find resource 'org.apache.ws.commons.axiom:axiom-dom:jar:1.2.11-SNAPSHOT'
in repository apache.snapshots (http://repository.apache.org/snapshots)



[JENKINS] Archiving <https://hudson.apache.org/hudson/job/sandesha2-1.4/org.apache.sandesha2$sandesha2-parent/ws/pom.xml>
to /home/hudson/hudson/jobs/sandesha2-1.4/modules/org.apache.sandesha2$sandesha2-parent/builds/2011-03-15_02-51-44/archive/org.apache.sandesha2/sandesha2-parent/1.4.1-SNAPSHOT/pom.xml
[INFO] ------------------------------------------------------------------------
[ERROR] BUILD ERROR
[INFO] ------------------------------------------------------------------------
[INFO] Failed to resolve artifact.

Missing:
----------
1) org.apache.ws.commons.axiom:axiom-api:jar:1.2.11-SNAPSHOT

  Try downloading the file manually from the project website.

  Then, install it using the command: 
      mvn install:install-file -DgroupId=org.apache.ws.commons.axiom -DartifactId=axiom-api
-Dversion=1.2.11-SNAPSHOT -Dpackaging=jar -Dfile=/path/to/file

  Alternatively, if you host your own repository you can deploy the file there: 
      mvn deploy:deploy-file -DgroupId=org.apache.ws.commons.axiom -DartifactId=axiom-api
-Dversion=1.2.11-SNAPSHOT -Dpackaging=jar -Dfile=/path/to/file -Durl=[url] -DrepositoryId=[id]

  Path to dependency: 
  	1) org.apache.sandesha2:sandesha2-parent:pom:1.4.1-SNAPSHOT
  	2) org.apache.ws.commons.axiom:axiom-api:jar:1.2.11-SNAPSHOT

2) org.apache.ws.commons.axiom:axiom-impl:jar:1.2.11-SNAPSHOT

  Try downloading the file manually from the project website.

  Then, install it using the command: 
      mvn install:install-file -DgroupId=org.apache.ws.commons.axiom -DartifactId=axiom-impl
-Dversion=1.2.11-SNAPSHOT -Dpackaging=jar -Dfile=/path/to/file

  Alternatively, if you host your own repository you can deploy the file there: 
      mvn deploy:deploy-file -DgroupId=org.apache.ws.commons.axiom -DartifactId=axiom-impl
-Dversion=1.2.11-SNAPSHOT -Dpackaging=jar -Dfile=/path/to/file -Durl=[url] -DrepositoryId=[id]

  Path to dependency: 
  	1) org.apache.sandesha2:sandesha2-parent:pom:1.4.1-SNAPSHOT
  	2) org.apache.ws.commons.axiom:axiom-impl:jar:1.2.11-SNAPSHOT

3) org.apache.ws.commons.axiom:axiom-dom:jar:1.2.11-SNAPSHOT

  Try downloading the file manually from the project website.

  Then, install it using the command: 
      mvn install:install-file -DgroupId=org.apache.ws.commons.axiom -DartifactId=axiom-dom
-Dversion=1.2.11-SNAPSHOT -Dpackaging=jar -Dfile=/path/to/file

  Alternatively, if you host your own repository you can deploy the file there: 
      mvn deploy:deploy-file -DgroupId=org.apache.ws.commons.axiom -DartifactId=axiom-dom
-Dversion=1.2.11-SNAPSHOT -Dpackaging=jar -Dfile=/path/to/file -Durl=[url] -DrepositoryId=[id]

  Path to dependency: 
  	1) org.apache.sandesha2:sandesha2-parent:pom:1.4.1-SNAPSHOT
  	2) org.apache.ws.commons.axiom:axiom-dom:jar:1.2.11-SNAPSHOT

----------
3 required artifacts are missing.

for artifact: 
  org.apache.sandesha2:sandesha2-parent:pom:1.4.1-SNAPSHOT

from the specified remote repositories:
  central (http://repo1.maven.org/maven2),
  Nexus (http://repository.apache.org/snapshots)



[INFO] ------------------------------------------------------------------------
[INFO] For more information, run Maven with the -e switch
[INFO] ------------------------------------------------------------------------
[INFO] Total time: 3 minutes 25 seconds
[INFO] Finished at: Mon Mar 14 18:55:36 GMT-08:00 2011
[INFO] Final Memory: 25M/142M
[INFO] ------------------------------------------------------------------------


---------------------------------------------------------------------
To unsubscribe, e-mail: java-dev-unsubscribe@axis.apache.org
For additional commands, e-mail: java-dev-help@axis.apache.org


Mime
View raw message