axis-java-dev mailing list archives

Site index · List index
Message view « Date » · « Thread »
Top « Date » · « Thread »
From Apache Hudson Server <hud...@hudson.apache.org>
Subject Build failed in Hudson: axis2-transports-trunk #207
Date Sun, 31 Oct 2010 13:19:05 GMT
See <https://hudson.apache.org/hudson/job/axis2-transports-trunk/207/>

------------------------------------------
[...truncated 646 lines...]
Tests run: 7, Failures: 0, Errors: 0, Skipped: 0

[HUDSON] Recording test results
[INFO] [bundle:bundle {execution: default-bundle}]
[INFO] Preparing source:jar
[WARNING] Removing: jar from forked lifecycle, to prevent recursive invocation.
[INFO] No goals needed for project - skipping
[INFO] [source:jar {execution: default}]
[INFO] Building jar: <https://hudson.apache.org/hudson/job/axis2-transports-trunk/ws/transports/modules/udp/target/axis2-transport-udp-1.1.0-SNAPSHOT-sources.jar>
[INFO] [install:install {execution: default-install}]
[INFO] Installing <https://hudson.apache.org/hudson/job/axis2-transports-trunk/ws/transports/modules/udp/target/axis2-transport-udp-1.1.0-SNAPSHOT.jar>
to /home/hudson/.m2/repository/org/apache/axis2/axis2-transport-udp/1.1.0-SNAPSHOT/axis2-transport-udp-1.1.0-SNAPSHOT.jar
[INFO] Installing <https://hudson.apache.org/hudson/job/axis2-transports-trunk/ws/transports/modules/udp/target/axis2-transport-udp-1.1.0-SNAPSHOT-sources.jar>
to /home/hudson/.m2/repository/org/apache/axis2/axis2-transport-udp/1.1.0-SNAPSHOT/axis2-transport-udp-1.1.0-SNAPSHOT-sources.jar
[INFO] [bundle:install {execution: default-install}]
[INFO] Parsing file:/home/hudson/.m2/repository/repository.xml
[Fatal Error] :-1:-1: Premature end of file.
org.xml.sax.SAXParseException: Premature end of file.
	at com.sun.org.apache.xerces.internal.parsers.DOMParser.parse(DOMParser.java:264)
	at com.sun.org.apache.xerces.internal.jaxp.DocumentBuilderImpl.parse(DocumentBuilderImpl.java:292)
	at javax.xml.parsers.DocumentBuilder.parse(DocumentBuilder.java:172)
	at org.apache.felix.obrplugin.ObrUpdate.parseFile(ObrUpdate.java:347)
	at org.apache.felix.obrplugin.ObrUpdate.parseRepositoryXml(ObrUpdate.java:324)
	at org.apache.felix.obrplugin.ObrInstall.execute(ObrInstall.java:136)
	at org.apache.maven.plugin.DefaultPluginManager.executeMojo(DefaultPluginManager.java:490)
	at hudson.maven.agent.PluginManagerInterceptor.executeMojo(PluginManagerInterceptor.java:182)
	at org.apache.maven.lifecycle.DefaultLifecycleExecutor.executeGoals(DefaultLifecycleExecutor.java:694)
	at org.apache.maven.lifecycle.DefaultLifecycleExecutor.executeGoalWithLifecycle(DefaultLifecycleExecutor.java:556)
	at org.apache.maven.lifecycle.DefaultLifecycleExecutor.executeGoal(DefaultLifecycleExecutor.java:535)
	at org.apache.maven.lifecycle.DefaultLifecycleExecutor.executeGoalAndHandleFailures(DefaultLifecycleExecutor.java:387)
	at org.apache.maven.lifecycle.DefaultLifecycleExecutor.executeTaskSegments(DefaultLifecycleExecutor.java:348)
	at org.apache.maven.lifecycle.DefaultLifecycleExecutor.execute(DefaultLifecycleExecutor.java:180)
	at org.apache.maven.lifecycle.LifecycleExecutorInterceptor.execute(LifecycleExecutorInterceptor.java:65)
	at org.apache.maven.DefaultMaven.doExecute(DefaultMaven.java:328)
	at org.apache.maven.DefaultMaven.execute(DefaultMaven.java:138)
	at org.apache.maven.cli.MavenCli.main(MavenCli.java:362)
	at sun.reflect.NativeMethodAccessorImpl.invoke0(Native Method)
	at sun.reflect.NativeMethodAccessorImpl.invoke(NativeMethodAccessorImpl.java:39)
	at sun.reflect.DelegatingMethodAccessorImpl.invoke(DelegatingMethodAccessorImpl.java:25)
	at java.lang.reflect.Method.invoke(Method.java:592)
	at org.codehaus.classworlds.Launcher.launchEnhanced(Launcher.java:315)
	at org.codehaus.classworlds.Launcher.launch(Launcher.java:255)
	at hudson.maven.agent.Main.launch(Main.java:165)
	at hudson.maven.MavenBuilder.call(MavenBuilder.java:165)
	at hudson.maven.MavenModuleSetBuild$Builder.call(MavenModuleSetBuild.java:694)
	at hudson.maven.MavenModuleSetBuild$Builder.call(MavenModuleSetBuild.java:638)
	at hudson.remoting.UserRequest.perform(UserRequest.java:114)
	at hudson.remoting.UserRequest.perform(UserRequest.java:48)
	at hudson.remoting.Request$2.run(Request.java:270)
	at java.util.concurrent.Executors$RunnableAdapter.call(Executors.java:417)
	at java.util.concurrent.FutureTask$Sync.innerRun(FutureTask.java:269)
	at java.util.concurrent.FutureTask.run(FutureTask.java:123)
	at java.util.concurrent.ThreadPoolExecutor$Worker.runTask(ThreadPoolExecutor.java:651)
	at java.util.concurrent.ThreadPoolExecutor$Worker.run(ThreadPoolExecutor.java:676)
	at java.lang.Thread.run(Thread.java:595)
[INFO] Writing OBR metadata
[WARNING] Exception while updating local OBR: null
java.lang.NullPointerException
	at org.apache.felix.obrplugin.ObrUpdate.writeRepositoryXml(ObrUpdate.java:268)
	at org.apache.felix.obrplugin.ObrInstall.execute(ObrInstall.java:144)
	at org.apache.maven.plugin.DefaultPluginManager.executeMojo(DefaultPluginManager.java:490)
	at hudson.maven.agent.PluginManagerInterceptor.executeMojo(PluginManagerInterceptor.java:182)
	at org.apache.maven.lifecycle.DefaultLifecycleExecutor.executeGoals(DefaultLifecycleExecutor.java:694)
	at org.apache.maven.lifecycle.DefaultLifecycleExecutor.executeGoalWithLifecycle(DefaultLifecycleExecutor.java:556)
	at org.apache.maven.lifecycle.DefaultLifecycleExecutor.executeGoal(DefaultLifecycleExecutor.java:535)
	at org.apache.maven.lifecycle.DefaultLifecycleExecutor.executeGoalAndHandleFailures(DefaultLifecycleExecutor.java:387)
	at org.apache.maven.lifecycle.DefaultLifecycleExecutor.executeTaskSegments(DefaultLifecycleExecutor.java:348)
	at org.apache.maven.lifecycle.DefaultLifecycleExecutor.execute(DefaultLifecycleExecutor.java:180)
	at org.apache.maven.lifecycle.LifecycleExecutorInterceptor.execute(LifecycleExecutorInterceptor.java:65)
	at org.apache.maven.DefaultMaven.doExecute(DefaultMaven.java:328)
	at org.apache.maven.DefaultMaven.execute(DefaultMaven.java:138)
	at org.apache.maven.cli.MavenCli.main(MavenCli.java:362)
	at sun.reflect.NativeMethodAccessorImpl.invoke0(Native Method)
	at sun.reflect.NativeMethodAccessorImpl.invoke(NativeMethodAccessorImpl.java:39)
	at sun.reflect.DelegatingMethodAccessorImpl.invoke(DelegatingMethodAccessorImpl.java:25)
	at java.lang.reflect.Method.invoke(Method.java:592)
	at org.codehaus.classworlds.Launcher.launchEnhanced(Launcher.java:315)
	at org.codehaus.classworlds.Launcher.launch(Launcher.java:255)
	at hudson.maven.agent.Main.launch(Main.java:165)
	at hudson.maven.MavenBuilder.call(MavenBuilder.java:165)
	at hudson.maven.MavenModuleSetBuild$Builder.call(MavenModuleSetBuild.java:694)
	at hudson.maven.MavenModuleSetBuild$Builder.call(MavenModuleSetBuild.java:638)
	at hudson.remoting.UserRequest.perform(UserRequest.java:114)
	at hudson.remoting.UserRequest.perform(UserRequest.java:48)
	at hudson.remoting.Request$2.run(Request.java:270)
	at java.util.concurrent.Executors$RunnableAdapter.call(Executors.java:417)
	at java.util.concurrent.FutureTask$Sync.innerRun(FutureTask.java:269)
	at java.util.concurrent.FutureTask.run(FutureTask.java:123)
	at java.util.concurrent.ThreadPoolExecutor$Worker.runTask(ThreadPoolExecutor.java:651)
	at java.util.concurrent.ThreadPoolExecutor$Worker.run(ThreadPoolExecutor.java:676)
	at java.lang.Thread.run(Thread.java:595)
[HUDSON] Archiving <https://hudson.apache.org/hudson/job/axis2-transports-trunk/ws/transports/modules/udp/pom.xml>
to /home/hudson/hudson/jobs/axis2-transports-trunk/modules/org.apache.axis2$axis2-transport-udp/builds/2010-10-31_13-17-30/archive/org.apache.axis2/axis2-transport-udp/1.1.0-SNAPSHOT/pom.xml
[HUDSON] Archiving <https://hudson.apache.org/hudson/job/axis2-transports-trunk/ws/transports/modules/udp/target/axis2-transport-udp-1.1.0-SNAPSHOT.jar>
to /home/hudson/hudson/jobs/axis2-transports-trunk/modules/org.apache.axis2$axis2-transport-udp/builds/2010-10-31_13-17-30/archive/org.apache.axis2/axis2-transport-udp/1.1.0-SNAPSHOT/axis2-transport-udp-1.1.0-SNAPSHOT.jar
[HUDSON] Archiving <https://hudson.apache.org/hudson/job/axis2-transports-trunk/ws/transports/modules/udp/target/axis2-transport-udp-1.1.0-SNAPSHOT-sources.jar>
to /home/hudson/hudson/jobs/axis2-transports-trunk/modules/org.apache.axis2$axis2-transport-udp/builds/2010-10-31_13-17-30/archive/org.apache.axis2/axis2-transport-udp/1.1.0-SNAPSHOT/axis2-transport-udp-1.1.0-SNAPSHOT-sources.jar
[INFO] ------------------------------------------------------------------------
[INFO] Building Apache Axis2 - Transport - XMPP
[INFO]    task-segment: [clean, install]
[INFO] ------------------------------------------------------------------------
[INFO] [clean:clean {execution: default-clean}]
[INFO] Deleting file set: <https://hudson.apache.org/hudson/job/axis2-transports-trunk/ws/transports/modules/xmpp/target>
(included: [**], excluded: [])
[INFO] [remote-resources:process {execution: default}]
[INFO] [resources:resources {execution: default-resources}]
[INFO] Using 'UTF-8' encoding to copy filtered resources.
[INFO] skip non existing resourceDirectory <https://hudson.apache.org/hudson/job/axis2-transports-trunk/ws/transports/modules/xmpp/conf>
[INFO] Copying 0 resource
[INFO] Copying 3 resources
[INFO] [compiler:compile {execution: default-compile}]
[INFO] Compiling 9 source files to <https://hudson.apache.org/hudson/job/axis2-transports-trunk/ws/transports/modules/xmpp/target/classes>
[INFO] [resources:testResources {execution: default-testResources}]
[INFO] Using 'UTF-8' encoding to copy filtered resources.
[INFO] skip non existing resourceDirectory <https://hudson.apache.org/hudson/job/axis2-transports-trunk/ws/transports/modules/xmpp/src/test/resources>
[INFO] Copying 3 resources
[INFO] [compiler:testCompile {execution: default-testCompile}]
[INFO] No sources to compile
[INFO] [surefire:test {execution: default-test}]
[INFO] Surefire report directory: <https://hudson.apache.org/hudson/job/axis2-transports-trunk/ws/transports/modules/xmpp/target/surefire-reports>

-------------------------------------------------------
 T E S T S
-------------------------------------------------------
There are no tests to run.

Results :

Tests run: 0, Failures: 0, Errors: 0, Skipped: 0

[HUDSON] Recording test results[INFO] [bundle:bundle {execution: default-bundle}]

[INFO] Preparing source:jar
[WARNING] Removing: jar from forked lifecycle, to prevent recursive invocation.
[INFO] No goals needed for project - skipping
[INFO] [source:jar {execution: default}]
[INFO] Building jar: <https://hudson.apache.org/hudson/job/axis2-transports-trunk/ws/transports/modules/xmpp/target/axis2-transport-xmpp-1.1.0-SNAPSHOT-sources.jar>
[INFO] [install:install {execution: default-install}]
[INFO] Installing <https://hudson.apache.org/hudson/job/axis2-transports-trunk/ws/transports/modules/xmpp/target/axis2-transport-xmpp-1.1.0-SNAPSHOT.jar>
to /home/hudson/.m2/repository/org/apache/axis2/axis2-transport-xmpp/1.1.0-SNAPSHOT/axis2-transport-xmpp-1.1.0-SNAPSHOT.jar
[INFO] Installing <https://hudson.apache.org/hudson/job/axis2-transports-trunk/ws/transports/modules/xmpp/target/axis2-transport-xmpp-1.1.0-SNAPSHOT-sources.jar>
to /home/hudson/.m2/repository/org/apache/axis2/axis2-transport-xmpp/1.1.0-SNAPSHOT/axis2-transport-xmpp-1.1.0-SNAPSHOT-sources.jar
[INFO] [bundle:install {execution: default-install}]
[INFO] Parsing file:/home/hudson/.m2/repository/repository.xml
[Fatal Error] :-1:-1: Premature end of file.
org.xml.sax.SAXParseException: Premature end of file.
	at com.sun.org.apache.xerces.internal.parsers.DOMParser.parse(DOMParser.java:264)
	at com.sun.org.apache.xerces.internal.jaxp.DocumentBuilderImpl.parse(DocumentBuilderImpl.java:292)
	at javax.xml.parsers.DocumentBuilder.parse(DocumentBuilder.java:172)
	at org.apache.felix.obrplugin.ObrUpdate.parseFile(ObrUpdate.java:347)
	at org.apache.felix.obrplugin.ObrUpdate.parseRepositoryXml(ObrUpdate.java:324)
	at org.apache.felix.obrplugin.ObrInstall.execute(ObrInstall.java:136)
	at org.apache.maven.plugin.DefaultPluginManager.executeMojo(DefaultPluginManager.java:490)
	at hudson.maven.agent.PluginManagerInterceptor.executeMojo(PluginManagerInterceptor.java:182)
	at org.apache.maven.lifecycle.DefaultLifecycleExecutor.executeGoals(DefaultLifecycleExecutor.java:694)
	at org.apache.maven.lifecycle.DefaultLifecycleExecutor.executeGoalWithLifecycle(DefaultLifecycleExecutor.java:556)
	at org.apache.maven.lifecycle.DefaultLifecycleExecutor.executeGoal(DefaultLifecycleExecutor.java:535)
	at org.apache.maven.lifecycle.DefaultLifecycleExecutor.executeGoalAndHandleFailures(DefaultLifecycleExecutor.java:387)
	at org.apache.maven.lifecycle.DefaultLifecycleExecutor.executeTaskSegments(DefaultLifecycleExecutor.java:348)
	at org.apache.maven.lifecycle.DefaultLifecycleExecutor.execute(DefaultLifecycleExecutor.java:180)
	at org.apache.maven.lifecycle.LifecycleExecutorInterceptor.execute(LifecycleExecutorInterceptor.java:65)
	at org.apache.maven.DefaultMaven.doExecute(DefaultMaven.java:328)
	at org.apache.maven.DefaultMaven.execute(DefaultMaven.java:138)
	at org.apache.maven.cli.MavenCli.main(MavenCli.java:362)
	at sun.reflect.NativeMethodAccessorImpl.invoke0(Native Method)
	at sun.reflect.NativeMethodAccessorImpl.invoke(NativeMethodAccessorImpl.java:39)
	at sun.reflect.DelegatingMethodAccessorImpl.invoke(DelegatingMethodAccessorImpl.java:25)
	at java.lang.reflect.Method.invoke(Method.java:592)
	at org.codehaus.classworlds.Launcher.launchEnhanced(Launcher.java:315)
	at org.codehaus.classworlds.Launcher.launch(Launcher.java:255)
	at hudson.maven.agent.Main.launch(Main.java:165)
	at hudson.maven.MavenBuilder.call(MavenBuilder.java:165)
	at hudson.maven.MavenModuleSetBuild$Builder.call(MavenModuleSetBuild.java:694)
	at hudson.maven.MavenModuleSetBuild$Builder.call(MavenModuleSetBuild.java:638)
	at hudson.remoting.UserRequest.perform(UserRequest.java:114)
	at hudson.remoting.UserRequest.perform(UserRequest.java:48)
	at hudson.remoting.Request$2.run(Request.java:270)
	at java.util.concurrent.Executors$RunnableAdapter.call(Executors.java:417)
	at java.util.concurrent.FutureTask$Sync.innerRun(FutureTask.java:269)
	at java.util.concurrent.FutureTask.run(FutureTask.java:123)
	at java.util.concurrent.ThreadPoolExecutor$Worker.runTask(ThreadPoolExecutor.java:651)
	at java.util.concurrent.ThreadPoolExecutor$Worker.run(ThreadPoolExecutor.java:676)
	at java.lang.Thread.run(Thread.java:595)
[INFO] Writing OBR metadata
[WARNING] Exception while updating local OBR: null
java.lang.NullPointerException
	at org.apache.felix.obrplugin.ObrUpdate.writeRepositoryXml(ObrUpdate.java:268)
	at org.apache.felix.obrplugin.ObrInstall.execute(ObrInstall.java:144)
	at org.apache.maven.plugin.DefaultPluginManager.executeMojo(DefaultPluginManager.java:490)
	at hudson.maven.agent.PluginManagerInterceptor.executeMojo(PluginManagerInterceptor.java:182)
	at org.apache.maven.lifecycle.DefaultLifecycleExecutor.executeGoals(DefaultLifecycleExecutor.java:694)
	at org.apache.maven.lifecycle.DefaultLifecycleExecutor.executeGoalWithLifecycle(DefaultLifecycleExecutor.java:556)
	at org.apache.maven.lifecycle.DefaultLifecycleExecutor.executeGoal(DefaultLifecycleExecutor.java:535)
	at org.apache.maven.lifecycle.DefaultLifecycleExecutor.executeGoalAndHandleFailures(DefaultLifecycleExecutor.java:387)
	at org.apache.maven.lifecycle.DefaultLifecycleExecutor.executeTaskSegments(DefaultLifecycleExecutor.java:348)
	at org.apache.maven.lifecycle.DefaultLifecycleExecutor.execute(DefaultLifecycleExecutor.java:180)
	at org.apache.maven.lifecycle.LifecycleExecutorInterceptor.execute(LifecycleExecutorInterceptor.java:65)
	at org.apache.maven.DefaultMaven.doExecute(DefaultMaven.java:328)
	at org.apache.maven.DefaultMaven.execute(DefaultMaven.java:138)
	at org.apache.maven.cli.MavenCli.main(MavenCli.java:362)
	at sun.reflect.NativeMethodAccessorImpl.invoke0(Native Method)
	at sun.reflect.NativeMethodAccessorImpl.invoke(NativeMethodAccessorImpl.java:39)
	at sun.reflect.DelegatingMethodAccessorImpl.invoke(DelegatingMethodAccessorImpl.java:25)
	at java.lang.reflect.Method.invoke(Method.java:592)
	at org.codehaus.classworlds.Launcher.launchEnhanced(Launcher.java:315)
	at org.codehaus.classworlds.Launcher.launch(Launcher.java:255)
	at hudson.maven.agent.Main.launch(Main.java:165)
	at hudson.maven.MavenBuilder.call(MavenBuilder.java:165)
	at hudson.maven.MavenModuleSetBuild$Builder.call(MavenModuleSetBuild.java:694)
	at hudson.maven.MavenModuleSetBuild$Builder.call(MavenModuleSetBuild.java:638)
	at hudson.remoting.UserRequest.perform(UserRequest.java:114)
	at hudson.remoting.UserRequest.perform(UserRequest.java:48)
	at hudson.remoting.Request$2.run(Request.java:270)
	at java.util.concurrent.Executors$RunnableAdapter.call(Executors.java:417)
	at java.util.concurrent.FutureTask$Sync.innerRun(FutureTask.java:269)
	at java.util.concurrent.FutureTask.run(FutureTask.java:123)
	at java.util.concurrent.ThreadPoolExecutor$Worker.runTask(ThreadPoolExecutor.java:651)
	at java.util.concurrent.ThreadPoolExecutor$Worker.run(ThreadPoolExecutor.java:676)
	at java.lang.Thread.run(Thread.java:595)
[HUDSON] Archiving <https://hudson.apache.org/hudson/job/axis2-transports-trunk/ws/transports/modules/xmpp/pom.xml>
to /home/hudson/hudson/jobs/axis2-transports-trunk/modules/org.apache.axis2$axis2-transport-xmpp/builds/2010-10-31_13-17-30/archive/org.apache.axis2/axis2-transport-xmpp/1.1.0-SNAPSHOT/pom.xml
[HUDSON] Archiving <https://hudson.apache.org/hudson/job/axis2-transports-trunk/ws/transports/modules/xmpp/target/axis2-transport-xmpp-1.1.0-SNAPSHOT.jar>
to /home/hudson/hudson/jobs/axis2-transports-trunk/modules/org.apache.axis2$axis2-transport-xmpp/builds/2010-10-31_13-17-30/archive/org.apache.axis2/axis2-transport-xmpp/1.1.0-SNAPSHOT/axis2-transport-xmpp-1.1.0-SNAPSHOT.jar
[HUDSON] Archiving <https://hudson.apache.org/hudson/job/axis2-transports-trunk/ws/transports/modules/xmpp/target/axis2-transport-xmpp-1.1.0-SNAPSHOT-sources.jar>
to /home/hudson/hudson/jobs/axis2-transports-trunk/modules/org.apache.axis2$axis2-transport-xmpp/builds/2010-10-31_13-17-30/archive/org.apache.axis2/axis2-transport-xmpp/1.1.0-SNAPSHOT/axis2-transport-xmpp-1.1.0-SNAPSHOT-sources.jar
[INFO] ------------------------------------------------------------------------
[INFO] Building Apache Axis2 - Transport - Mail
[INFO]    task-segment: [clean, install]
[INFO] ------------------------------------------------------------------------
[INFO] [clean:clean {execution: default-clean}]
[INFO] Deleting file set: <https://hudson.apache.org/hudson/job/axis2-transports-trunk/ws/transports/modules/mail/target>
(included: [**], excluded: [])
[INFO] [remote-resources:process {execution: default}]
[HUDSON] Archiving <https://hudson.apache.org/hudson/job/axis2-transports-trunk/ws/transports/modules/mail/pom.xml>
to /home/hudson/hudson/jobs/axis2-transports-trunk/modules/org.apache.axis2$axis2-transport-mail/builds/2010-10-31_13-17-30/archive/org.apache.axis2/axis2-transport-mail/1.1.0-SNAPSHOT/pom.xml
[INFO] ------------------------------------------------------------------------
[ERROR] BUILD ERROR
[INFO] ------------------------------------------------------------------------
[INFO] Failed to resolve artifact.

Unable to read local copy of metadata: Cannot read metadata from '/home/hudson/.m2/repository/org/apache/ws/commons/axiom/axiom-api/1.2.10-SNAPSHOT/maven-metadata-java.net.xml':
end tag name </body> must match start tag name <hr> from line 7 (position: TEXT
seen ...</address>\n</body>... @9:8) 
  org.apache.ws.commons.axiom:axiom-api:jar:1.2.10-SNAPSHOT


Path to dependency: 
	1) org.apache.axis2:axis2-transport-mail:bundle:1.1.0-SNAPSHOT
	2) org.apache.axis2:axis2-kernel:jar:SNAPSHOT
	3) org.apache.ws.commons.axiom:axiom-api:jar:1.2.10-SNAPSHOT



[INFO] ------------------------------------------------------------------------
[INFO] For more information, run Maven with the -e switch
[INFO] ------------------------------------------------------------------------
[INFO] Total time: 1 minute 24 seconds
[INFO] Finished at: Sun Oct 31 13:19:04 UTC 2010
[INFO] Final Memory: 52M/202M
[INFO] ------------------------------------------------------------------------
Sending e-mails to: java-dev@axis.apache.org andreas.veithen@gmail.com
channel stopped
[locks-and-latches] Releasing all the locks
[locks-and-latches] All the locks released


---------------------------------------------------------------------
To unsubscribe, e-mail: java-dev-unsubscribe@axis.apache.org
For additional commands, e-mail: java-dev-help@axis.apache.org


Mime
View raw message