axis-java-dev mailing list archives

Site index · List index
Message view « Date » · « Thread »
Top « Date » · « Thread »
From Apache Hudson Server <hud...@hudson.apache.org>
Subject Build failed in Hudson: Axis2-trunk-java-1.6 #153
Date Mon, 06 Sep 2010 00:30:54 GMT
See <https://hudson.apache.org/hudson/job/Axis2-trunk-java-1.6/153/>

------------------------------------------
[...truncated 3410 lines...]
      [jar] Building jar: <https://hudson.apache.org/hudson/job/Axis2-trunk-java-1.6/ws/axis2/modules/integration/target/Repository/services/SOAP12TestServiceB.jar>
   [delete] Deleting directory <https://hudson.apache.org/hudson/job/Axis2-trunk-java-1.6/ws/axis2/modules/integration/test-resources/SOAP12Testing/SOAP12TestServiceB/build>

init:
     [echo] the files are up to date = ${jars.uptodate}

compile:
    [mkdir] Created dir: <https://hudson.apache.org/hudson/job/Axis2-trunk-java-1.6/ws/axis2/modules/integration/test-resources/SOAP12Testing/SOAP12TestServiceC/build/classes>
    [mkdir] Created dir: <https://hudson.apache.org/hudson/job/Axis2-trunk-java-1.6/ws/axis2/modules/integration/test-resources/SOAP12Testing/SOAP12TestServiceC/build/lib>
    [javac] Compiling 1 source file to <https://hudson.apache.org/hudson/job/Axis2-trunk-java-1.6/ws/axis2/modules/integration/test-resources/SOAP12Testing/SOAP12TestServiceC/build/classes>

jar:
     [copy] Copying 1 file to <https://hudson.apache.org/hudson/job/Axis2-trunk-java-1.6/ws/axis2/modules/integration/test-resources/SOAP12Testing/SOAP12TestServiceC/build/classes/META-INF>
      [jar] Building jar: <https://hudson.apache.org/hudson/job/Axis2-trunk-java-1.6/ws/axis2/modules/integration/target/Repository/services/SOAP12TestServiceC.jar>
   [delete] Deleting directory <https://hudson.apache.org/hudson/job/Axis2-trunk-java-1.6/ws/axis2/modules/integration/test-resources/SOAP12Testing/SOAP12TestServiceC/build>
[INFO] Executed tasks
[INFO] [resources:testResources {execution: default-testResources}]
[INFO] Using 'UTF-8' encoding to copy filtered resources.
[INFO] Copying 3 resources
[INFO] Copying 412 resources
[INFO] Copying 3 resources
[INFO] [build-helper:add-test-source {execution: add-test-source}]
[INFO] Test Source directory: <https://hudson.apache.org/hudson/job/Axis2-trunk-java-1.6/ws/axis2/modules/integration/target/wsdl/complexdatatype/src>
added.
[INFO] Test Source directory: <https://hudson.apache.org/hudson/job/Axis2-trunk-java-1.6/ws/axis2/modules/integration/target/wsdl/complexdatatypebare/src>
added.
[INFO] Test Source directory: <https://hudson.apache.org/hudson/job/Axis2-trunk-java-1.6/ws/axis2/modules/integration/target/xmlbeans/java>
added.
[INFO] [compiler:testCompile {execution: default-testCompile}]
[INFO] Compiling 519 source files to <https://hudson.apache.org/hudson/job/Axis2-trunk-java-1.6/ws/axis2/modules/integration/target/test-classes>
[INFO] [antrun:run {execution: build-repo}]
[INFO] Executing tasks
     [echo] ${test.skip}
Overriding previous definition of reference to maven.dependency.classpath

build-repos:
    [mkdir] Created dir: <https://hudson.apache.org/hudson/job/Axis2-trunk-java-1.6/ws/axis2/modules/integration/target/toWar/services>
    [mkdir] Created dir: <https://hudson.apache.org/hudson/job/Axis2-trunk-java-1.6/ws/axis2/modules/integration/target/test-resources/MessageContextInjectionRepo>
    [mkdir] Created dir: <https://hudson.apache.org/hudson/job/Axis2-trunk-java-1.6/ws/axis2/modules/integration/target/test-resources/spring>
     [copy] Copying 1 file to <https://hudson.apache.org/hudson/job/Axis2-trunk-java-1.6/ws/axis2/modules/integration/target/test-classes/spring>
    [mkdir] Created dir: <https://hudson.apache.org/hudson/job/Axis2-trunk-java-1.6/ws/axis2/modules/integration/target/test-resources/deployment>
     [copy] Copying 1 file to <https://hudson.apache.org/hudson/job/Axis2-trunk-java-1.6/ws/axis2/modules/integration/target/test-resources/deployment>

build-jaxrs-services:

init:
     [echo] the files are up to date =${jars.uptodate}

compile:
    [mkdir] Created dir: <https://hudson.apache.org/hudson/job/Axis2-trunk-java-1.6/ws/axis2/modules/integration/test-resources/jaxrs/archiveTestModule/build/classes>
    [javac] Compiling 1 source file to <https://hudson.apache.org/hudson/job/Axis2-trunk-java-1.6/ws/axis2/modules/integration/test-resources/jaxrs/archiveTestModule/build/classes>

jar:
     [copy] Copying 1 file to <https://hudson.apache.org/hudson/job/Axis2-trunk-java-1.6/ws/axis2/modules/integration/test-resources/jaxrs/archiveTestModule/build/classes/META-INF>
    [mkdir] Created dir: <https://hudson.apache.org/hudson/job/Axis2-trunk-java-1.6/ws/axis2/modules/integration/target/test-resources/jaxrs-repository/services>
      [jar] Building jar: <https://hudson.apache.org/hudson/job/Axis2-trunk-java-1.6/ws/axis2/modules/integration/target/test-resources/jaxrs-repository/services/jaxrsService.jar>
   [delete] Deleting directory <https://hudson.apache.org/hudson/job/Axis2-trunk-java-1.6/ws/axis2/modules/integration/test-resources/jaxrs/archiveTestModule/build>

init:
     [echo] the files are up to date = ${pojo.uptodate}

compile:
    [mkdir] Created dir: <https://hudson.apache.org/hudson/job/Axis2-trunk-java-1.6/ws/axis2/modules/integration/target/test-resources/jaxrs-repository/pojo>
    [javac] Compiling 1 source file to <https://hudson.apache.org/hudson/job/Axis2-trunk-java-1.6/ws/axis2/modules/integration/target/test-resources/jaxrs-repository/pojo>
[INFO] Executed tasks
[INFO] [surefire:test {execution: default-test}]
[INFO] Surefire report directory: <https://hudson.apache.org/hudson/job/Axis2-trunk-java-1.6/ws/axis2/modules/integration/target/surefire-reports>

-------------------------------------------------------
 T E S T S
-------------------------------------------------------
Running org.apache.axis2.async.AsyncServiceWithTransportFailureTest
Running org.apache.axis2.engine.ThreadingTest
Running org.apache.axis2.engine.EchoRawXMLOnTwoChannelsSyncTest
Running org.apache.axis2.transport.http.TransportHeadersTest
Tests run: 3, Failures: 0, Errors: 0, Skipped: 0, Time elapsed: 0.025 sec
Running org.apache.axis2.rpc.AddressServiceTest
Tests run: 4, Failures: 0, Errors: 0, Skipped: 0, Time elapsed: 0.441 sec
Running org.apache.axis2.om.OMAttributeTest
Tests run: 1, Failures: 0, Errors: 0, Skipped: 0, Time elapsed: 0.335 sec
Running org.apache.axis2.engine.HandlerFailureTest
Tests run: 1, Failures: 0, Errors: 0, Skipped: 0, Time elapsed: 0.321 sec
Running org.apache.axis2.mtom.EchoRawMTOMFileCacheLoadTest
Running org.tempuri.BaseDataTypesTest
Tests run: 1, Failures: 0, Errors: 0, Skipped: 0, Time elapsed: 1.246 sec
Running org.apache.axis2.engine.EchoRawXMLTest
Running org.apache.axis2.deployment.TargetResolverServiceTest
Tests run: 1, Failures: 0, Errors: 0, Skipped: 0, Time elapsed: 0.325 sec
Running org.apache.axis2.mtom.EchoRawMTOMStreamingTest
Running org.apache.axis2.engine.OneWayRawXMLTest
Running org.apache.axis2.mtom.EchoRawMTOMFileCacheTest
Running org.apache.axis2.engine.MultipleInvocationTest
Running org.apache.axis2.faults.FaultSerializationTest
Tests run: 2, Failures: 0, Errors: 0, Skipped: 0, Time elapsed: 0.231 sec
Running org.apache.axis2.async.AsyncService2Test
Running org.apache.axis2.engine.ObjectSave2Test
Tests run: 5, Failures: 0, Errors: 0, Skipped: 0, Time elapsed: 0.045 sec
Running org.apache.axis2.engine.EchoRawXMLChunkedTest
Running org.apache.axis2.engine.WSDLClientTest
Running org.apache.axis2.engine.ModuleEnagementTest
Tests run: 1, Failures: 0, Errors: 0, Skipped: 0, Time elapsed: 0.216 sec
Running org.apache.axis2.swa.EchoRawSwAFileCacheTest
Running org.apache.axis2.engine.ObjectSaveTest
Tests run: 5, Failures: 0, Errors: 0, Skipped: 0, Time elapsed: 0.048 sec
Running org.apache.axis2.rpc.RPCCallTest
Tests run: 22, Failures: 0, Errors: 0, Skipped: 0, Time elapsed: 1.194 sec
Running org.apache.axis2.generics.GenericServiceTest
Tests run: 3, Failures: 0, Errors: 0, Skipped: 0, Time elapsed: 0.395 sec
Running org.apache.axis2.engine.MessageContextSaveBTest
Tests run: 1, Failures: 0, Errors: 0, Skipped: 0, Time elapsed: 0.17 sec
Running org.apache.axis2.deployment.TransportDeploymentTest
Tests run: 1, Failures: 0, Errors: 0, Skipped: 0, Time elapsed: 0.144 sec
Running org.apache.axis2.engine.ServiceDispatchingTest
Tests run: 3, Failures: 0, Errors: 0, Skipped: 0, Time elapsed: 0.363 sec
Running org.apache.axis2.engine.CallUnregisteredServiceTest
Tests run: 1, Failures: 0, Errors: 0, Skipped: 0, Time elapsed: 0.328 sec
Running org.apache.axis2.deployment.LifecycleTest
Tests run: 1, Failures: 0, Errors: 0, Skipped: 0, Time elapsed: 0.232 sec
Running org.apache.axis2.engine.ServiceCreateTest
Running org.apache.axis2.addressing.AddressingSubmissionServiceTest
Running org.apache.axis2.engine.EngineWithoutPhaseResolvingTest
Tests run: 1, Failures: 0, Errors: 0, Skipped: 0, Time elapsed: 0.026 sec
Running org.apache.axis2.engine.SOAPversionTest
Tests run: 2, Failures: 0, Errors: 0, Skipped: 0, Time elapsed: 0.334 sec
Running org.apache.axis2.engine.MessageWithServerTest
Running org.apache.axis2.engine.HandlerExecutionTest
Tests run: 9, Failures: 0, Errors: 0, Skipped: 0, Time elapsed: 0.557 sec
Running org.apache.axis2.engine.ServiceClientTest
Running org.apache.axis2.faults.SendingResponseFaultTest
Tests run: 1, Failures: 0, Errors: 0, Skipped: 0, Time elapsed: 0.303 sec
Running org.apache.axis2.deployment.WSDL11ToAxisServiceBuilderTest
Tests run: 5, Failures: 0, Errors: 0, Skipped: 0, Time elapsed: 0.833 sec
Running org.apache.axis2.mtom.EchoRawMTOMTest
Running org.apache.axis2.spring.SpringServiceTest
Running org.apache.axis2.engine.MessageContextSaveATest
Tests run: 4, Failures: 0, Errors: 0, Skipped: 0, Time elapsed: 0.205 sec
Running org.apache.axis2.engine.MessageContextChangeTest
Tests run: 1, Failures: 0, Errors: 0, Skipped: 0, Time elapsed: 0.024 sec
Running org.apache.axis2.engine.CharactersetEncodingTest
Running org.apache.axis2.engine.OptionsSaveTest
Tests run: 1, Failures: 0, Errors: 0, Skipped: 0, Time elapsed: 0.145 sec
Running org.apache.axis2.engine.PausingHandlerExecutionTest
Running org.apache.axis2.jaxrs.PojoTest
Running org.apache.axis2.engine.MessageContextSaveCTest
Tests run: 2, Failures: 0, Errors: 0, Skipped: 0, Time elapsed: 0.182 sec
Running org.apache.axis2.addressing.MultiHopRedirectServiceTest
Running org.apache.axis2.mtom.EchoRawMTOMLoadTest
Running org.apache.axis2.engine.MessageContextSelfManagedDataTest
Tests run: 10, Failures: 0, Errors: 0, Skipped: 0, Time elapsed: 0.313 sec
Running org.apache.axis2.swa.EchoRawSwATest
Running org.apache.axis2.engine.UsingTransportTest
Tests run: 2, Failures: 0, Errors: 0, Skipped: 0, Time elapsed: 0.342 sec
Running org.apache.axis2.builder.UnknownContentBuilderTest
Tests run: 2, Failures: 0, Errors: 0, Skipped: 0, Time elapsed: 0.187 sec
Running org.apache.axis2.processingModel.SoapProcessingModelTest
Tests run: 1, Failures: 0, Errors: 0, Skipped: 0, Time elapsed: 0.331 sec
Running org.apache.axis2.engine.MessageSaveAndRestoreTest
Running org.apache.axis2.engine.ServiceFaultTest
Running org.apache.axis2.engine.FaultHandlingTest
Running org.apache.axis2.engine.EchoRawRuntimeProxyTest
Running org.apache.axis2.engine.OperationContextSaveTest
Tests run: 1, Failures: 0, Errors: 0, Skipped: 0, Time elapsed: 0.151 sec
Running org.apache.axis2.engine.MessageContextTest
Tests run: 1, Failures: 0, Errors: 0, Skipped: 0, Time elapsed: 0.021 sec
Running org.apache.axis2.engine.ThirdPartyResponseRawXMLTest
Running org.apache.axis2.mtom.EchoRawMTOMToBase64Test
Running org.apache.axis2.engine.EchoRawXMLMultipleASyncTest
Running org.apache.axis2.mtom.MessageSaveAndRestoreWithMTOMTest
Running org.apache.axis2.codegen.InvalidFaultWsdlTest
Tests run: 1, Failures: 0, Errors: 0, Skipped: 0, Time elapsed: 0.21 sec
Running org.apache.axis2.engine.EchoRawXMLOnTwoChannelsTest
Running org.apache.axis2.transport.http.NonProxyHostTest
Tests run: 1, Failures: 0, Errors: 0, Skipped: 0, Time elapsed: 0.024 sec
Running org.apache.axis2.rpc.MultirefTest
Tests run: 9, Failures: 0, Errors: 0, Skipped: 0, Time elapsed: 0.779 sec
Running org.apache.axis2.rpc.complex.ComplexDataTypesComplexDataTypesSOAP11Test
Running org.apache.axis2.addressing.AddressingFinalServiceTest
Running org.apache.axis2.engine.EnginePausingTest
Tests run: 2, Failures: 0, Errors: 0, Skipped: 0, Time elapsed: 0.066 sec
Running org.apache.axis2.async.AsyncServiceTest
Running org.apache.axis2.jaxrs.ArchiveDeploymentTest
Running org.apache.axis2.engine.EchoRawXMLMultipleSyncTest
Running org.apache.axis2.mtom.EchoRawMTOMCommonsChunkingTest
Running org.apache.axis2.mtom.EchoRawMTOMFaultReportTest
Running org.apache.axis2.engine.CommonsHTTPEchoRawXMLTest
Running org.apache.axis2.generics.GenericWSDLGenerationTest
Tests run: 1, Failures: 0, Errors: 0, Skipped: 0, Time elapsed: 0.782 sec

Results :

Tests run: 241, Failures: 0, Errors: 0, Skipped: 0

[HUDSON] Recording test results
FATAL: Failed to save the JUnit test result
hudson.util.IOException2: Failed to create a temporary file in /home/hudson/hudson/jobs/Axis2-trunk-java-1.6/modules/org.apache.axis2$axis2-integration/builds/2010-09-06_00-02-18
	at hudson.util.AtomicFileWriter.<init>(AtomicFileWriter.java:67)
	at hudson.util.AtomicFileWriter.<init>(AtomicFileWriter.java:54)
	at hudson.XmlFile.write(XmlFile.java:162)
	at hudson.tasks.junit.TestResultAction.setResult(TestResultAction.java:82)
	at hudson.tasks.junit.TestResultAction.<init>(TestResultAction.java:67)
	at hudson.maven.reporters.SurefireReport.<init>(SurefireReport.java:45)
	at hudson.maven.reporters.SurefireArchiver$1.call(SurefireArchiver.java:114)
	at hudson.maven.reporters.SurefireArchiver$1.call(SurefireArchiver.java:110)
	at hudson.maven.MavenBuild$ProxyImpl.execute(MavenBuild.java:341)
	at sun.reflect.GeneratedMethodAccessor322.invoke(Unknown Source)
	at sun.reflect.DelegatingMethodAccessorImpl.invoke(DelegatingMethodAccessorImpl.java:25)
	at java.lang.reflect.Method.invoke(Method.java:597)
	at hudson.model.Executor$1.call(Executor.java:380)
	at hudson.util.InterceptingProxy$1.invoke(InterceptingProxy.java:23)
	at $Proxy23.execute(Unknown Source)
	at sun.reflect.GeneratedMethodAccessor383.invoke(Unknown Source)
	at sun.reflect.DelegatingMethodAccessorImpl.invoke(DelegatingMethodAccessorImpl.java:25)
	at java.lang.reflect.Method.invoke(Method.java:597)
	at hudson.remoting.RemoteInvocationHandler$RPCRequest.perform(RemoteInvocationHandler.java:274)
	at hudson.remoting.RemoteInvocationHandler$RPCRequest.call(RemoteInvocationHandler.java:255)
	at hudson.remoting.RemoteInvocationHandler$RPCRequest.call(RemoteInvocationHandler.java:215)
	at hudson.remoting.UserRequest.perform(UserRequest.java:114)
	at hudson.remoting.UserRequest.perform(UserRequest.java:48)
	at hudson.remoting.Request$2.run(Request.java:270)
	at java.util.concurrent.Executors$RunnableAdapter.call(Executors.java:441)
	at java.util.concurrent.FutureTask$Sync.innerRun(FutureTask.java:303)
	at java.util.concurrent.FutureTask.run(FutureTask.java:138)
	at java.util.concurrent.ThreadPoolExecutor$Worker.runTask(ThreadPoolExecutor.java:886)
	at java.util.concurrent.ThreadPoolExecutor$Worker.run(ThreadPoolExecutor.java:908)
	at java.lang.Thread.run(Thread.java:619)
Caused by: java.io.IOException: Too many open files
	at java.io.UnixFileSystem.createFileExclusively(Native Method)
	at java.io.File.checkAndCreate(File.java:1704)
	at java.io.File.createTempFile(File.java:1792)
	at hudson.util.AtomicFileWriter.<init>(AtomicFileWriter.java:65)
	... 29 more
[INFO] [jar:jar {execution: default-jar}]
[INFO] Building jar: <https://hudson.apache.org/hudson/job/Axis2-trunk-java-1.6/ws/axis2/modules/integration/target/axis2-integration-SNAPSHOT.jar>
[INFO] [install:install {execution: default-install}]
[INFO] Installing <https://hudson.apache.org/hudson/job/Axis2-trunk-java-1.6/ws/axis2/modules/integration/target/axis2-integration-SNAPSHOT.jar>
to /home/hudson/.m2/repository/org/apache/axis2/axis2-integration/SNAPSHOT/axis2-integration-SNAPSHOT.jar
[HUDSON] Archiving <https://hudson.apache.org/hudson/job/Axis2-trunk-java-1.6/ws/axis2/modules/integration/pom.xml>
to /home/hudson/hudson/jobs/Axis2-trunk-java-1.6/modules/org.apache.axis2$axis2-integration/builds/2010-09-06_00-02-18/archive/org.apache.axis2/axis2-integration/SNAPSHOT/pom.xml
[HUDSON] Archiving <https://hudson.apache.org/hudson/job/Axis2-trunk-java-1.6/ws/axis2/modules/integration/pom.xml>
to /home/hudson/hudson/jobs/Axis2-trunk-java-1.6/modules/org.apache.axis2$axis2-integration/builds/2010-09-06_00-02-18/archive/org.apache.axis2/axis2-integration/SNAPSHOT/pom.xml
[INFO] ------------------------------------------------------------------------
[ERROR] BUILD FAILURE
[INFO] ------------------------------------------------------------------------
[INFO] Failed to copy <https://hudson.apache.org/hudson/job/Axis2-trunk-java-1.6/ws/axis2/modules/integration/pom.xml>
to /home/hudson/hudson/jobs/Axis2-trunk-java-1.6/modules/org.apache.axis2$axis2-integration/builds/2010-09-06_00-02-18/archive/org.apache.axis2/axis2-integration/SNAPSHOT/pom.xml
/home/hudson/hudson/jobs/Axis2-trunk-java-1.6/modules/org.apache.axis2$axis2-integration/builds/2010-09-06_00-02-18/archive/org.apache.axis2/axis2-integration/SNAPSHOT/pom.xml
(Too many open files)
[INFO] ------------------------------------------------------------------------
[INFO] For more information, run Maven with the -e switch
[INFO] ------------------------------------------------------------------------
[INFO] Total time: 28 minutes 28 seconds
[INFO] Finished at: Mon Sep 06 00:30:53 UTC 2010
[INFO] Final Memory: 111M/557M
[INFO] ------------------------------------------------------------------------
channel stopped
[locks-and-latches] Releasing all the locks
[locks-and-latches] All the locks released


---------------------------------------------------------------------
To unsubscribe, e-mail: java-dev-unsubscribe@axis.apache.org
For additional commands, e-mail: java-dev-help@axis.apache.org


Mime
View raw message