axis-java-dev mailing list archives

Site index · List index
Message view « Date » · « Thread »
Top « Date » · « Thread »
From Apache Hudson Server <hud...@hudson.zones.apache.org>
Subject Build failed in Hudson: Axis2 #275
Date Wed, 14 Jul 2010 20:15:00 GMT
See <http://hudson.zones.apache.org/hudson/job/Axis2/275/>

------------------------------------------
Started by upstream project "neethi-trunk" build number 4
Building remotely on vesta.apache.org (Ubuntu)
Updating http://svn.apache.org/repos/asf/axis/axis2/java/core/trunk
At revision 964169
no change for http://svn.apache.org/repos/asf/axis/axis2/java/core/trunk since the previous
build
[locks-and-latches] Checking to see if we really have the locks
[locks-and-latches] Have all the locks, build can start
Parsing POMs
[locks-and-latches] Releasing all the locks
[locks-and-latches] All the locks released
ERROR: Failed to parse POMs
hudson.util.IOException2: remote file operation failed: <http://hudson.zones.apache.org/hudson/job/Axis2/ws/axis2>
at hudson.remoting.Channel@19c4770:vesta.apache.org (Ubuntu)
	at hudson.FilePath.act(FilePath.java:749)
	at hudson.FilePath.act(FilePath.java:735)
	at hudson.maven.MavenModuleSetBuild$RunnerImpl.parsePoms(MavenModuleSetBuild.java:534)
	at hudson.maven.MavenModuleSetBuild$RunnerImpl.doRun(MavenModuleSetBuild.java:420)
	at hudson.model.AbstractBuild$AbstractRunner.run(AbstractBuild.java:416)
	at hudson.model.Run.run(Run.java:1257)
	at hudson.maven.MavenModuleSetBuild.run(MavenModuleSetBuild.java:306)
	at hudson.model.ResourceController.execute(ResourceController.java:88)
	at hudson.model.Executor.run(Executor.java:127)
Caused by: hudson.remoting.ProxyException: hudson.maven.MavenModuleSetBuild$MavenExecutionException:
hudson.maven.MavenEmbedder$1: Failed to validate POM for project org.apache.axis2:axis2-jaxws
at <http://hudson.zones.apache.org/hudson/job/Axis2/ws/axis2/modules/jaxws/pom.xml>
- [0]  For dependency Dependency {groupId=java, artifactId=tools, version=$version, type=jar}:
system-scoped dependency must specify an absolute path systemPath.

	at hudson.maven.MavenModuleSetBuild$PomParser.invoke(MavenModuleSetBuild.java:891)
	at hudson.maven.MavenModuleSetBuild$PomParser.invoke(MavenModuleSetBuild.java:794)
	at hudson.FilePath$FileCallableWrapper.call(FilePath.java:1899)
	at hudson.remoting.UserRequest.perform(UserRequest.java:114)
	at hudson.remoting.UserRequest.perform(UserRequest.java:48)
	at hudson.remoting.Request$2.run(Request.java:270)
	at java.util.concurrent.Executors$RunnableAdapter.call(Executors.java:441)
	at java.util.concurrent.FutureTask$Sync.innerRun(FutureTask.java:303)
	at java.util.concurrent.FutureTask.run(FutureTask.java:138)
	at java.util.concurrent.ThreadPoolExecutor$Worker.runTask(ThreadPoolExecutor.java:886)
	at java.util.concurrent.ThreadPoolExecutor$Worker.run(ThreadPoolExecutor.java:908)
	at java.lang.Thread.run(Thread.java:619)
Caused by: hudson.remoting.ProxyException: hudson.maven.MavenEmbedder$1: Failed to validate
POM for project org.apache.axis2:axis2-jaxws at <http://hudson.zones.apache.org/hudson/job/Axis2/ws/axis2/modules/jaxws/pom.xml>
- [0]  For dependency Dependency {groupId=java, artifactId=tools, version=$version, type=jar}:
system-scoped dependency must specify an absolute path systemPath.

	at hudson.maven.MavenEmbedder.readProject(MavenEmbedder.java:334)
	at hudson.maven.MavenUtil.resolveModules(MavenUtil.java:226)
	at hudson.maven.MavenModuleSetBuild$PomParser.invoke(MavenModuleSetBuild.java:873)
	... 11 more
Caused by: hudson.remoting.ProxyException: org.apache.maven.project.InvalidProjectModelException:
Failed to validate POM for project org.apache.axis2:axis2-jaxws at <http://hudson.zones.apache.org/hudson/job/Axis2/ws/axis2/modules/jaxws/pom.xml>
	at org.apache.maven.project.DefaultMavenProjectBuilder.processProjectLogic(DefaultMavenProjectBuilder.java:1108)
	at org.apache.maven.project.DefaultMavenProjectBuilder.buildInternal(DefaultMavenProjectBuilder.java:878)
	at org.apache.maven.project.DefaultMavenProjectBuilder.buildFromSourceFileInternal(DefaultMavenProjectBuilder.java:506)
	at org.apache.maven.project.DefaultMavenProjectBuilder.build(DefaultMavenProjectBuilder.java:215)
	at hudson.maven.MavenEmbedder.readProject(MavenEmbedder.java:332)
	... 13 more


---------------------------------------------------------------------
To unsubscribe, e-mail: java-dev-unsubscribe@axis.apache.org
For additional commands, e-mail: java-dev-help@axis.apache.org


Mime
View raw message